Hospital Service Area,Hospital County,Operating Certificate Number,Permanent Facility Id,Facility Name,Age Group,Zip Code - 3 digits,Gender,Race,Ethnicity,Length of Stay,Type of Admission,Patient Disposition,Discharge Year,CCS Diagnosis Code,CCS Diagnosis Description,CCS Procedure Code,CCS Procedure Description,APR DRG Code,APR DRG Description,APR MDC Code,APR MDC Description,APR Severity of Illness Code,APR Severity of Illness Description,APR Risk of Mortality,APR Medical Surgical Description,Payment Typology 1,Payment Typology 2,Payment Typology 3,Birth Weight,Abortion Edit Indicator,Emergency Department Indicator,Total Charges,Total Costs
New York City,Manhattan,7002001,001438,Bellevue Hospital Center,50 to 69,112,F,Black/African American,Not Span/Hispanic,1,Emergency,Home or Self Care,2017,251,Abdominal pain,179,CT SCAN ABDOMEN,251,Abdominal pain,06,Diseases and Disorders of the Digestive System,2,Moderate,Moderate,Medical,Medicaid,Medicaid,,,N,Y,8470.29,5461.20
New York City,Manhattan,7002001,001438,Bellevue Hospital Center,50 to 69,100,M,Other Race,Spanish/Hispanic,4,Emergency,Home or Self Care,2017,251,Abdominal pain,196,DX ULTRASOUND AB/RETRO,251,Abdominal pain,06,Diseases and Disorders of the Digestive System,2,Moderate,Minor,Medical,Medicare,Medicaid,,,N,Y,24287.13,15659.08
New York City,Manhattan,7002001,001438,Bellevue Hospital Center,70 or Older,100,F,Other Race,Spanish/Hispanic,1,Emergency,Home or Self Care,2017,251,Abdominal pain,231,OTHER THERAPEUTIC PRCS,251,Abdominal pain,06,Diseases and Disorders of the Digestive System,2,Moderate,Minor,Medical,Medicare,Blue Cross/Blue Shield,,,N,Y,9309.52,6002.29
New York City,Manhattan,7002001,001438,Bellevue Hospital Center,50 to 69,100,M,Black/African American,Not Span/Hispanic,2,Emergency,Left Against Medical Advice,2017,251,Abdominal pain,231,OTHER THERAPEUTIC PRCS,251,Abdominal pain,06,Diseases and Disorders of the Digestive System,1,Minor,Minor,Medical,Medicaid,Medicaid,,,N,Y,15052.73,9705.22
New York City,Manhattan,7002001,001438,Bellevue Hospital Center,50 to 69,117,M,White,Not Span/Hispanic,1,Emergency,Home w/ Home Health Services,2017,251,Abdominal pain,193,DX ULTRASOUND HEART,251,Abdominal pain,06,Diseases and Disorders of the Digestive System,2,Moderate,Moderate,Medical,Self-Pay,,,,N,Y,11974.25,7720.37
New York City,Manhattan,7002001,001438,Bellevue Hospital Center,30 to 49,104,F,Other Race,Spanish/Hispanic,3,Emergency,Home or Self Care,2017,251,Abdominal pain,000,NO PROC,251,Abdominal pain,06,Diseases and Disorders of the Digestive System,2,Moderate,Minor,Medical,Self-Pay,,,,N,Y,21284.76,13723.31
New York City,Manhattan,7002001,001438,Bellevue Hospital Center,18 to 29,100,M,Other Race,Not Span/Hispanic,5,Emergency,Home or Self Care,2017,251,Abdominal pain,183,ROUTINE CHEST X-RAY,251,Abdominal pain,06,Diseases and Disorders of the Digestive System,1,Minor,Minor,Medical,Medicaid,,,,N,Y,29831.67,19233.91
New York City,Manhattan,7002001,001438,Bellevue Hospital Center,50 to 69,112,F,Other Race,Spanish/Hispanic,1,Emergency,Home or Self Care,2017,251,Abdominal pain,000,NO PROC,251,Abdominal pain,06,Diseases and Disorders of the Digestive System,2,Moderate,Minor,Medical,Medicare,Medicare,,,N,Y,9771.41,6300.10
New York City,Manhattan,7002001,001438,Bellevue Hospital Center,50 to 69,112,M,White,Not Span/Hispanic,8,Emergency,Home or Self Care,2017,251,Abdominal pain,095,OT NON-OR LW GI THER PR,251,Abdominal pain,06,Diseases and Disorders of the Digestive System,2,Moderate,Minor,Medical,Self-Pay,,,,N,Y,45506.07,29339.95
New York City,Manhattan,7002001,001438,Bellevue Hospital Center,30 to 49,112,F,Other Race,Not Span/Hispanic,4,Emergency,Home or Self Care,2017,251,Abdominal pain,179,CT SCAN ABDOMEN,251,Abdominal pain,06,Diseases and Disorders of the Digestive System,1,Minor,Minor,Medical,Medicare,Medicare,Medicaid,,N,Y,24446.18,15761.63
New York City,Manhattan,7002001,001438,Bellevue Hospital Center,70 or Older,100,F,Other Race,Spanish/Hispanic,2,Emergency,Home or Self Care,2017,251,Abdominal pain,179,CT SCAN ABDOMEN,251,Abdominal pain,06,Diseases and Disorders of the Digestive System,1,Minor,Moderate,Medical,Medicare,Blue Cross/Blue Shield,,,N,Y,17353.26,11188.48
New York City,Manhattan,7002001,001438,Bellevue Hospital Center,30 to 49,113,M,Black/African American,Not Span/Hispanic,1,Emergency,Home or Self Care,2017,251,Abdominal pain,000,NO PROC,251,Abdominal pain,06,Diseases and Disorders of the Digestive System,2,Moderate,Moderate,Medical,Medicaid,,,,N,Y,7253.97,4676.98
New York City,Manhattan,7002001,001438,Bellevue Hospital Center,30 to 49,100,F,Black/African American,Not Span/Hispanic,1,Emergency,Home or Self Care,2017,251,Abdominal pain,000,NO PROC,251,Abdominal pain,06,Diseases and Disorders of the Digestive System,1,Minor,Minor,Medical,Medicaid,Medicaid,,,N,Y,7395.43,4768.19
New York City,Manhattan,7002001,001438,Bellevue Hospital Center,30 to 49,113,F,Other Race,Not Span/Hispanic,4,Emergency,Home or Self Care,2017,251,Abdominal pain,074,GASTRECTOMY; PART/TOTAL,251,Abdominal pain,06,Diseases and Disorders of the Digestive System,1,Minor,Minor,Medical,Medicaid,Medicaid,,,N,Y,30340.18,19561.77
New York City,Manhattan,7002001,001438,Bellevue Hospital Center,30 to 49,112,M,Other Race,Spanish/Hispanic,3,Emergency,Home or Self Care,2017,251,Abdominal pain,083,BIOPSY OF LIVER,251,Abdominal pain,06,Diseases and Disorders of the Digestive System,1,Minor,Minor,Medical,Medicaid,,,,N,Y,24935.88,16077.36
New York City,Manhattan,7002001,001438,Bellevue Hospital Center,30 to 49,100,F,White,Not Span/Hispanic,1,Emergency,Home or Self Care,2017,251,Abdominal pain,000,NO PROC,251,Abdominal pain,06,Diseases and Disorders of the Digestive System,1,Minor,Minor,Medical,Self-Pay,,,,N,Y,7289.54,4699.92
New York City,Manhattan,7002001,001438,Bellevue Hospital Center,30 to 49,112,M,Other Race,Spanish/Hispanic,2,Emergency,Home or Self Care,2017,251,Abdominal pain,000,NO PROC,251,Abdominal pain,06,Diseases and Disorders of the Digestive System,2,Moderate,Moderate,Medical,Medicaid,,,,N,Y,15835.64,10210.00
New York City,Manhattan,7002001,001438,Bellevue Hospital Center,50 to 69,112,M,Black/African American,Not Span/Hispanic,2,Emergency,Another Type Not Listed,2017,251,Abdominal pain,000,NO PROC,251,Abdominal pain,06,Diseases and Disorders of the Digestive System,1,Minor,Minor,Medical,Medicaid,Medicaid,,,N,Y,4637.83,2990.23
New York City,Manhattan,7002001,001438,Bellevue Hospital Center,30 to 49,113,M,Other Race,Spanish/Hispanic,3,Emergency,Home or Self Care,2017,251,Abdominal pain,179,CT SCAN ABDOMEN,251,Abdominal pain,06,Diseases and Disorders of the Digestive System,2,Moderate,Minor,Medical,Medicaid,,,,N,Y,20342.95,13116.08
New York City,Manhattan,7002001,001438,Bellevue Hospital Center,0 to 17,112,F,Other Race,Not Span/Hispanic,1,Emergency,Home or Self Care,2017,251,Abdominal pain,196,DX ULTRASOUND AB/RETRO,251,Abdominal pain,06,Diseases and Disorders of the Digestive System,1,Minor,Minor,Medical,Medicaid,Medicaid,,,N,Y,7557.73,4872.83
New York City,Manhattan,7002001,001438,Bellevue Hospital Center,30 to 49,113,M,Other Race,Spanish/Hispanic,2,Emergency,Home or Self Care,2017,251,Abdominal pain,222,BLOOD TRANSFUSION,251,Abdominal pain,06,Diseases and Disorders of the Digestive System,3,Major,Moderate,Medical,Medicaid,Medicaid,,,N,Y,15318.39,9876.50
New York City,Manhattan,7002001,001438,Bellevue Hospital Center,18 to 29,104,F,Black/African American,Not Span/Hispanic,4,Emergency,Home or Self Care,2017,251,Abdominal pain,000,NO PROC,251,Abdominal pain,06,Diseases and Disorders of the Digestive System,1,Minor,Minor,Medical,Self-Pay,,,,N,Y,31937.75,20591.80
New York City,Manhattan,7002001,001438,Bellevue Hospital Center,30 to 49,113,F,Other Race,Not Span/Hispanic,2,Emergency,Home or Self Care,2017,251,Abdominal pain,000,NO PROC,251,Abdominal pain,06,Diseases and Disorders of the Digestive System,1,Minor,Minor,Medical,Medicaid,,,,N,Y,15565.46,10035.80
New York City,Manhattan,7002001,001438,Bellevue Hospital Center,18 to 29,112,F,Black/African American,Not Span/Hispanic,2,Emergency,Home or Self Care,2017,251,Abdominal pain,058,HEMODIALYSIS,251,Abdominal pain,06,Diseases and Disorders of the Digestive System,2,Moderate,Minor,Medical,Medicaid,,,,N,Y,13630.16,8788.02
New York City,Manhattan,7002001,001438,Bellevue Hospital Center,30 to 49,112,F,Other Race,Spanish/Hispanic,3,Emergency,Home or Self Care,2017,251,Abdominal pain,231,OTHER THERAPEUTIC PRCS,251,Abdominal pain,06,Diseases and Disorders of the Digestive System,2,Moderate,Minor,Medical,Medicaid,Medicaid,,,N,Y,20739.02,13371.44
New York City,Manhattan,7002001,001438,Bellevue Hospital Center,18 to 29,100,F,White,Not Span/Hispanic,1,Emergency,Left Against Medical Advice,2017,251,Abdominal pain,177,COMP AXIAL TOMOGR (CT),251,Abdominal pain,06,Diseases and Disorders of the Digestive System,2,Moderate,Minor,Medical,Miscellaneous/Other,Private Health Insurance,,,N,Y,16946.03,10925.92
New York City,Manhattan,7002001,001438,Bellevue Hospital Center,18 to 29,100,M,Other Race,Not Span/Hispanic,1,Emergency,Home or Self Care,2017,251,Abdominal pain,000,NO PROC,251,Abdominal pain,06,Diseases and Disorders of the Digestive System,1,Minor,Minor,Medical,Private Health Insurance,,,,N,Y,7753.67,4999.16
New York City,Manhattan,7002001,001438,Bellevue Hospital Center,18 to 29,100,M,Other Race,Not Span/Hispanic,5,Emergency,Home or Self Care,2017,251,Abdominal pain,231,OTHER THERAPEUTIC PRCS,251,Abdominal pain,06,Diseases and Disorders of the Digestive System,3,Major,Moderate,Medical,Blue Cross/Blue Shield,Medicaid,,,N,Y,28994.49,18694.14
New York City,Manhattan,7002001,001438,Bellevue Hospital Center,50 to 69,100,M,Other Race,Not Span/Hispanic,1,Emergency,Home or Self Care,2017,251,Abdominal pain,231,OTHER THERAPEUTIC PRCS,251,Abdominal pain,06,Diseases and Disorders of the Digestive System,1,Minor,Minor,Medical,"Managed Care, Unspecified",Medicaid,,,N,Y,7070.47,4558.67
New York City,Manhattan,7002001,001438,Bellevue Hospital Center,50 to 69,113,F,Black/African American,Not Span/Hispanic,10,Emergency,Home or Self Care,2017,251,Abdominal pain,179,CT SCAN ABDOMEN,251,Abdominal pain,06,Diseases and Disorders of the Digestive System,2,Moderate,Minor,Medical,Medicaid,Medicaid,,,N,Y,54751.45,35300.89
New York City,Manhattan,7002001,001438,Bellevue Hospital Center,30 to 49,112,F,Other Race,Not Span/Hispanic,2,Emergency,Home or Self Care,2017,251,Abdominal pain,179,CT SCAN ABDOMEN,251,Abdominal pain,06,Diseases and Disorders of the Digestive System,1,Minor,Minor,Medical,Blue Cross/Blue Shield,,,,N,Y,15270.44,9845.59
New York City,Manhattan,7002001,001438,Bellevue Hospital Center,50 to 69,113,M,Black/African American,Not Span/Hispanic,5,Emergency,Home or Self Care,2017,251,Abdominal pain,231,OTHER THERAPEUTIC PRCS,251,Abdominal pain,06,Diseases and Disorders of the Digestive System,2,Moderate,Minor,Medical,Medicaid,Medicaid,,,N,N,28345.67,18275.81
New York City,Manhattan,7002001,001438,Bellevue Hospital Center,0 to 17,113,M,Other Race,Spanish/Hispanic,2,Emergency,Home or Self Care,2017,251,Abdominal pain,231,OTHER THERAPEUTIC PRCS,251,Abdominal pain,06,Diseases and Disorders of the Digestive System,2,Moderate,Minor,Medical,Medicaid,Medicaid,,,N,Y,16660.38,10741.75
New York City,Manhattan,7002001,001438,Bellevue Hospital Center,0 to 17,112,F,Black/African American,Not Span/Hispanic,1,Emergency,Home or Self Care,2017,251,Abdominal pain,196,DX ULTRASOUND AB/RETRO,251,Abdominal pain,06,Diseases and Disorders of the Digestive System,1,Minor,Minor,Medical,Medicaid,Medicaid,,,N,Y,7411.36,4778.46
New York City,Manhattan,7002001,001438,Bellevue Hospital Center,30 to 49,112,M,Other Race,Not Span/Hispanic,1,Emergency,Home or Self Care,2017,251,Abdominal pain,000,NO PROC,251,Abdominal pain,06,Diseases and Disorders of the Digestive System,2,Moderate,Moderate,Medical,Self-Pay,,,,N,Y,9612.06,6197.36
New York City,Manhattan,7002001,001438,Bellevue Hospital Center,30 to 49,100,M,White,Not Span/Hispanic,2,Emergency,Left Against Medical Advice,2017,251,Abdominal pain,231,OTHER THERAPEUTIC PRCS,251,Abdominal pain,06,Diseases and Disorders of the Digestive System,1,Minor,Minor,Medical,Private Health Insurance,Medicaid,,,N,Y,13621.16,8782.22
New York City,Manhattan,7002001,001438,Bellevue Hospital Center,30 to 49,104,F,Other Race,Spanish/Hispanic,2,Emergency,Home or Self Care,2017,251,Abdominal pain,231,OTHER THERAPEUTIC PRCS,251,Abdominal pain,06,Diseases and Disorders of the Digestive System,1,Minor,Minor,Medical,Medicaid,Medicaid,,,N,Y,15661.13,10097.48
New York City,Manhattan,7002001,001438,Bellevue Hospital Center,30 to 49,113,F,Other Race,Not Span/Hispanic,2,Emergency,Home or Self Care,2017,251,Abdominal pain,070,UP GASTRO ENDOSC/BIOPSY,251,Abdominal pain,06,Diseases and Disorders of the Digestive System,1,Minor,Minor,Medical,Self-Pay,,,,N,Y,16038.94,10341.07
New York City,Manhattan,7002001,001438,Bellevue Hospital Center,30 to 49,113,M,Other Race,Not Span/Hispanic,1,Emergency,Home or Self Care,2017,251,Abdominal pain,032,OT NON-OR THER PRC NOSE,251,Abdominal pain,06,Diseases and Disorders of the Digestive System,1,Minor,Minor,Medical,Department of Corrections,,,,N,Y,7053.54,4547.76
New York City,Manhattan,7002001,001438,Bellevue Hospital Center,30 to 49,100,M,Other Race,Spanish/Hispanic,2,Emergency,Inpatient Rehabilitation Facility,2017,251,Abdominal pain,222,BLOOD TRANSFUSION,251,Abdominal pain,06,Diseases and Disorders of the Digestive System,2,Moderate,Moderate,Medical,Medicaid,,,,N,Y,15727.89,10140.53
New York City,Manhattan,7002001,001438,Bellevue Hospital Center,50 to 69,100,M,Black/African American,Not Span/Hispanic,3,Emergency,Home or Self Care,2017,251,Abdominal pain,179,CT SCAN ABDOMEN,251,Abdominal pain,06,Diseases and Disorders of the Digestive System,3,Major,Moderate,Medical,Medicare,Blue Cross/Blue Shield,,,N,Y,21405.25,13800.99
New York City,Manhattan,7002001,001438,Bellevue Hospital Center,30 to 49,100,F,Other Race,Spanish/Hispanic,1,Emergency,Home or Self Care,2017,251,Abdominal pain,196,DX ULTRASOUND AB/RETRO,251,Abdominal pain,06,Diseases and Disorders of the Digestive System,1,Minor,Minor,Medical,Medicaid,,,,N,Y,10931.76,7048.23
New York City,Manhattan,7002001,001438,Bellevue Hospital Center,50 to 69,101,F,White,Not Span/Hispanic,2,Emergency,Home or Self Care,2017,251,Abdominal pain,203,ELECTROGR CARDIAC MONIT,251,Abdominal pain,06,Diseases and Disorders of the Digestive System,1,Minor,Minor,Medical,Medicaid,Medicaid,,,N,Y,14338.86,9244.95
New York City,Manhattan,7002001,001438,Bellevue Hospital Center,0 to 17,112,F,Other Race,Spanish/Hispanic,2,Emergency,Home or Self Care,2017,251,Abdominal pain,000,NO PROC,251,Abdominal pain,06,Diseases and Disorders of the Digestive System,1,Minor,Minor,Medical,Medicaid,Medicaid,,,N,Y,13886.26,8953.14
New York City,Manhattan,7002001,001438,Bellevue Hospital Center,0 to 17,104,M,Other Race,Spanish/Hispanic,1,Emergency,Home or Self Care,2017,251,Abdominal pain,196,DX ULTRASOUND AB/RETRO,251,Abdominal pain,06,Diseases and Disorders of the Digestive System,2,Moderate,Minor,Medical,Medicaid,,,,N,Y,7362.97,4747.26
New York City,Manhattan,7002001,001438,Bellevue Hospital Center,0 to 17,100,M,Other Race,Not Span/Hispanic,1,Emergency,Home or Self Care,2017,251,Abdominal pain,196,DX ULTRASOUND AB/RETRO,251,Abdominal pain,06,Diseases and Disorders of the Digestive System,1,Minor,Minor,Medical,Medicaid,,,,N,Y,7493.54,4831.44
New York City,Manhattan,7002001,001438,Bellevue Hospital Center,70 or Older,100,M,Other Race,Not Span/Hispanic,3,Emergency,Home or Self Care,2017,251,Abdominal pain,179,CT SCAN ABDOMEN,251,Abdominal pain,06,Diseases and Disorders of the Digestive System,3,Major,Major,Medical,Medicare,,,,N,Y,22282.49,14366.59
New York City,Manhattan,7002001,001438,Bellevue Hospital Center,50 to 69,100,M,White,Not Span/Hispanic,3,Emergency,Home or Self Care,2017,251,Abdominal pain,231,OTHER THERAPEUTIC PRCS,251,Abdominal pain,06,Diseases and Disorders of the Digestive System,2,Moderate,Minor,Medical,Medicaid,Medicaid,,,N,Y,18209.41,11740.48
New York City,Manhattan,7002001,001438,Bellevue Hospital Center,0 to 17,100,M,Black/African American,Not Span/Hispanic,2,Emergency,Home or Self Care,2017,251,Abdominal pain,196,DX ULTRASOUND AB/RETRO,251,Abdominal pain,06,Diseases and Disorders of the Digestive System,3,Major,Minor,Medical,Medicaid,Medicaid,,,N,Y,13250.65,8543.33
New York City,Manhattan,7002001,001438,Bellevue Hospital Center,30 to 49,112,M,White,Not Span/Hispanic,2,Emergency,Left Against Medical Advice,2017,251,Abdominal pain,198,MAG RESONANCE IMAGING,251,Abdominal pain,06,Diseases and Disorders of the Digestive System,2,Moderate,Minor,Medical,Self-Pay,,,,N,N,19072.14,12296.72
New York City,Manhattan,7002001,001438,Bellevue Hospital Center,30 to 49,113,M,Other Race,Spanish/Hispanic,2,Emergency,Home or Self Care,2017,251,Abdominal pain,231,OTHER THERAPEUTIC PRCS,251,Abdominal pain,06,Diseases and Disorders of the Digestive System,1,Minor,Minor,Medical,Medicaid,Medicaid,,,N,Y,13369.15,8619.73
New York City,Manhattan,7002001,001438,Bellevue Hospital Center,50 to 69,113,F,Other Race,Not Span/Hispanic,1,Emergency,Home or Self Care,2017,251,Abdominal pain,222,BLOOD TRANSFUSION,251,Abdominal pain,06,Diseases and Disorders of the Digestive System,1,Minor,Minor,Medical,Self-Pay,,,,N,Y,7188.74,4634.93
New York City,Manhattan,7002001,001438,Bellevue Hospital Center,18 to 29,112,F,Black/African American,Not Span/Hispanic,6,Emergency,Home or Self Care,2017,251,Abdominal pain,196,DX ULTRASOUND AB/RETRO,251,Abdominal pain,06,Diseases and Disorders of the Digestive System,3,Major,Major,Medical,Medicaid,,,,N,Y,41637.59,26845.75
New York City,Manhattan,7002001,001438,Bellevue Hospital Center,50 to 69,113,F,Black/African American,Not Span/Hispanic,2,Emergency,Home or Self Care,2017,251,Abdominal pain,000,NO PROC,251,Abdominal pain,06,Diseases and Disorders of the Digestive System,1,Minor,Minor,Medical,Medicare,Medicaid,,,N,Y,13297.91,8573.80
New York City,Manhattan,7002001,001438,Bellevue Hospital Center,50 to 69,112,F,Black/African American,Not Span/Hispanic,1,Emergency,Home or Self Care,2017,251,Abdominal pain,231,OTHER THERAPEUTIC PRCS,251,Abdominal pain,06,Diseases and Disorders of the Digestive System,2,Moderate,Moderate,Medical,Medicaid,Medicaid,,,N,Y,6826.61,4401.44
New York City,Manhattan,7002001,001438,Bellevue Hospital Center,70 or Older,112,F,White,Not Span/Hispanic,7,Emergency,Home or Self Care,2017,251,Abdominal pain,000,NO PROC,251,Abdominal pain,06,Diseases and Disorders of the Digestive System,2,Moderate,Minor,Medical,Medicare,Medicare,Medicaid,,N,Y,38970.10,25125.89
New York City,Manhattan,7002001,001438,Bellevue Hospital Center,50 to 69,100,M,Other Race,Not Span/Hispanic,3,Emergency,Home or Self Care,2017,251,Abdominal pain,000,NO PROC,251,Abdominal pain,06,Diseases and Disorders of the Digestive System,3,Major,Moderate,Medical,Medicare,,,,N,Y,20769.32,13390.98
New York City,Manhattan,7002001,001438,Bellevue Hospital Center,50 to 69,113,M,Other Race,Not Span/Hispanic,1,Emergency,Skilled Nursing Home,2017,251,Abdominal pain,000,NO PROC,251,Abdominal pain,06,Diseases and Disorders of the Digestive System,1,Minor,Minor,Medical,Self-Pay,,,,N,Y,7150.78,4610.45
New York City,Manhattan,7002001,001438,Bellevue Hospital Center,30 to 49,112,F,Other Race,Spanish/Hispanic,2,Emergency,Home or Self Care,2017,251,Abdominal pain,070,UP GASTRO ENDOSC/BIOPSY,251,Abdominal pain,06,Diseases and Disorders of the Digestive System,3,Major,Moderate,Medical,Medicaid,,,,N,Y,15313.36,9873.26
New York City,Manhattan,7002001,001438,Bellevue Hospital Center,70 or Older,100,M,Other Race,Spanish/Hispanic,7,Emergency,Home or Self Care,2017,251,Abdominal pain,196,DX ULTRASOUND AB/RETRO,251,Abdominal pain,06,Diseases and Disorders of the Digestive System,3,Major,Major,Medical,Medicare,Medicare,,,N,Y,43053.68,27758.77
New York City,Manhattan,7002001,001438,Bellevue Hospital Center,70 or Older,100,F,Other Race,Spanish/Hispanic,1,Emergency,Home or Self Care,2017,251,Abdominal pain,196,DX ULTRASOUND AB/RETRO,251,Abdominal pain,06,Diseases and Disorders of the Digestive System,2,Moderate,Moderate,Medical,Medicare,Blue Cross/Blue Shield,,,N,Y,9219.18,5944.05
New York City,Manhattan,7002001,001438,Bellevue Hospital Center,30 to 49,112,F,Black/African American,Not Span/Hispanic,3,Emergency,Home or Self Care,2017,251,Abdominal pain,196,DX ULTRASOUND AB/RETRO,251,Abdominal pain,06,Diseases and Disorders of the Digestive System,2,Moderate,Minor,Medical,Private Health Insurance,,,,N,Y,22037.02,14208.32
New York City,Manhattan,7002001,001438,Bellevue Hospital Center,18 to 29,112,F,Other Race,Spanish/Hispanic,1,Emergency,Left Against Medical Advice,2017,251,Abdominal pain,222,BLOOD TRANSFUSION,251,Abdominal pain,06,Diseases and Disorders of the Digestive System,2,Moderate,Minor,Medical,Medicare,,,,N,Y,6990.80,4507.30
New York City,Manhattan,7002001,001438,Bellevue Hospital Center,50 to 69,100,F,Other Race,Not Span/Hispanic,1,Emergency,Home or Self Care,2017,251,Abdominal pain,222,BLOOD TRANSFUSION,251,Abdominal pain,06,Diseases and Disorders of the Digestive System,2,Moderate,Minor,Medical,Medicaid,Medicaid,,,N,Y,12838.28,8277.46
New York City,Manhattan,7002001,001438,Bellevue Hospital Center,50 to 69,112,M,Black/African American,Not Span/Hispanic,2,Emergency,Home or Self Care,2017,251,Abdominal pain,058,HEMODIALYSIS,251,Abdominal pain,06,Diseases and Disorders of the Digestive System,3,Major,Major,Medical,Medicare,Medicare,Medicaid,,N,Y,14431.92,9304.95
New York City,Manhattan,7002001,001438,Bellevue Hospital Center,30 to 49,112,F,Other Race,Spanish/Hispanic,2,Emergency,Home or Self Care,2017,251,Abdominal pain,198,MAG RESONANCE IMAGING,251,Abdominal pain,06,Diseases and Disorders of the Digestive System,1,Minor,Minor,Medical,Medicaid,,,,N,Y,17172.42,11071.88
New York City,Manhattan,7002001,001438,Bellevue Hospital Center,30 to 49,113,F,Other Race,Not Span/Hispanic,1,Emergency,Home or Self Care,2017,251,Abdominal pain,231,OTHER THERAPEUTIC PRCS,251,Abdominal pain,06,Diseases and Disorders of the Digestive System,1,Minor,Minor,Medical,Medicaid,Medicaid,,,N,Y,9957.55,6420.11
New York City,Manhattan,7002001,001438,Bellevue Hospital Center,30 to 49,113,M,Other Race,Spanish/Hispanic,3,Emergency,Home or Self Care,2017,251,Abdominal pain,092,OTHER BOWEL DX PRCS,251,Abdominal pain,06,Diseases and Disorders of the Digestive System,1,Minor,Minor,Medical,Medicaid,,,,N,Y,20717.87,13357.81
New York City,Manhattan,7002001,001438,Bellevue Hospital Center,30 to 49,OOS,F,Black/African American,Not Span/Hispanic,1,Emergency,Left Against Medical Advice,2017,251,Abdominal pain,222,BLOOD TRANSFUSION,251,Abdominal pain,06,Diseases and Disorders of the Digestive System,1,Minor,Minor,Medical,Private Health Insurance,,,,N,Y,9065.74,5845.12
New York City,Manhattan,7002001,001438,Bellevue Hospital Center,30 to 49,112,M,Black/African American,Not Span/Hispanic,5,Emergency,Home or Self Care,2017,251,Abdominal pain,000,NO PROC,251,Abdominal pain,06,Diseases and Disorders of the Digestive System,1,Minor,Minor,Medical,Private Health Insurance,Medicaid,,,N,Y,39972.83,25772.40
New York City,Manhattan,7002001,001438,Bellevue Hospital Center,50 to 69,113,M,Other Race,Not Span/Hispanic,7,Emergency,Home or Self Care,2017,251,Abdominal pain,179,CT SCAN ABDOMEN,251,Abdominal pain,06,Diseases and Disorders of the Digestive System,2,Moderate,Minor,Medical,Medicaid,,,,N,Y,44756.92,28856.93
New York City,Manhattan,7002001,001438,Bellevue Hospital Center,50 to 69,100,M,Black/African American,Not Span/Hispanic,2,Emergency,Home or Self Care,2017,251,Abdominal pain,179,CT SCAN ABDOMEN,251,Abdominal pain,06,Diseases and Disorders of the Digestive System,1,Minor,Minor,Medical,Medicare,Medicaid,,,N,Y,14969.53,9651.57