Hospital Service Area,Hospital County,Operating Certificate Number,Permanent Facility Id,Facility Name,Age Group,Zip Code - 3 digits,Gender,Race,Ethnicity,Length of Stay,Type of Admission,Patient Disposition,Discharge Year,CCS Diagnosis Code,CCS Diagnosis Description,CCS Procedure Code,CCS Procedure Description,APR DRG Code,APR DRG Description,APR MDC Code,APR MDC Description,APR Severity of Illness Code,APR Severity of Illness Description,APR Risk of Mortality,APR Medical Surgical Description,Payment Typology 1,Payment Typology 2,Payment Typology 3,Birth Weight,Abortion Edit Indicator,Emergency Department Indicator,Total Charges,Total Costs
Capital/Adirond,Albany,0101004,000005,St. Peter's Hospital,50 to 69,122,F,Other Race,Not Span/Hispanic,5,Elective,Home or Self Care,2018,SYM006,ABDOMINAL PAIN AND OTHER DIGESTIVE/ABDOMEN SIGNS AND SYMPTOMS,,,251,ABDOMINAL PAIN,06,DISEASES AND DISORDERS OF THE DIGESTIVE SYSTEM,3,Major,Moderate,Medical,Medicare,Medicare,,,,false,29794.07,12152.3
Capital/Adirond,Schenectady,4601001,000829,Ellis Hospital,30 to 49,120,F,White,Not Span/Hispanic,1,Emergency,Home or Self Care,2018,SYM006,ABDOMINAL PAIN AND OTHER DIGESTIVE/ABDOMEN SIGNS AND SYMPTOMS,,,251,ABDOMINAL PAIN,06,DISEASES AND DISORDERS OF THE DIGESTIVE SYSTEM,1,Minor,Minor,Medical,Medicare,Medicare,,,,true,7778.15,2060.8
New York City,Manhattan,7002024,001456,Mount Sinai Hospital,70 or Older,100,F,Other Race,Unknown,8,Emergency,Home w/ Home Health Services,2018,SYM006,ABDOMINAL PAIN AND OTHER DIGESTIVE/ABDOMEN SIGNS AND SYMPTOMS,GIS001,ESOPHAGOGASTRODUODENOSCOPY (EGD) WITH BIOPSY,251,ABDOMINAL PAIN,06,DISEASES AND DISORDERS OF THE DIGESTIVE SYSTEM,2,Moderate,Moderate,Medical,Medicare,Medicare,Medicaid,,,true,106641.15,33972.15
Western NY,Erie,1401014,000207,Buffalo General Medical Center,30 to 49,147,F,White,Not Span/Hispanic,2,Emergency,Home or Self Care,2018,SYM006,ABDOMINAL PAIN AND OTHER DIGESTIVE/ABDOMEN SIGNS AND SYMPTOMS,,,251,ABDOMINAL PAIN,06,DISEASES AND DISORDERS OF THE DIGESTIVE SYSTEM,2,Moderate,Minor,Medical,Blue Cross/Blue Shield,Self-Pay,Self-Pay,,,true,8102.48,3404.75
Western NY,Erie,1401014,003067,Millard Fillmore Suburban Hospital,70 or Older,140,F,White,Not Span/Hispanic,3,Emergency,Home or Self Care,2018,SYM006,ABDOMINAL PAIN AND OTHER DIGESTIVE/ABDOMEN SIGNS AND SYMPTOMS,,,251,ABDOMINAL PAIN,06,DISEASES AND DISORDERS OF THE DIGESTIVE SYSTEM,2,Moderate,Moderate,Medical,Medicare,Medicaid,Self-Pay,,,true,15347.03,6501.84
New York City,Bronx,7000006,001168,Montefiore Medical Center-Wakefield Hospital,50 to 69,104,M,Black/African American,Not Span/Hispanic,2,Emergency,Home or Self Care,2018,SYM006,ABDOMINAL PAIN AND OTHER DIGESTIVE/ABDOMEN SIGNS AND SYMPTOMS,,,251,ABDOMINAL PAIN,06,DISEASES AND DISORDERS OF THE DIGESTIVE SYSTEM,2,Moderate,Minor,Medical,Medicare,,,,,true,21188.13,2933.85
Western NY,Erie,1401005,000210,Erie County Medical Center,30 to 49,140,M,White,Not Span/Hispanic,1,Emergency,Court/Law Enforcement,2018,SYM006,ABDOMINAL PAIN AND OTHER DIGESTIVE/ABDOMEN SIGNS AND SYMPTOMS,,,251,ABDOMINAL PAIN,06,DISEASES AND DISORDERS OF THE DIGESTIVE SYSTEM,2,Moderate,Minor,Medical,Department of Corrections,,,,,true,7309.18,2556.54
New York City,Queens,7003004,001630,Long Island Jewish Medical Center,50 to 69,115,F,White,Not Span/Hispanic,7,Emergency,Home w/ Home Health Services,2018,SYM006,ABDOMINAL PAIN AND OTHER DIGESTIVE/ABDOMEN SIGNS AND SYMPTOMS,,,251,ABDOMINAL PAIN,06,DISEASES AND DISORDERS OF THE DIGESTIVE SYSTEM,3,Major,Moderate,Medical,Private Health Insurance,Self-Pay,,,,false,76840.18,12947.45
Capital/Adirond,Albany,0101004,000005,St. Peter's Hospital,50 to 69,120,M,White,Not Span/Hispanic,15,Emergency,Home or Self Care,2018,SYM006,ABDOMINAL PAIN AND OTHER DIGESTIVE/ABDOMEN SIGNS AND SYMPTOMS,ADM021,"ADMINISTRATION OF THERAPEUTIC SUBSTANCES, NEC",251,ABDOMINAL PAIN,06,DISEASES AND DISORDERS OF THE DIGESTIVE SYSTEM,3,Major,Major,Medical,Medicare,Medicare,,,,true,62970.97,27863
Hudson Valley,Westchester,5902001,001045,White Plains Hospital Center,30 to 49,106,M,Other Race,Not Span/Hispanic,1,Emergency,Home or Self Care,2018,SYM006,ABDOMINAL PAIN AND OTHER DIGESTIVE/ABDOMEN SIGNS AND SYMPTOMS,,,251,ABDOMINAL PAIN,06,DISEASES AND DISORDERS OF THE DIGESTIVE SYSTEM,1,Minor,Minor,Medical,Blue Cross/Blue Shield,Private Health Insurance,,,,true,20306,4700.68
New York City,Bronx,7000006,003058,Montefiore Med Center - Jack D Weiler Hosp of A Einstein College Div,70 or Older,104,M,Black/African American,Not Span/Hispanic,4,Emergency,Home or Self Care,2018,SYM006,ABDOMINAL PAIN AND OTHER DIGESTIVE/ABDOMEN SIGNS AND SYMPTOMS,ADM017,ADMINISTRATION OF NUTRITIONAL AND ELECTROLYTIC SUBSTANCES,251,ABDOMINAL PAIN,06,DISEASES AND DISORDERS OF THE DIGESTIVE SYSTEM,3,Major,Major,Medical,Medicare,Medicaid,,,,true,59403.51,10395.11
Western NY,Cattaraugus,0401001,000066,Olean General Hospital,50 to 69,147,F,White,Not Span/Hispanic,5,Emergency,Home or Self Care,2018,SYM006,ABDOMINAL PAIN AND OTHER DIGESTIVE/ABDOMEN SIGNS AND SYMPTOMS,,,251,ABDOMINAL PAIN,06,DISEASES AND DISORDERS OF THE DIGESTIVE SYSTEM,3,Major,Major,Medical,Medicaid,,,,,true,12425.85,5393.31
New York City,Richmond,7004010,001738,Richmond University Medical Center,0 to 17,103,M,White,Not Span/Hispanic,2,Emergency,Home or Self Care,2018,SYM006,ABDOMINAL PAIN AND OTHER DIGESTIVE/ABDOMEN SIGNS AND SYMPTOMS,,,251,ABDOMINAL PAIN,06,DISEASES AND DISORDERS OF THE DIGESTIVE SYSTEM,1,Minor,Minor,Medical,Private Health Insurance,Self-Pay,Self-Pay,,,true,11561.97,6728.03
New York City,Richmond,7004003,001740,Staten Island University Hosp-North,70 or Older,103,F,Black/African American,Not Span/Hispanic,1,Emergency,Home or Self Care,2018,SYM006,ABDOMINAL PAIN AND OTHER DIGESTIVE/ABDOMEN SIGNS AND SYMPTOMS,ADM001,TRANSFUSION OF BLOOD AND BLOOD PRODUCTS,251,ABDOMINAL PAIN,06,DISEASES AND DISORDERS OF THE DIGESTIVE SYSTEM,1,Minor,Minor,Medical,Medicare,Medicare,,,,true,14642,3095.82
Long Island,Nassau,2908000,000511,NYU Langone Hospital-Long Island,30 to 49,115,M,Black/African American,Not Span/Hispanic,1,Emergency,Home or Self Care,2018,SYM006,ABDOMINAL PAIN AND OTHER DIGESTIVE/ABDOMEN SIGNS AND SYMPTOMS,,,251,ABDOMINAL PAIN,06,DISEASES AND DISORDERS OF THE DIGESTIVE SYSTEM,1,Minor,Minor,Medical,Medicaid,,,,,true,41733.73,5187.95
New York City,Richmond,7004003,001740,Staten Island University Hosp-North,30 to 49,103,M,White,Not Span/Hispanic,1,Emergency,Home or Self Care,2018,SYM006,ABDOMINAL PAIN AND OTHER DIGESTIVE/ABDOMEN SIGNS AND SYMPTOMS,,,251,ABDOMINAL PAIN,06,DISEASES AND DISORDERS OF THE DIGESTIVE SYSTEM,1,Minor,Minor,Medical,Blue Cross/Blue Shield,,,,,true,11947.45,2471.5
New York City,Manhattan,7002017,001450,Lenox Hill Hospital,50 to 69,111,M,White,Not Span/Hispanic,1,Emergency,Home or Self Care,2018,SYM006,ABDOMINAL PAIN AND OTHER DIGESTIVE/ABDOMEN SIGNS AND SYMPTOMS,,,251,ABDOMINAL PAIN,06,DISEASES AND DISORDERS OF THE DIGESTIVE SYSTEM,3,Major,Minor,Medical,Medicare,Private Health Insurance,,,,true,25478.39,4573.55
New York City,Bronx,7000006,001168,Montefiore Medical Center-Wakefield Hospital,50 to 69,104,M,Black/African American,Not Span/Hispanic,1,Emergency,Home or Self Care,2018,SYM006,ABDOMINAL PAIN AND OTHER DIGESTIVE/ABDOMEN SIGNS AND SYMPTOMS,,,251,ABDOMINAL PAIN,06,DISEASES AND DISORDERS OF THE DIGESTIVE SYSTEM,1,Minor,Minor,Medical,Private Health Insurance,,,,,true,27105.03,3695.15
Capital/Adirond,Albany,0101000,000001,Albany Medical Center Hospital,30 to 49,136,F,White,Not Span/Hispanic,4,Emergency,Home or Self Care,2018,SYM006,ABDOMINAL PAIN AND OTHER DIGESTIVE/ABDOMEN SIGNS AND SYMPTOMS,,,251,ABDOMINAL PAIN,06,DISEASES AND DISORDERS OF THE DIGESTIVE SYSTEM,2,Moderate,Moderate,Medical,Blue Cross/Blue Shield,Medicare,,,,true,31543.89,7657.38
New York City,Bronx,7000006,003058,Montefiore Med Center - Jack D Weiler Hosp of A Einstein College Div,50 to 69,104,F,White,Not Span/Hispanic,1,Emergency,Left Against Medical Advice,2018,SYM006,ABDOMINAL PAIN AND OTHER DIGESTIVE/ABDOMEN SIGNS AND SYMPTOMS,,,251,ABDOMINAL PAIN,06,DISEASES AND DISORDERS OF THE DIGESTIVE SYSTEM,1,Minor,Minor,Medical,Medicare,,,,,true,16409.73,2819.01
New York City,Queens,7003010,001637,New York - Presbyterian/Queens,70 or Older,111,M,White,Spanish/Hispanic,3,Emergency,Home or Self Care,2018,SYM006,ABDOMINAL PAIN AND OTHER DIGESTIVE/ABDOMEN SIGNS AND SYMPTOMS,ADM015,ADMINISTRATION OF ANTIBIOTICS,251,ABDOMINAL PAIN,06,DISEASES AND DISORDERS OF THE DIGESTIVE SYSTEM,3,Major,Major,Medical,Blue Cross/Blue Shield,Medicare,Self-Pay,,,true,35360.66,8820.24
Long Island,Suffolk,5149000,000895,John T Mather Memorial Hospital of Port Jefferson New York Inc,70 or Older,119,F,White,Not Span/Hispanic,8,Emergency,Skilled Nursing Home,2018,SYM006,ABDOMINAL PAIN AND OTHER DIGESTIVE/ABDOMEN SIGNS AND SYMPTOMS,GIS016,GI SYSTEM ENDOSCOPIC THERAPEUTIC PROCEDURES,251,ABDOMINAL PAIN,06,DISEASES AND DISORDERS OF THE DIGESTIVE SYSTEM,2,Moderate,Moderate,Medical,Medicare,Medicare,Private Health Insurance,,,true,60164.5,14724.56
Capital/Adirond,Warren,5601000,001005,Glens Falls Hospital,70 or Older,128,F,White,Not Span/Hispanic,7,Emergency,Skilled Nursing Home,2018,SYM006,ABDOMINAL PAIN AND OTHER DIGESTIVE/ABDOMEN SIGNS AND SYMPTOMS,,,251,ABDOMINAL PAIN,06,DISEASES AND DISORDERS OF THE DIGESTIVE SYSTEM,2,Moderate,Major,Medical,Medicare,Medicaid,,,,true,29339.58,12335.56
New York City,Manhattan,7002054,001464,New York-Presbyterian Hospital - Columbia Presbyterian Center,50 to 69,100,F,Other Race,Not Span/Hispanic,5,Emergency,Home or Self Care,2018,SYM006,ABDOMINAL PAIN AND OTHER DIGESTIVE/ABDOMEN SIGNS AND SYMPTOMS,,,251,ABDOMINAL PAIN,06,DISEASES AND DISORDERS OF THE DIGESTIVE SYSTEM,2,Moderate,Moderate,Medical,Private Health Insurance,Self-Pay,,,,false,61439.57,13450.91
New York City,Kings,7001016,001301,Kings County Hospital Center,50 to 69,112,F,Black/African American,Not Span/Hispanic,1,Emergency,Left Against Medical Advice,2018,SYM006,ABDOMINAL PAIN AND OTHER DIGESTIVE/ABDOMEN SIGNS AND SYMPTOMS,ADM021,"ADMINISTRATION OF THERAPEUTIC SUBSTANCES, NEC",251,ABDOMINAL PAIN,06,DISEASES AND DISORDERS OF THE DIGESTIVE SYSTEM,2,Moderate,Moderate,Medical,Private Health Insurance,,,,,true,7381.01,5243.18
New York City,Kings,7001016,001301,Kings County Hospital Center,18 to 29,112,F,Black/African American,Not Span/Hispanic,1,Emergency,Home or Self Care,2018,SYM006,ABDOMINAL PAIN AND OTHER DIGESTIVE/ABDOMEN SIGNS AND SYMPTOMS,ADM021,"ADMINISTRATION OF THERAPEUTIC SUBSTANCES, NEC",251,ABDOMINAL PAIN,06,DISEASES AND DISORDERS OF THE DIGESTIVE SYSTEM,1,Minor,Minor,Medical,Medicaid,,,,,true,8675.04,6162.41
New York City,Bronx,7000014,001176,SBH Health System,50 to 69,104,M,Black/African American,Spanish/Hispanic,1,Emergency,Home or Self Care,2018,SYM006,ABDOMINAL PAIN AND OTHER DIGESTIVE/ABDOMEN SIGNS AND SYMPTOMS,,,251,ABDOMINAL PAIN,06,DISEASES AND DISORDERS OF THE DIGESTIVE SYSTEM,2,Moderate,Moderate,Medical,Medicaid,,,,,true,10100.6,2390.03
Long Island,Nassau,2950001,000527,Mount Sinai South Nassau,50 to 69,115,F,White,Not Span/Hispanic,1,Emergency,Home or Self Care,2018,SYM006,ABDOMINAL PAIN AND OTHER DIGESTIVE/ABDOMEN SIGNS AND SYMPTOMS,,,251,ABDOMINAL PAIN,06,DISEASES AND DISORDERS OF THE DIGESTIVE SYSTEM,1,Minor,Minor,Medical,Private Health Insurance,,,,,true,21839.4,2417.61
New York City,Bronx,7000006,003058,Montefiore Med Center - Jack D Weiler Hosp of A Einstein College Div,30 to 49,104,M,Black/African American,Not Span/Hispanic,2,Emergency,Home or Self Care,2018,SYM006,ABDOMINAL PAIN AND OTHER DIGESTIVE/ABDOMEN SIGNS AND SYMPTOMS,,,251,ABDOMINAL PAIN,06,DISEASES AND DISORDERS OF THE DIGESTIVE SYSTEM,2,Moderate,Minor,Medical,Private Health Insurance,,,,,true,43847.06,7570.45
Central NY,Onondaga,3301008,000636,Crouse Hospital,50 to 69,136,M,White,Not Span/Hispanic,4,Urgent,Home or Self Care,2018,SYM006,ABDOMINAL PAIN AND OTHER DIGESTIVE/ABDOMEN SIGNS AND SYMPTOMS,GIS004,GI SYSTEM ENDOSCOPY WITHOUT BIOPSY (DIAGNOSTIC),251,ABDOMINAL PAIN,06,DISEASES AND DISORDERS OF THE DIGESTIVE SYSTEM,3,Major,Moderate,Medical,Miscellaneous/Other,Medicare,,,,false,7530.86,3484.18
Central NY,Onondaga,3301008,000636,Crouse Hospital,50 to 69,136,M,White,Not Span/Hispanic,6,Emergency,Home w/ Home Health Services,2018,SYM006,ABDOMINAL PAIN AND OTHER DIGESTIVE/ABDOMEN SIGNS AND SYMPTOMS,ADM017,ADMINISTRATION OF NUTRITIONAL AND ELECTROLYTIC SUBSTANCES,251,ABDOMINAL PAIN,06,DISEASES AND DISORDERS OF THE DIGESTIVE SYSTEM,2,Moderate,Minor,Medical,Miscellaneous/Other,Miscellaneous/Other,Medicare,,,true,12463.64,5755.64
Capital/Adirond,Albany,0101000,000001,Albany Medical Center Hospital,50 to 69,120,M,White,Not Span/Hispanic,1,Emergency,Home or Self Care,2018,SYM006,ABDOMINAL PAIN AND OTHER DIGESTIVE/ABDOMEN SIGNS AND SYMPTOMS,,,251,ABDOMINAL PAIN,06,DISEASES AND DISORDERS OF THE DIGESTIVE SYSTEM,2,Moderate,Moderate,Medical,Medicaid,,,,,true,9047.04,2284.26
Capital/Adirond,Albany,0101000,000001,Albany Medical Center Hospital,30 to 49,122,F,White,Not Span/Hispanic,3,Emergency,Home or Self Care,2018,SYM006,ABDOMINAL PAIN AND OTHER DIGESTIVE/ABDOMEN SIGNS AND SYMPTOMS,,,251,ABDOMINAL PAIN,06,DISEASES AND DISORDERS OF THE DIGESTIVE SYSTEM,2,Moderate,Minor,Medical,"Managed Care, Unspecified",,,,,true,17458.05,4964.95
Central NY,Onondaga,3301007,000635,University Hospital SUNY Health Science Center,30 to 49,,F,White,Not Span/Hispanic,1,Emergency,Home or Self Care,2018,SYM006,ABDOMINAL PAIN AND OTHER DIGESTIVE/ABDOMEN SIGNS AND SYMPTOMS,,,251,ABDOMINAL PAIN,06,DISEASES AND DISORDERS OF THE DIGESTIVE SYSTEM,1,Minor,Minor,Medical,Private Health Insurance,Medicaid,,,,true,13187.6,3760.71
Western NY,Erie,1401005,000210,Erie County Medical Center,30 to 49,140,F,Other Race,Unknown,1,Emergency,Left Against Medical Advice,2018,SYM006,ABDOMINAL PAIN AND OTHER DIGESTIVE/ABDOMEN SIGNS AND SYMPTOMS,,,251,ABDOMINAL PAIN,06,DISEASES AND DISORDERS OF THE DIGESTIVE SYSTEM,1,Minor,Minor,Medical,Medicare,,,,,true,7954.76,2785.59
New York City,Manhattan,7002054,001464,New York-Presbyterian Hospital - Columbia Presbyterian Center,0 to 17,119,M,White,Spanish/Hispanic,1,Emergency,Home or Self Care,2018,SYM006,ABDOMINAL PAIN AND OTHER DIGESTIVE/ABDOMEN SIGNS AND SYMPTOMS,OTR004,ISOLATION PROCEDURES,251,ABDOMINAL PAIN,06,DISEASES AND DISORDERS OF THE DIGESTIVE SYSTEM,3,Major,Minor,Medical,Medicaid,Medicaid,Self-Pay,,,true,26319.03,6563.43
Hudson Valley,Orange,3535001,000708,Bon Secours Community Hospital,30 to 49,127,F,White,Not Span/Hispanic,2,Emergency,Home or Self Care,2018,SYM006,ABDOMINAL PAIN AND OTHER DIGESTIVE/ABDOMEN SIGNS AND SYMPTOMS,,,251,ABDOMINAL PAIN,06,DISEASES AND DISORDERS OF THE DIGESTIVE SYSTEM,1,Minor,Minor,Medical,Medicaid,,,,,true,28623.02,3278.2
New York City,Manhattan,7002054,001464,New York-Presbyterian Hospital - Columbia Presbyterian Center,30 to 49,104,F,Multi-racial,Not Span/Hispanic,2,Emergency,Home w/ Home Health Services,2018,SYM006,ABDOMINAL PAIN AND OTHER DIGESTIVE/ABDOMEN SIGNS AND SYMPTOMS,,,251,ABDOMINAL PAIN,06,DISEASES AND DISORDERS OF THE DIGESTIVE SYSTEM,3,Major,Moderate,Medical,Medicaid,Medicaid,Self-Pay,,,false,23609.24,5104.31
New York City,Kings,7001021,001306,New York - Presbyterian Brooklyn Methodist Hospital,70 or Older,112,F,Black/African American,Not Span/Hispanic,3,Emergency,Home or Self Care,2018,SYM006,ABDOMINAL PAIN AND OTHER DIGESTIVE/ABDOMEN SIGNS AND SYMPTOMS,,,251,ABDOMINAL PAIN,06,DISEASES AND DISORDERS OF THE DIGESTIVE SYSTEM,1,Minor,Minor,Medical,Medicaid,Self-Pay,,,,true,26049.27,6044.61
New York City,Bronx,7000006,003058,Montefiore Med Center - Jack D Weiler Hosp of A Einstein College Div,50 to 69,104,M,White,Not Span/Hispanic,1,Emergency,Left Against Medical Advice,2018,SYM006,ABDOMINAL PAIN AND OTHER DIGESTIVE/ABDOMEN SIGNS AND SYMPTOMS,,,251,ABDOMINAL PAIN,06,DISEASES AND DISORDERS OF THE DIGESTIVE SYSTEM,1,Minor,Moderate,Medical,Medicare,Medicaid,,,,true,4906.15,823.96
Capital/Adirond,Albany,0101004,000005,St. Peter's Hospital,50 to 69,120,F,White,Not Span/Hispanic,2,Emergency,Home or Self Care,2018,SYM006,ABDOMINAL PAIN AND OTHER DIGESTIVE/ABDOMEN SIGNS AND SYMPTOMS,ESA001,HEMODIALYSIS,251,ABDOMINAL PAIN,06,DISEASES AND DISORDERS OF THE DIGESTIVE SYSTEM,3,Major,Major,Medical,Blue Cross/Blue Shield,Medicare,,,,true,23098.15,6262.34
Long Island,Nassau,2908000,000511,NYU Langone Hospital-Long Island,30 to 49,115,M,Black/African American,Not Span/Hispanic,1,Emergency,Home or Self Care,2018,SYM006,ABDOMINAL PAIN AND OTHER DIGESTIVE/ABDOMEN SIGNS AND SYMPTOMS,,,251,ABDOMINAL PAIN,06,DISEASES AND DISORDERS OF THE DIGESTIVE SYSTEM,1,Minor,Minor,Medical,Medicaid,,,,,true,22630.77,3625.15
Long Island,Suffolk,5154001,000925,Good Samaritan Hospital Medical Center,70 or Older,117,F,White,Not Span/Hispanic,2,Emergency,Home or Self Care,2018,SYM006,ABDOMINAL PAIN AND OTHER DIGESTIVE/ABDOMEN SIGNS AND SYMPTOMS,,,251,ABDOMINAL PAIN,06,DISEASES AND DISORDERS OF THE DIGESTIVE SYSTEM,2,Moderate,Moderate,Medical,Medicare,Medicare,,,,true,25961,3528.01
New York City,Bronx,7000006,001168,Montefiore Medical Center-Wakefield Hospital,50 to 69,OOS,F,Black/African American,Not Span/Hispanic,4,Emergency,Home w/ Home Health Services,2018,SYM006,ABDOMINAL PAIN AND OTHER DIGESTIVE/ABDOMEN SIGNS AND SYMPTOMS,ADM021,"ADMINISTRATION OF THERAPEUTIC SUBSTANCES, NEC",251,ABDOMINAL PAIN,06,DISEASES AND DISORDERS OF THE DIGESTIVE SYSTEM,3,Major,Minor,Medical,Medicare,Medicaid,,,,true,57469,10262.95
Central NY,Onondaga,3301003,000630,St. Joseph's Hospital Health Center,70 or Older,131,F,White,Not Span/Hispanic,2,Emergency,Home or Self Care,2018,SYM006,ABDOMINAL PAIN AND OTHER DIGESTIVE/ABDOMEN SIGNS AND SYMPTOMS,ESA001,HEMODIALYSIS,251,ABDOMINAL PAIN,06,DISEASES AND DISORDERS OF THE DIGESTIVE SYSTEM,3,Major,Major,Medical,Medicare,Private Health Insurance,,,,true,11806.48,4200.59
New York City,Manhattan,7002054,001458,New York-Presbyterian Hospital - New York Weill Cornell Center,50 to 69,100,F,Black/African American,Not Span/Hispanic,2,Emergency,Home or Self Care,2018,SYM006,ABDOMINAL PAIN AND OTHER DIGESTIVE/ABDOMEN SIGNS AND SYMPTOMS,,,251,ABDOMINAL PAIN,06,DISEASES AND DISORDERS OF THE DIGESTIVE SYSTEM,2,Moderate,Minor,Medical,"Managed Care, Unspecified",Medicaid,Self-Pay,,,true,29048.43,6514.74
Western NY,Niagara,3101000,000565,Eastern Niagara Hospital - Lockport Division,50 to 69,140,F,White,Not Span/Hispanic,5,Elective,Home or Self Care,2018,SYM006,ABDOMINAL PAIN AND OTHER DIGESTIVE/ABDOMEN SIGNS AND SYMPTOMS,GIS006,PARACENTESIS,251,ABDOMINAL PAIN,06,DISEASES AND DISORDERS OF THE DIGESTIVE SYSTEM,2,Moderate,Moderate,Medical,Private Health Insurance,,,,,false,20289.18,6229.77
Capital/Adirond,Albany,0101000,000001,Albany Medical Center Hospital,30 to 49,120,F,White,Not Span/Hispanic,3,Emergency,Home or Self Care,2018,SYM006,ABDOMINAL PAIN AND OTHER DIGESTIVE/ABDOMEN SIGNS AND SYMPTOMS,URN005,NEPHROSTOMY AND URETEROSTOMY PROCEDURES (INCLUDING STENTS),251,ABDOMINAL PAIN,06,DISEASES AND DISORDERS OF THE DIGESTIVE SYSTEM,2,Moderate,Minor,Medical,"Managed Care, Unspecified",,,,,true,24142.38,6347.46
New York City,Bronx,7000001,001178,BronxCare Hospital Center,70 or Older,104,F,Other Race,Spanish/Hispanic,3,Emergency,Home or Self Care,2018,SYM006,ABDOMINAL PAIN AND OTHER DIGESTIVE/ABDOMEN SIGNS AND SYMPTOMS,,,251,ABDOMINAL PAIN,06,DISEASES AND DISORDERS OF THE DIGESTIVE SYSTEM,1,Minor,Minor,Medical,Medicare,Medicare,Medicaid,,,true,11391.55,13221.01
New York City,Kings,7002002,001324,Mount Sinai Brooklyn,70 or Older,112,M,White,Unknown,3,Emergency,Skilled Nursing Home,2018,SYM006,ABDOMINAL PAIN AND OTHER DIGESTIVE/ABDOMEN SIGNS AND SYMPTOMS,,,251,ABDOMINAL PAIN,06,DISEASES AND DISORDERS OF THE DIGESTIVE SYSTEM,2,Moderate,Moderate,Medical,Medicare,Medicaid,Self-Pay,,,true,37272.63,5367.88
Capital/Adirond,Franklin,1624000,000325,The University of Vermont Health Network - Alice Hyde Medical Center,50 to 69,129,M,White,Not Span/Hispanic,1,Emergency,Left Against Medical Advice,2018,SYM006,ABDOMINAL PAIN AND OTHER DIGESTIVE/ABDOMEN SIGNS AND SYMPTOMS,,,251,ABDOMINAL PAIN,06,DISEASES AND DISORDERS OF THE DIGESTIVE SYSTEM,3,Major,Moderate,Medical,Medicaid,,,,,true,3716.38,1137.56
Long Island,Suffolk,5151001,000245,Stony Brook University Hospital,50 to 69,117,F,White,Not Span/Hispanic,1,Emergency,Home or Self Care,2018,SYM006,ABDOMINAL PAIN AND OTHER DIGESTIVE/ABDOMEN SIGNS AND SYMPTOMS,,,251,ABDOMINAL PAIN,06,DISEASES AND DISORDERS OF THE DIGESTIVE SYSTEM,3,Major,Major,Medical,Medicare,Private Health Insurance,,,,true,16937.69,4124.96
New York City,Bronx,7000006,003058,Montefiore Med Center - Jack D Weiler Hosp of A Einstein College Div,50 to 69,104,M,Other Race,Unknown,1,Emergency,Left Against Medical Advice,2018,SYM006,ABDOMINAL PAIN AND OTHER DIGESTIVE/ABDOMEN SIGNS AND SYMPTOMS,,,251,ABDOMINAL PAIN,06,DISEASES AND DISORDERS OF THE DIGESTIVE SYSTEM,1,Minor,Minor,Medical,Medicaid,,,,,true,13554.43,2072.99
New York City,Bronx,7000001,001178,BronxCare Hospital Center,30 to 49,104,F,Black/African American,Not Span/Hispanic,1,Emergency,Home or Self Care,2018,SYM006,ABDOMINAL PAIN AND OTHER DIGESTIVE/ABDOMEN SIGNS AND SYMPTOMS,,,251,ABDOMINAL PAIN,06,DISEASES AND DISORDERS OF THE DIGESTIVE SYSTEM,2,Moderate,Minor,Medical,Medicaid,Medicaid,,,,true,7778.21,6958.23
New York City,Manhattan,7002054,001464,New York-Presbyterian Hospital - Columbia Presbyterian Center,30 to 49,117,M,Other Race,Not Span/Hispanic,1,Emergency,Home or Self Care,2018,SYM006,ABDOMINAL PAIN AND OTHER DIGESTIVE/ABDOMEN SIGNS AND SYMPTOMS,,,251,ABDOMINAL PAIN,06,DISEASES AND DISORDERS OF THE DIGESTIVE SYSTEM,2,Moderate,Minor,Medical,Medicaid,Self-Pay,,,,true,14092.84,3220.9
Finger Lakes,Chemung,0701000,000116,Arnot Ogden Medical Center,50 to 69,149,F,Black/African American,Not Span/Hispanic,2,Emergency,Home or Self Care,2018,SYM006,ABDOMINAL PAIN AND OTHER DIGESTIVE/ABDOMEN SIGNS AND SYMPTOMS,,,251,ABDOMINAL PAIN,06,DISEASES AND DISORDERS OF THE DIGESTIVE SYSTEM,2,Moderate,Minor,Medical,Private Health Insurance,Medicaid,,,,true,17002.19,5386.75
Long Island,Nassau,7003004,000518,Long Island Jewish Valley Stream,70 or Older,114,F,Black/African American,Not Span/Hispanic,2,Emergency,Home w/ Home Health Services,2018,SYM006,ABDOMINAL PAIN AND OTHER DIGESTIVE/ABDOMEN SIGNS AND SYMPTOMS,ESA004,NON-INVASIVE VENTILATION,251,ABDOMINAL PAIN,06,DISEASES AND DISORDERS OF THE DIGESTIVE SYSTEM,2,Moderate,Major,Medical,Medicare,Medicaid,,,,true,44546.14,6559.21
Western NY,Erie,1401005,000210,Erie County Medical Center,70 or Older,141,F,White,Not Span/Hispanic,8,Emergency,Skilled Nursing Home,2018,SYM006,ABDOMINAL PAIN AND OTHER DIGESTIVE/ABDOMEN SIGNS AND SYMPTOMS,,,251,ABDOMINAL PAIN,06,DISEASES AND DISORDERS OF THE DIGESTIVE SYSTEM,3,Major,Moderate,Medical,Medicare,Self-Pay,Medicaid,,,true,23983.22,11485.88
New York City,Kings,7001021,001306,New York - Presbyterian Brooklyn Methodist Hospital,50 to 69,112,F,Black/African American,Not Span/Hispanic,7,Emergency,Home or Self Care,2018,SYM006,ABDOMINAL PAIN AND OTHER DIGESTIVE/ABDOMEN SIGNS AND SYMPTOMS,ADM001,TRANSFUSION OF BLOOD AND BLOOD PRODUCTS,251,ABDOMINAL PAIN,06,DISEASES AND DISORDERS OF THE DIGESTIVE SYSTEM,3,Major,Moderate,Medical,Medicare,Medicaid,Self-Pay,,,true,43226.11,10867.25
Long Island,Nassau,2908000,000511,NYU Langone Hospital-Long Island,18 to 29,115,F,Other Race,Not Span/Hispanic,2,Emergency,Home or Self Care,2018,SYM006,ABDOMINAL PAIN AND OTHER DIGESTIVE/ABDOMEN SIGNS AND SYMPTOMS,,,251,ABDOMINAL PAIN,06,DISEASES AND DISORDERS OF THE DIGESTIVE SYSTEM,1,Minor,Minor,Medical,Blue Cross/Blue Shield,,,,,true,35588.47,6657.66
Capital/Adirond,Warren,5601000,001005,Glens Falls Hospital,0 to 17,120,M,White,Not Span/Hispanic,1,Emergency,Home or Self Care,2018,SYM006,ABDOMINAL PAIN AND OTHER DIGESTIVE/ABDOMEN SIGNS AND SYMPTOMS,,,251,ABDOMINAL PAIN,06,DISEASES AND DISORDERS OF THE DIGESTIVE SYSTEM,2,Moderate,Minor,Medical,Medicaid,,,,,true,9960.1,2034.64