Hospital Service Area,Hospital County,Operating Certificate Number,Permanent Facility Id,Facility Name,Age Group,Zip Code - 3 digits,Gender,Race,Ethnicity,Length of Stay,Type of Admission,Patient Disposition,Discharge Year,CCS Diagnosis Code,CCS Diagnosis Description,CCS Procedure Code,CCS Procedure Description,APR DRG Code,APR DRG Description,APR MDC Code,APR MDC Description,APR Severity of Illness Code,APR Severity of Illness Description,APR Risk of Mortality,APR Medical Surgical Description,Payment Typology 1,Payment Typology 2,Payment Typology 3,Birth Weight,Abortion Edit Indicator,Emergency Department Indicator,Total Charges,Total Costs
New York City,Manhattan,7002001,001438,Bellevue Hospital Center,70 or Older,112,F,Other Race,Not Span/Hispanic,1,Emergency,Skilled Nursing Home,2017,238,Complications of surgical procedures or medical care,093,OT NON-OR UP GI THER PR,252,"Malfunction, reaction & complication of GI device or procedure",06,Diseases and Disorders of the Digestive System,2,Moderate,Moderate,Medical,Medicare,Medicare,Medicaid,,N,Y,7099.03,4577.09
New York City,Manhattan,7002001,001438,Bellevue Hospital Center,30 to 49,112,F,Other Race,Spanish/Hispanic,3,Emergency,Home or Self Care,2017,238,Complications of surgical procedures or medical care,070,UP GASTRO ENDOSC/BIOPSY,252,"Malfunction, reaction & complication of GI device or procedure",06,Diseases and Disorders of the Digestive System,2,Moderate,Minor,Medical,Medicaid,Medicaid,,,N,Y,19395.02,12504.90
New York City,Manhattan,7002001,001438,Bellevue Hospital Center,30 to 49,113,F,Other Race,Not Span/Hispanic,4,Emergency,Home or Self Care,2017,238,Complications of surgical procedures or medical care,098,OT NON-OR GI THER PRCS,252,"Malfunction, reaction & complication of GI device or procedure",06,Diseases and Disorders of the Digestive System,2,Moderate,Minor,Medical,Medicaid,Medicaid,,,N,Y,22272.70,14360.28
New York City,Manhattan,7002001,001438,Bellevue Hospital Center,30 to 49,114,M,Other Race,Not Span/Hispanic,5,Emergency,Home or Self Care,2017,237,Complication of device; implant or graft,000,NO PROC,252,"Malfunction, reaction & complication of GI device or procedure",06,Diseases and Disorders of the Digestive System,2,Moderate,Moderate,Medical,Medicaid,Medicaid,,,N,Y,29699.14,19148.46
New York City,Manhattan,7002001,001438,Bellevue Hospital Center,0 to 17,104,F,Other Race,Not Span/Hispanic,3,Emergency,Home or Self Care,2017,238,Complications of surgical procedures or medical care,231,OTHER THERAPEUTIC PRCS,252,"Malfunction, reaction & complication of GI device or procedure",06,Diseases and Disorders of the Digestive System,3,Major,Minor,Medical,Medicaid,Medicaid,,,N,Y,17815.09,11486.24
New York City,Manhattan,7002001,001438,Bellevue Hospital Center,50 to 69,104,F,Other Race,Not Span/Hispanic,1,Emergency,Home or Self Care,2017,238,Complications of surgical procedures or medical care,000,NO PROC,252,"Malfunction, reaction & complication of GI device or procedure",06,Diseases and Disorders of the Digestive System,1,Minor,Minor,Medical,Private Health Insurance,Medicare,Medicaid,,N,Y,7407.36,4775.88
New York City,Manhattan,7002001,001438,Bellevue Hospital Center,50 to 69,100,M,Black/African American,Not Span/Hispanic,12,Emergency,Home w/ Home Health Services,2017,238,Complications of surgical procedures or medical care,222,BLOOD TRANSFUSION,252,"Malfunction, reaction & complication of GI device or procedure",06,Diseases and Disorders of the Digestive System,2,Moderate,Minor,Medical,Medicare,Medicaid,,,N,Y,79957.77,51552.61
New York City,Manhattan,7002001,001438,Bellevue Hospital Center,0 to 17,113,F,Other Race,Not Span/Hispanic,2,Emergency,Home or Self Care,2017,238,Complications of surgical procedures or medical care,000,NO PROC,252,"Malfunction, reaction & complication of GI device or procedure",06,Diseases and Disorders of the Digestive System,2,Moderate,Minor,Medical,Medicaid,Medicaid,,,N,Y,13013.12,8390.18
New York City,Manhattan,7002001,001438,Bellevue Hospital Center,50 to 69,104,M,Other Race,Not Span/Hispanic,3,Emergency,Another Type Not Listed,2017,238,Complications of surgical procedures or medical care,000,NO PROC,252,"Malfunction, reaction & complication of GI device or procedure",06,Diseases and Disorders of the Digestive System,3,Major,Moderate,Medical,Medicaid,Medicaid,,,N,Y,23039.16,14854.45
New York City,Manhattan,7002001,001438,Bellevue Hospital Center,30 to 49,113,M,Other Race,Not Span/Hispanic,2,Emergency,Left Against Medical Advice,2017,238,Complications of surgical procedures or medical care,000,NO PROC,252,"Malfunction, reaction & complication of GI device or procedure",06,Diseases and Disorders of the Digestive System,2,Moderate,Minor,Medical,Medicaid,Medicaid,,,N,Y,13955.42,8997.73
New York City,Manhattan,7002001,001438,Bellevue Hospital Center,50 to 69,100,M,Other Race,Not Span/Hispanic,1,Emergency,Skilled Nursing Home,2017,238,Complications of surgical procedures or medical care,071,GASTROSTOMY; TEMP/PERM,252,"Malfunction, reaction & complication of GI device or procedure",06,Diseases and Disorders of the Digestive System,3,Major,Major,Medical,Medicare,Medicare,Medicaid,,N,Y,7526.35,4852.60
New York City,Manhattan,7002001,001438,Bellevue Hospital Center,18 to 29,104,F,Black/African American,Not Span/Hispanic,3,Emergency,Home or Self Care,2017,238,Complications of surgical procedures or medical care,098,OT NON-OR GI THER PRCS,252,"Malfunction, reaction & complication of GI device or procedure",06,Diseases and Disorders of the Digestive System,1,Minor,Minor,Medical,Medicaid,Medicaid,,,N,Y,23544.88,15180.51
New York City,Manhattan,7002001,001438,Bellevue Hospital Center,50 to 69,114,M,Other Race,Not Span/Hispanic,1,Emergency,Skilled Nursing Home,2017,238,Complications of surgical procedures or medical care,093,OT NON-OR UP GI THER PR,252,"Malfunction, reaction & complication of GI device or procedure",06,Diseases and Disorders of the Digestive System,2,Moderate,Moderate,Medical,Medicaid,,,,N,Y,9520.76,6138.49
New York City,Manhattan,7002001,001438,Bellevue Hospital Center,18 to 29,104,F,Other Race,Not Span/Hispanic,9,Emergency,Home w/ Home Health Services,2017,238,Complications of surgical procedures or medical care,093,OT NON-OR UP GI THER PR,252,"Malfunction, reaction & complication of GI device or procedure",06,Diseases and Disorders of the Digestive System,3,Major,Minor,Medical,Medicaid,Medicaid,,,N,Y,50982.32,32870.75
New York City,Manhattan,7002001,001438,Bellevue Hospital Center,0 to 17,114,M,Other Race,Spanish/Hispanic,8,Emergency,Home or Self Care,2017,238,Complications of surgical procedures or medical care,168,"INCIS/DRAIN, SKIN/SUBCU",252,"Malfunction, reaction & complication of GI device or procedure",06,Diseases and Disorders of the Digestive System,3,Major,Minor,Medical,Medicaid,Medicaid,,,N,Y,44327.23,28579.89
New York City,Manhattan,7002001,001438,Bellevue Hospital Center,50 to 69,100,F,Other Race,Not Span/Hispanic,2,Emergency,Home or Self Care,2017,238,Complications of surgical procedures or medical care,098,OT NON-OR GI THER PRCS,252,"Malfunction, reaction & complication of GI device or procedure",06,Diseases and Disorders of the Digestive System,1,Minor,Minor,Medical,Medicaid,,,,N,Y,15095.00,9732.47
New York City,Manhattan,7002001,001438,Bellevue Hospital Center,30 to 49,112,F,Black/African American,Not Span/Hispanic,2,Emergency,Home or Self Care,2017,238,Complications of surgical procedures or medical care,179,CT SCAN ABDOMEN,252,"Malfunction, reaction & complication of GI device or procedure",06,Diseases and Disorders of the Digestive System,2,Moderate,Minor,Medical,Self-Pay,,,,N,Y,16945.42,10925.53
New York City,Manhattan,7002001,001438,Bellevue Hospital Center,18 to 29,100,F,Other Race,Not Span/Hispanic,11,Emergency,Left Against Medical Advice,2017,238,Complications of surgical procedures or medical care,070,UP GASTRO ENDOSC/BIOPSY,252,"Malfunction, reaction & complication of GI device or procedure",06,Diseases and Disorders of the Digestive System,1,Minor,Minor,Medical,Medicaid,Medicaid,,,N,Y,59324.44,38249.31
New York City,Manhattan,7002001,001438,Bellevue Hospital Center,30 to 49,112,F,Other Race,Not Span/Hispanic,2,Emergency,Home or Self Care,2017,238,Complications of surgical procedures or medical care,179,CT SCAN ABDOMEN,252,"Malfunction, reaction & complication of GI device or procedure",06,Diseases and Disorders of the Digestive System,2,Moderate,Minor,Medical,Medicaid,Medicaid,,,N,Y,15150.32,9768.14
New York City,Manhattan,7002001,001438,Bellevue Hospital Center,50 to 69,113,M,Other Race,Spanish/Hispanic,1,Emergency,Home or Self Care,2017,238,Complications of surgical procedures or medical care,221,NASOGASTRIC TUBE,252,"Malfunction, reaction & complication of GI device or procedure",06,Diseases and Disorders of the Digestive System,1,Minor,Minor,Medical,Medicaid,,,,N,Y,8330.67,5371.18
New York City,Manhattan,7002001,001438,Bellevue Hospital Center,70 or Older,104,F,Other Race,Spanish/Hispanic,3,Elective,Home or Self Care,2017,238,Complications of surgical procedures or medical care,098,OT NON-OR GI THER PRCS,252,"Malfunction, reaction & complication of GI device or procedure",06,Diseases and Disorders of the Digestive System,3,Major,Major,Medical,Medicare,Medicare,Medicaid,,N,N,17475.10,11267.04
New York City,Manhattan,7002001,001438,Bellevue Hospital Center,30 to 49,113,F,Other Race,Spanish/Hispanic,2,Emergency,Home or Self Care,2017,238,Complications of surgical procedures or medical care,000,NO PROC,252,"Malfunction, reaction & complication of GI device or procedure",06,Diseases and Disorders of the Digestive System,2,Moderate,Minor,Medical,Self-Pay,,,,N,Y,15044.37,9699.83
New York City,Manhattan,7002001,001438,Bellevue Hospital Center,30 to 49,100,F,Other Race,Spanish/Hispanic,1,Emergency,Home or Self Care,2017,238,Complications of surgical procedures or medical care,174,OT NON-OR THER PRC SKIN,252,"Malfunction, reaction & complication of GI device or procedure",06,Diseases and Disorders of the Digestive System,1,Minor,Minor,Medical,Medicaid,Medicaid,,,N,Y,7535.21,4858.31
New York City,Manhattan,7002001,001438,Bellevue Hospital Center,18 to 29,100,F,Other Race,Spanish/Hispanic,4,Emergency,Home or Self Care,2017,238,Complications of surgical procedures or medical care,222,BLOOD TRANSFUSION,252,"Malfunction, reaction & complication of GI device or procedure",06,Diseases and Disorders of the Digestive System,1,Minor,Minor,Medical,Medicaid,Medicaid,,,N,Y,22979.82,14816.19
New York City,Manhattan,7002001,001438,Bellevue Hospital Center,50 to 69,113,M,Other Race,Spanish/Hispanic,1,Emergency,Home or Self Care,2017,238,Complications of surgical procedures or medical care,222,BLOOD TRANSFUSION,252,"Malfunction, reaction & complication of GI device or procedure",06,Diseases and Disorders of the Digestive System,2,Moderate,Minor,Medical,Medicaid,Medicaid,,,N,Y,8311.14,5358.59
New York City,Manhattan,7002001,001438,Bellevue Hospital Center,18 to 29,112,F,Other Race,Spanish/Hispanic,3,Emergency,Home or Self Care,2017,238,Complications of surgical procedures or medical care,222,BLOOD TRANSFUSION,252,"Malfunction, reaction & complication of GI device or procedure",06,Diseases and Disorders of the Digestive System,2,Moderate,Minor,Medical,Medicaid,,,,N,Y,22114.03,14257.98
New York City,Manhattan,7002001,001438,Bellevue Hospital Center,50 to 69,100,F,Other Race,Spanish/Hispanic,1,Emergency,Home or Self Care,2017,238,Complications of surgical procedures or medical care,222,BLOOD TRANSFUSION,252,"Malfunction, reaction & complication of GI device or procedure",06,Diseases and Disorders of the Digestive System,2,Moderate,Minor,Medical,Medicare,Medicare,Medicaid,,N,Y,9564.30,6166.56
New York City,Manhattan,7002001,001438,Bellevue Hospital Center,50 to 69,113,F,Black/African American,Not Span/Hispanic,6,Emergency,Home or Self Care,2017,238,Complications of surgical procedures or medical care,000,NO PROC,252,"Malfunction, reaction & complication of GI device or procedure",06,Diseases and Disorders of the Digestive System,2,Moderate,Minor,Medical,Medicare,Medicaid,,,N,Y,34309.87,22121.22
New York City,Manhattan,7002001,001438,Bellevue Hospital Center,30 to 49,100,F,Other Race,Not Span/Hispanic,3,Emergency,Home w/ Home Health Services,2017,238,Complications of surgical procedures or medical care,000,NO PROC,252,"Malfunction, reaction & complication of GI device or procedure",06,Diseases and Disorders of the Digestive System,1,Minor,Minor,Medical,Medicaid,Medicaid,,,N,Y,19717.43,12712.77
New York City,Manhattan,7002001,001438,Bellevue Hospital Center,50 to 69,100,M,Other Race,Not Span/Hispanic,6,Emergency,Skilled Nursing Home,2017,238,Complications of surgical procedures or medical care,179,CT SCAN ABDOMEN,252,"Malfunction, reaction & complication of GI device or procedure",06,Diseases and Disorders of the Digestive System,2,Moderate,Major,Medical,Medicaid,,,,N,Y,34317.13,22125.90
New York City,Manhattan,7002001,001438,Bellevue Hospital Center,30 to 49,100,F,Other Race,Spanish/Hispanic,2,Emergency,Home or Self Care,2017,238,Complications of surgical procedures or medical care,179,CT SCAN ABDOMEN,252,"Malfunction, reaction & complication of GI device or procedure",06,Diseases and Disorders of the Digestive System,2,Moderate,Minor,Medical,"Managed Care, Unspecified",Medicaid,,,N,Y,14817.87,9553.79
New York City,Manhattan,7002001,001438,Bellevue Hospital Center,70 or Older,113,M,Other Race,Not Span/Hispanic,12,Emergency,Hospice - Medical Facility,2017,238,Complications of surgical procedures or medical care,223,ENTERAL/PARENTERAL NUTR,252,"Malfunction, reaction & complication of GI device or procedure",06,Diseases and Disorders of the Digestive System,3,Major,Extreme,Medical,Medicare,Medicaid,,,N,Y,65417.40,42177.74
New York City,Manhattan,7002001,001438,Bellevue Hospital Center,50 to 69,100,F,Other Race,Not Span/Hispanic,2,Emergency,Home or Self Care,2017,238,Complications of surgical procedures or medical care,070,UP GASTRO ENDOSC/BIOPSY,252,"Malfunction, reaction & complication of GI device or procedure",06,Diseases and Disorders of the Digestive System,2,Moderate,Minor,Medical,Private Health Insurance,,,,N,Y,15378.69,9915.38
New York City,Manhattan,7002001,001438,Bellevue Hospital Center,50 to 69,112,F,Black/African American,Not Span/Hispanic,8,Emergency,Home w/ Home Health Services,2017,238,Complications of surgical procedures or medical care,198,MAG RESONANCE IMAGING,252,"Malfunction, reaction & complication of GI device or procedure",06,Diseases and Disorders of the Digestive System,2,Moderate,Minor,Medical,Medicaid,Medicaid,,,N,Y,48204.76,31079.92
New York City,Manhattan,7002001,001438,Bellevue Hospital Center,50 to 69,112,F,Black/African American,Not Span/Hispanic,2,Emergency,Home w/ Home Health Services,2017,238,Complications of surgical procedures or medical care,214,"TRACTN, SPLNT, OT WOUND",252,"Malfunction, reaction & complication of GI device or procedure",06,Diseases and Disorders of the Digestive System,2,Moderate,Minor,Medical,Medicaid,Medicaid,,,N,Y,13527.17,8721.62
New York City,Manhattan,7002001,001438,Bellevue Hospital Center,30 to 49,100,F,Black/African American,Not Span/Hispanic,13,Emergency,Home or Self Care,2017,238,Complications of surgical procedures or medical care,221,NASOGASTRIC TUBE,252,"Malfunction, reaction & complication of GI device or procedure",06,Diseases and Disorders of the Digestive System,2,Moderate,Minor,Medical,Private Health Insurance,,,,N,Y,76989.51,49638.83
New York City,Manhattan,7002001,001438,Bellevue Hospital Center,18 to 29,112,M,Other Race,Not Span/Hispanic,1,Emergency,Home or Self Care,2017,238,Complications of surgical procedures or medical care,231,OTHER THERAPEUTIC PRCS,252,"Malfunction, reaction & complication of GI device or procedure",06,Diseases and Disorders of the Digestive System,2,Moderate,Minor,Medical,Private Health Insurance,,,,N,Y,8879.83,5725.25
New York City,Manhattan,7002001,001438,Bellevue Hospital Center,18 to 29,112,F,Black/African American,Not Span/Hispanic,23,Emergency,Home or Self Care,2017,238,Complications of surgical procedures or medical care,054,OT VASC CATH; NOT HEART,252,"Malfunction, reaction & complication of GI device or procedure",06,Diseases and Disorders of the Digestive System,2,Moderate,Minor,Medical,Medicaid,Medicaid,,,N,Y,120570.73,77737.74
New York City,Manhattan,7002001,001438,Bellevue Hospital Center,30 to 49,100,F,Other Race,Spanish/Hispanic,7,Emergency,Home or Self Care,2017,238,Complications of surgical procedures or medical care,069,ESOPHAGEAL DILATATION,252,"Malfunction, reaction & complication of GI device or procedure",06,Diseases and Disorders of the Digestive System,2,Moderate,Minor,Medical,Medicaid,Medicaid,,,N,Y,39819.70,25673.67
New York City,Manhattan,7002001,001438,Bellevue Hospital Center,50 to 69,111,F,Other Race,Spanish/Hispanic,1,Emergency,Home or Self Care,2017,238,Complications of surgical procedures or medical care,231,OTHER THERAPEUTIC PRCS,252,"Malfunction, reaction & complication of GI device or procedure",06,Diseases and Disorders of the Digestive System,1,Minor,Minor,Medical,Medicaid,,,,N,Y,9762.79,6294.54
New York City,Manhattan,7002001,001438,Bellevue Hospital Center,50 to 69,104,F,Other Race,Not Span/Hispanic,8,Emergency,Home or Self Care,2017,238,Complications of surgical procedures or medical care,070,UP GASTRO ENDOSC/BIOPSY,252,"Malfunction, reaction & complication of GI device or procedure",06,Diseases and Disorders of the Digestive System,2,Moderate,Minor,Medical,Medicaid,Medicaid,,,N,Y,58113.52,37468.58
New York City,Manhattan,7002001,001438,Bellevue Hospital Center,18 to 29,113,F,Other Race,Spanish/Hispanic,17,Emergency,Home or Self Care,2017,238,Complications of surgical procedures or medical care,054,OT VASC CATH; NOT HEART,252,"Malfunction, reaction & complication of GI device or procedure",06,Diseases and Disorders of the Digestive System,3,Major,Moderate,Medical,Medicaid,Medicaid,,,N,Y,94136.90,60694.58
