Hospital Service Area,Hospital County,Operating Certificate Number,Permanent Facility Id,Facility Name,Age Group,Zip Code - 3 digits,Gender,Race,Ethnicity,Length of Stay,Type of Admission,Patient Disposition,Discharge Year,CCS Diagnosis Code,CCS Diagnosis Description,CCS Procedure Code,CCS Procedure Description,APR DRG Code,APR DRG Description,APR MDC Code,APR MDC Description,APR Severity of Illness Code,APR Severity of Illness Description,APR Risk of Mortality,APR Medical Surgical Description,Payment Typology 1,Payment Typology 2,Payment Typology 3,Birth Weight,Abortion Edit Indicator,Emergency Department Indicator,Total Charges,Total Costs
Long Island,Nassau,2908000,000511,NYU Winthrop Hospital,30 to 49,115,F,Black/African American,Not Span/Hispanic,3,Emergency,Home or Self Care,2017,238,Complications of surgical procedures or medical care,000,NO PROC,252,"Malfunction, reaction & complication of GI device or procedure",06,Diseases and Disorders of the Digestive System,1,Minor,Minor,Medical,Private Health Insurance,,,,N,Y,31340.94,6293.59
Long Island,Nassau,2908000,000511,NYU Winthrop Hospital,50 to 69,117,F,Other Race,Not Span/Hispanic,2,Emergency,Home or Self Care,2017,238,Complications of surgical procedures or medical care,098,OT NON-OR GI THER PRCS,252,"Malfunction, reaction & complication of GI device or procedure",06,Diseases and Disorders of the Digestive System,2,Moderate,Minor,Medical,Medicare,Medicare,Blue Cross/Blue Shield,,N,Y,59423.06,13231.07
Long Island,Nassau,2908000,000511,NYU Winthrop Hospital,70 or Older,115,M,White,Not Span/Hispanic,13,Emergency,Home w/ Home Health Services,2017,238,Complications of surgical procedures or medical care,071,GASTROSTOMY; TEMP/PERM,252,"Malfunction, reaction & complication of GI device or procedure",06,Diseases and Disorders of the Digestive System,3,Major,Major,Medical,Medicare,Medicare,,,N,Y,86508.30,19929.08
Long Island,Nassau,2908000,000511,NYU Winthrop Hospital,50 to 69,115,M,White,Not Span/Hispanic,2,Emergency,Home or Self Care,2017,237,Complication of device; implant or graft,070,UP GASTRO ENDOSC/BIOPSY,252,"Malfunction, reaction & complication of GI device or procedure",06,Diseases and Disorders of the Digestive System,1,Minor,Minor,Medical,Blue Cross/Blue Shield,,,,N,Y,42383.34,7414.36
Long Island,Nassau,2908000,000511,NYU Winthrop Hospital,70 or Older,117,M,White,Not Span/Hispanic,2,Emergency,Home or Self Care,2017,238,Complications of surgical procedures or medical care,095,OT NON-OR LW GI THER PR,252,"Malfunction, reaction & complication of GI device or procedure",06,Diseases and Disorders of the Digestive System,2,Moderate,Moderate,Medical,Private Health Insurance,Medicare,,,N,Y,39723.48,7610.56
Long Island,Nassau,2908000,000511,NYU Winthrop Hospital,30 to 49,117,M,White,Spanish/Hispanic,8,Emergency,Inpatient Rehabilitation Facility,2017,238,Complications of surgical procedures or medical care,000,NO PROC,252,"Malfunction, reaction & complication of GI device or procedure",06,Diseases and Disorders of the Digestive System,3,Major,Moderate,Medical,Medicare,Medicare,Medicaid,,N,Y,68709.40,14625.85
Long Island,Nassau,2908000,000511,NYU Winthrop Hospital,70 or Older,115,F,White,Not Span/Hispanic,3,Emergency,Home or Self Care,2017,237,Complication of device; implant or graft,000,NO PROC,252,"Malfunction, reaction & complication of GI device or procedure",06,Diseases and Disorders of the Digestive System,3,Major,Moderate,Medical,Medicare,Medicare,Medicaid,,N,Y,22938.24,5396.69
Long Island,Nassau,2908000,000511,NYU Winthrop Hospital,50 to 69,115,M,White,Not Span/Hispanic,3,Emergency,Home or Self Care,2017,237,Complication of device; implant or graft,000,NO PROC,252,"Malfunction, reaction & complication of GI device or procedure",06,Diseases and Disorders of the Digestive System,2,Moderate,Minor,Medical,Blue Cross/Blue Shield,,,,N,Y,31664.45,6224.55
Long Island,Nassau,2908000,000511,NYU Winthrop Hospital,50 to 69,113,M,White,Not Span/Hispanic,4,Emergency,Home or Self Care,2017,238,Complications of surgical procedures or medical care,221,NASOGASTRIC TUBE,252,"Malfunction, reaction & complication of GI device or procedure",06,Diseases and Disorders of the Digestive System,1,Minor,Minor,Medical,Medicare,Medicare,,,N,Y,34763.71,7148.64
Long Island,Nassau,2908000,000511,NYU Winthrop Hospital,70 or Older,110,F,White,Not Span/Hispanic,33,Emergency,Home w/ Home Health Services,2017,238,Complications of surgical procedures or medical care,054,OT VASC CATH; NOT HEART,252,"Malfunction, reaction & complication of GI device or procedure",06,Diseases and Disorders of the Digestive System,3,Major,Major,Medical,Medicare,Medicare,,,N,Y,166641.72,46198.24
Long Island,Nassau,2908000,000511,NYU Winthrop Hospital,18 to 29,115,F,Other Race,Spanish/Hispanic,4,Emergency,Home or Self Care,2017,238,Complications of surgical procedures or medical care,098,OT NON-OR GI THER PRCS,252,"Malfunction, reaction & complication of GI device or procedure",06,Diseases and Disorders of the Digestive System,2,Moderate,Minor,Medical,Medicaid,Medicaid,,,N,Y,67295.04,11764.59
Long Island,Nassau,2908000,000511,NYU Winthrop Hospital,70 or Older,115,F,White,Not Span/Hispanic,9,Emergency,Hospice - Medical Facility,2017,238,Complications of surgical procedures or medical care,223,ENTERAL/PARENTERAL NUTR,252,"Malfunction, reaction & complication of GI device or procedure",06,Diseases and Disorders of the Digestive System,3,Major,Major,Medical,Medicare,Medicare,Medicaid,,N,Y,130929.38,35041.50
Long Island,Nassau,2908000,000511,NYU Winthrop Hospital,50 to 69,117,F,White,Not Span/Hispanic,10,Elective,Home or Self Care,2017,238,Complications of surgical procedures or medical care,229,NONOP RMVL FOREIGN BODY,252,"Malfunction, reaction & complication of GI device or procedure",06,Diseases and Disorders of the Digestive System,3,Major,Moderate,Medical,Private Health Insurance,,,,N,N,112530.61,27164.03
Long Island,Nassau,2908000,000511,NYU Winthrop Hospital,30 to 49,115,F,Black/African American,Not Span/Hispanic,1,Emergency,Home or Self Care,2017,238,Complications of surgical procedures or medical care,098,OT NON-OR GI THER PRCS,252,"Malfunction, reaction & complication of GI device or procedure",06,Diseases and Disorders of the Digestive System,1,Minor,Minor,Medical,Medicaid,,,,N,Y,36808.09,7326.30
Long Island,Nassau,2908000,000511,NYU Winthrop Hospital,30 to 49,110,F,Black/African American,Not Span/Hispanic,4,Emergency,Home w/ Home Health Services,2017,238,Complications of surgical procedures or medical care,098,OT NON-OR GI THER PRCS,252,"Malfunction, reaction & complication of GI device or procedure",06,Diseases and Disorders of the Digestive System,2,Moderate,Moderate,Medical,Blue Cross/Blue Shield,Blue Cross/Blue Shield,,,N,Y,53223.57,11292.38
Long Island,Nassau,2908000,000511,NYU Winthrop Hospital,70 or Older,115,F,White,Not Span/Hispanic,3,Emergency,Home w/ Home Health Services,2017,238,Complications of surgical procedures or medical care,000,NO PROC,252,"Malfunction, reaction & complication of GI device or procedure",06,Diseases and Disorders of the Digestive System,2,Moderate,Moderate,Medical,Medicare,Medicare,Private Health Insurance,,N,Y,65917.40,15621.73
Long Island,Nassau,2908000,000511,NYU Winthrop Hospital,50 to 69,115,M,White,Not Span/Hispanic,13,Emergency,Skilled Nursing Home,2017,238,Complications of surgical procedures or medical care,216,RESP INTUB/MECH VENTIL,252,"Malfunction, reaction & complication of GI device or procedure",06,Diseases and Disorders of the Digestive System,4,Extreme,Extreme,Medical,Blue Cross/Blue Shield,,,,N,Y,193699.05,34953.14
Long Island,Nassau,2908000,000511,NYU Winthrop Hospital,30 to 49,113,M,Other Race,Not Span/Hispanic,5,Emergency,Skilled Nursing Home,2017,238,Complications of surgical procedures or medical care,071,GASTROSTOMY; TEMP/PERM,252,"Malfunction, reaction & complication of GI device or procedure",06,Diseases and Disorders of the Digestive System,4,Extreme,Moderate,Medical,Private Health Insurance,,,,N,Y,89650.60,22066.13
Long Island,Nassau,2908000,000511,NYU Winthrop Hospital,70 or Older,110,F,White,Not Span/Hispanic,7,Emergency,Skilled Nursing Home,2017,238,Complications of surgical procedures or medical care,071,GASTROSTOMY; TEMP/PERM,252,"Malfunction, reaction & complication of GI device or procedure",06,Diseases and Disorders of the Digestive System,4,Extreme,Major,Medical,Medicare,Medicare,,,N,Y,81744.22,14933.89
Long Island,Nassau,2908000,000511,NYU Winthrop Hospital,70 or Older,111,F,White,Spanish/Hispanic,1,Emergency,Home or Self Care,2017,238,Complications of surgical procedures or medical care,070,UP GASTRO ENDOSC/BIOPSY,252,"Malfunction, reaction & complication of GI device or procedure",06,Diseases and Disorders of the Digestive System,2,Moderate,Minor,Medical,Medicare,Medicare,Medicaid,,N,Y,56016.90,12440.03
Long Island,Nassau,2908000,000511,NYU Winthrop Hospital,70 or Older,115,F,White,Not Span/Hispanic,3,Emergency,Skilled Nursing Home,2017,238,Complications of surgical procedures or medical care,092,OTHER BOWEL DX PRCS,252,"Malfunction, reaction & complication of GI device or procedure",06,Diseases and Disorders of the Digestive System,2,Moderate,Minor,Medical,Medicare,Medicare,Private Health Insurance,,N,Y,39562.37,7601.16
Long Island,Nassau,2908000,000511,NYU Winthrop Hospital,70 or Older,117,M,White,Unknown,10,Emergency,Home or Self Care,2017,238,Complications of surgical procedures or medical care,000,NO PROC,252,"Malfunction, reaction & complication of GI device or procedure",06,Diseases and Disorders of the Digestive System,3,Major,Major,Medical,Medicare,Medicare,Private Health Insurance,,N,Y,111151.20,22832.52
Long Island,Nassau,2908000,000511,NYU Winthrop Hospital,18 to 29,110,M,Black/African American,Not Span/Hispanic,4,Emergency,Skilled Nursing Home,2017,238,Complications of surgical procedures or medical care,000,NO PROC,252,"Malfunction, reaction & complication of GI device or procedure",06,Diseases and Disorders of the Digestive System,4,Extreme,Major,Medical,Medicaid,,,,N,Y,95779.65,16451.86
Long Island,Nassau,2908000,000511,NYU Winthrop Hospital,50 to 69,115,M,White,Not Span/Hispanic,17,Emergency,Home or Self Care,2017,238,Complications of surgical procedures or medical care,223,ENTERAL/PARENTERAL NUTR,252,"Malfunction, reaction & complication of GI device or procedure",06,Diseases and Disorders of the Digestive System,3,Major,Major,Medical,Blue Cross/Blue Shield,,,,N,Y,162556.91,31671.33
Long Island,Nassau,2908000,000511,NYU Winthrop Hospital,50 to 69,115,F,White,Not Span/Hispanic,4,Emergency,Home or Self Care,2017,238,Complications of surgical procedures or medical care,000,NO PROC,252,"Malfunction, reaction & complication of GI device or procedure",06,Diseases and Disorders of the Digestive System,3,Major,Moderate,Medical,Medicare,Medicare,Blue Cross/Blue Shield,,N,Y,121019.20,28216.01
Long Island,Nassau,2908000,000511,NYU Winthrop Hospital,30 to 49,117,M,White,Not Span/Hispanic,2,Emergency,Home or Self Care,2017,238,Complications of surgical procedures or medical care,070,UP GASTRO ENDOSC/BIOPSY,252,"Malfunction, reaction & complication of GI device or procedure",06,Diseases and Disorders of the Digestive System,2,Moderate,Minor,Medical,Federal/State/Local/VA,,,,N,Y,38052.94,7806.67
Long Island,Nassau,2908000,000511,NYU Winthrop Hospital,50 to 69,115,F,Other Race,Not Span/Hispanic,2,Elective,Home or Self Care,2017,238,Complications of surgical procedures or medical care,076,COLONOSCOPY AND BIOPSY,252,"Malfunction, reaction & complication of GI device or procedure",06,Diseases and Disorders of the Digestive System,1,Minor,Minor,Medical,Blue Cross/Blue Shield,,,,N,N,60578.15,14105.39
Long Island,Nassau,2908000,000511,NYU Winthrop Hospital,70 or Older,115,F,Other Race,Not Span/Hispanic,4,Emergency,Home or Self Care,2017,238,Complications of surgical procedures or medical care,098,OT NON-OR GI THER PRCS,252,"Malfunction, reaction & complication of GI device or procedure",06,Diseases and Disorders of the Digestive System,1,Minor,Moderate,Medical,Medicaid,Medicaid,,,N,Y,115950.46,20884.80
Long Island,Nassau,2908000,000511,NYU Winthrop Hospital,50 to 69,115,F,White,Not Span/Hispanic,2,Emergency,Home or Self Care,2017,238,Complications of surgical procedures or medical care,000,NO PROC,252,"Malfunction, reaction & complication of GI device or procedure",06,Diseases and Disorders of the Digestive System,2,Moderate,Minor,Medical,Private Health Insurance,,,,N,Y,37982.85,7340.82
Long Island,Nassau,2908000,000511,NYU Winthrop Hospital,50 to 69,117,F,White,Not Span/Hispanic,1,Emergency,Home or Self Care,2017,238,Complications of surgical procedures or medical care,088,ABDOMINAL PARACENTESIS,252,"Malfunction, reaction & complication of GI device or procedure",06,Diseases and Disorders of the Digestive System,2,Moderate,Minor,Medical,Blue Cross/Blue Shield,,,,N,Y,43054.26,9759.46
Long Island,Nassau,2908000,000511,NYU Winthrop Hospital,50 to 69,117,F,White,Not Span/Hispanic,7,Emergency,Home or Self Care,2017,238,Complications of surgical procedures or medical care,000,NO PROC,252,"Malfunction, reaction & complication of GI device or procedure",06,Diseases and Disorders of the Digestive System,1,Minor,Minor,Medical,Federal/State/Local/VA,,,,N,Y,64639.19,12972.54
Long Island,Nassau,2908000,000511,NYU Winthrop Hospital,50 to 69,117,F,Black/African American,Not Span/Hispanic,2,Emergency,Home or Self Care,2017,238,Complications of surgical procedures or medical care,070,UP GASTRO ENDOSC/BIOPSY,252,"Malfunction, reaction & complication of GI device or procedure",06,Diseases and Disorders of the Digestive System,2,Moderate,Minor,Medical,Medicare,Medicare,Medicaid,,N,Y,44727.52,9055.18
Long Island,Nassau,2908000,000511,NYU Winthrop Hospital,50 to 69,115,F,White,Not Span/Hispanic,6,Emergency,Skilled Nursing Home,2017,238,Complications of surgical procedures or medical care,092,OTHER BOWEL DX PRCS,252,"Malfunction, reaction & complication of GI device or procedure",06,Diseases and Disorders of the Digestive System,2,Moderate,Moderate,Medical,Medicare,Medicare,Medicaid,,N,Y,124079.59,26362.46
Long Island,Nassau,2908000,000511,NYU Winthrop Hospital,50 to 69,110,F,Other Race,Not Span/Hispanic,5,Emergency,Home or Self Care,2017,238,Complications of surgical procedures or medical care,095,OT NON-OR LW GI THER PR,252,"Malfunction, reaction & complication of GI device or procedure",06,Diseases and Disorders of the Digestive System,2,Moderate,Minor,Medical,Private Health Insurance,,,,N,Y,60714.11,13168.26
Long Island,Nassau,2908000,000511,NYU Winthrop Hospital,50 to 69,115,M,White,Spanish/Hispanic,4,Emergency,Home or Self Care,2017,238,Complications of surgical procedures or medical care,098,OT NON-OR GI THER PRCS,252,"Malfunction, reaction & complication of GI device or procedure",06,Diseases and Disorders of the Digestive System,1,Minor,Minor,Medical,Federal/State/Local/VA,Medicaid,,,N,Y,79808.74,14359.22
Long Island,Nassau,2908000,000511,NYU Winthrop Hospital,70 or Older,115,F,White,Not Span/Hispanic,2,Emergency,Home w/ Home Health Services,2017,238,Complications of surgical procedures or medical care,000,NO PROC,252,"Malfunction, reaction & complication of GI device or procedure",06,Diseases and Disorders of the Digestive System,2,Moderate,Moderate,Medical,Medicare,Medicare,Medicaid,,N,Y,26416.38,5081.82
Long Island,Nassau,2908000,000511,NYU Winthrop Hospital,50 to 69,117,F,White,Not Span/Hispanic,11,Emergency,Skilled Nursing Home,2017,238,Complications of surgical procedures or medical care,031,DX PRCS ON NOSE & MOUTH,252,"Malfunction, reaction & complication of GI device or procedure",06,Diseases and Disorders of the Digestive System,3,Major,Major,Medical,Medicaid,Medicaid,,,N,Y,141120.22,29137.08
Long Island,Nassau,2908000,000511,NYU Winthrop Hospital,30 to 49,117,F,White,Not Span/Hispanic,4,Emergency,Home or Self Care,2017,238,Complications of surgical procedures or medical care,092,OTHER BOWEL DX PRCS,252,"Malfunction, reaction & complication of GI device or procedure",06,Diseases and Disorders of the Digestive System,2,Moderate,Minor,Medical,Medicare,Medicare,Medicaid,,N,Y,54009.36,10812.83
Long Island,Nassau,2908000,000511,NYU Winthrop Hospital,0 to 17,117,M,Black/African American,Not Span/Hispanic,7,Emergency,Home w/ Home Health Services,2017,238,Complications of surgical procedures or medical care,223,ENTERAL/PARENTERAL NUTR,252,"Malfunction, reaction & complication of GI device or procedure",06,Diseases and Disorders of the Digestive System,3,Major,Minor,Medical,Medicaid,Medicaid,,,N,Y,87465.56,21602.76
Long Island,Nassau,2908000,000511,NYU Winthrop Hospital,0 to 17,117,M,Black/African American,Not Span/Hispanic,2,Emergency,Home w/ Home Health Services,2017,238,Complications of surgical procedures or medical care,093,OT NON-OR UP GI THER PR,252,"Malfunction, reaction & complication of GI device or procedure",06,Diseases and Disorders of the Digestive System,3,Major,Minor,Medical,Medicaid,Medicaid,,,N,Y,22800.17,5470.22
