Hospital Service Area,Hospital County,Operating Certificate Number,Permanent Facility Id,Facility Name,Age Group,Zip Code - 3 digits,Gender,Race,Ethnicity,Length of Stay,Type of Admission,Patient Disposition,Discharge Year,CCS Diagnosis Code,CCS Diagnosis Description,CCS Procedure Code,CCS Procedure Description,APR DRG Code,APR DRG Description,APR MDC Code,APR MDC Description,APR Severity of Illness Code,APR Severity of Illness Description,APR Risk of Mortality,APR Medical Surgical Description,Payment Typology 1,Payment Typology 2,Payment Typology 3,Birth Weight,Abortion Edit Indicator,Emergency Department Indicator,Total Charges,Total Costs
New York City,Manhattan,7002053,001463,NYU Langone Hospitals,50 to 69,112,F,White,Not Span/Hispanic,5,Emergency,Home or Self Care,2020,DIG024,POSTPROCEDURAL OR POSTOPERATIVE DIGESTIVE SYSTEM COMPLICATION,GIS007,GI SYSTEM DRAINAGE (EXCLUDING PARACENTESIS),252,"MALFUNCTION, REACTION & COMPLICATION OF GI DEVICE OR PROCEDURE",06,DISEASES AND DISORDERS OF THE DIGESTIVE SYSTEM,2,Moderate,Minor,Medical,Blue Cross/Blue Shield,,,,,Y,64544.82,17876.08
New York City,Manhattan,7002053,001463,NYU Langone Hospitals,50 to 69,OOS,M,White,Not Span/Hispanic,5,Elective,Home or Self Care,2020,DIG024,POSTPROCEDURAL OR POSTOPERATIVE DIGESTIVE SYSTEM COMPLICATION,GIS002,COLONOSCOPY AND PROCTOSCOPY WITH BIOPSY,252,"MALFUNCTION, REACTION & COMPLICATION OF GI DEVICE OR PROCEDURE",06,DISEASES AND DISORDERS OF THE DIGESTIVE SYSTEM,2,Moderate,Minor,Medical,Medicaid,,,,,N,86501.54,21121.57
New York City,Manhattan,7002053,001463,NYU Langone Hospitals,30 to 49,OOS,M,Other Race,Spanish/Hispanic,3,Emergency,Home or Self Care,2020,DIG024,POSTPROCEDURAL OR POSTOPERATIVE DIGESTIVE SYSTEM COMPLICATION,,,252,"MALFUNCTION, REACTION & COMPLICATION OF GI DEVICE OR PROCEDURE",06,DISEASES AND DISORDERS OF THE DIGESTIVE SYSTEM,3,Major,Moderate,Medical,Private Health Insurance,,,,,Y,49038.82,12351.61
New York City,Manhattan,7002053,001463,NYU Langone Hospitals,50 to 69,100,M,White,Unknown,5,Emergency,Home or Self Care,2020,DIG024,POSTPROCEDURAL OR POSTOPERATIVE DIGESTIVE SYSTEM COMPLICATION,GIS025,OTHER GI SYSTEM DEVICE PROCEDURES,252,"MALFUNCTION, REACTION & COMPLICATION OF GI DEVICE OR PROCEDURE",06,DISEASES AND DISORDERS OF THE DIGESTIVE SYSTEM,3,Major,Moderate,Medical,Medicaid,,,,,Y,114688.03,26581.5
New York City,Manhattan,7002053,001463,NYU Langone Hospitals,30 to 49,105,M,White,Not Span/Hispanic,3,Emergency,Home or Self Care,2020,DIG024,POSTPROCEDURAL OR POSTOPERATIVE DIGESTIVE SYSTEM COMPLICATION,,,252,"MALFUNCTION, REACTION & COMPLICATION OF GI DEVICE OR PROCEDURE",06,DISEASES AND DISORDERS OF THE DIGESTIVE SYSTEM,3,Major,Moderate,Medical,Private Health Insurance,,,,,Y,61096.81,14263.65
New York City,Manhattan,7002053,001463,NYU Langone Hospitals,70 or Older,100,M,White,Not Span/Hispanic,1,Emergency,Home or Self Care,2020,DIG024,POSTPROCEDURAL OR POSTOPERATIVE DIGESTIVE SYSTEM COMPLICATION,,,252,"MALFUNCTION, REACTION & COMPLICATION OF GI DEVICE OR PROCEDURE",06,DISEASES AND DISORDERS OF THE DIGESTIVE SYSTEM,3,Major,Minor,Medical,Medicare,Blue Cross/Blue Shield,,,,Y,22002.08,5069.43
New York City,Manhattan,7002053,001463,NYU Langone Hospitals,50 to 69,OOS,F,Black/African American,Not Span/Hispanic,5,Emergency,Home or Self Care,2020,DIG024,POSTPROCEDURAL OR POSTOPERATIVE DIGESTIVE SYSTEM COMPLICATION,HEP007,BILIARY AND PANCREATIC CALCULUS REMOVAL,252,"MALFUNCTION, REACTION & COMPLICATION OF GI DEVICE OR PROCEDURE",06,DISEASES AND DISORDERS OF THE DIGESTIVE SYSTEM,3,Major,Major,Medical,Medicaid,,,,,N,85160.96,21285.12
New York City,Manhattan,7002053,001463,NYU Langone Hospitals,50 to 69,115,M,White,Spanish/Hispanic,7,Emergency,Home w/ Home Health Services,2020,DIG024,POSTPROCEDURAL OR POSTOPERATIVE DIGESTIVE SYSTEM COMPLICATION,GIS006,PARACENTESIS,252,"MALFUNCTION, REACTION & COMPLICATION OF GI DEVICE OR PROCEDURE",06,DISEASES AND DISORDERS OF THE DIGESTIVE SYSTEM,4,Extreme,Moderate,Medical,Private Health Insurance,,,,,Y,124620.45,30107.24
New York City,Manhattan,7002053,001463,NYU Langone Hospitals,50 to 69,OOS,F,White,Not Span/Hispanic,10,Urgent,Home w/ Home Health Services,2020,DIG024,POSTPROCEDURAL OR POSTOPERATIVE DIGESTIVE SYSTEM COMPLICATION,CAR024,VENOUS AND ARTERIAL CATHETER PLACEMENT,252,"MALFUNCTION, REACTION & COMPLICATION OF GI DEVICE OR PROCEDURE",06,DISEASES AND DISORDERS OF THE DIGESTIVE SYSTEM,2,Moderate,Minor,Medical,Blue Cross/Blue Shield,,,,,N,185177.69,49734.44
New York City,Manhattan,7002053,001463,NYU Langone Hospitals,50 to 69,113,M,Other Race,Not Span/Hispanic,2,Emergency,Home or Self Care,2020,DIG024,POSTPROCEDURAL OR POSTOPERATIVE DIGESTIVE SYSTEM COMPLICATION,GIS004,GI SYSTEM ENDOSCOPY WITHOUT BIOPSY (DIAGNOSTIC),252,"MALFUNCTION, REACTION & COMPLICATION OF GI DEVICE OR PROCEDURE",06,DISEASES AND DISORDERS OF THE DIGESTIVE SYSTEM,3,Major,Minor,Medical,Private Health Insurance,,,,,Y,57381.99,11295.46
New York City,Manhattan,7002053,001463,NYU Langone Hospitals,0 to 17,100,M,White,Not Span/Hispanic,1,Emergency,Home w/ Home Health Services,2020,DIG024,POSTPROCEDURAL OR POSTOPERATIVE DIGESTIVE SYSTEM COMPLICATION,ADM017,ADMINISTRATION OF NUTRITIONAL AND ELECTROLYTIC SUBSTANCES,252,"MALFUNCTION, REACTION & COMPLICATION OF GI DEVICE OR PROCEDURE",06,DISEASES AND DISORDERS OF THE DIGESTIVE SYSTEM,3,Major,Minor,Medical,Blue Cross/Blue Shield,,,,,Y,16573.48,4425.83
New York City,Manhattan,7002053,001463,NYU Langone Hospitals,70 or Older,111,F,White,Not Span/Hispanic,54,Emergency,Skilled Nursing Home,2020,DIG024,POSTPROCEDURAL OR POSTOPERATIVE DIGESTIVE SYSTEM COMPLICATION,GIS027,"UPPER GI THERAPEUTIC PROCEDURES, NEC (ENDOSCOPIC)",252,"MALFUNCTION, REACTION & COMPLICATION OF GI DEVICE OR PROCEDURE",06,DISEASES AND DISORDERS OF THE DIGESTIVE SYSTEM,3,Major,Major,Medical,Medicare,Medicaid,,,,Y,425095,173935.39
New York City,Manhattan,7002053,001463,NYU Langone Hospitals,70 or Older,100,M,White,Not Span/Hispanic,2,Emergency,Home or Self Care,2020,DIG024,POSTPROCEDURAL OR POSTOPERATIVE DIGESTIVE SYSTEM COMPLICATION,SKB002,INCISION AND DRAINAGE OF SKIN,252,"MALFUNCTION, REACTION & COMPLICATION OF GI DEVICE OR PROCEDURE",06,DISEASES AND DISORDERS OF THE DIGESTIVE SYSTEM,3,Major,Minor,Medical,Medicare,Blue Cross/Blue Shield,,,,Y,54014.88,11120.06
New York City,Manhattan,7002053,001463,NYU Langone Hospitals,18 to 29,100,F,White,Not Span/Hispanic,3,Emergency,Home or Self Care,2020,DIG024,POSTPROCEDURAL OR POSTOPERATIVE DIGESTIVE SYSTEM COMPLICATION,GIS007,GI SYSTEM DRAINAGE (EXCLUDING PARACENTESIS),252,"MALFUNCTION, REACTION & COMPLICATION OF GI DEVICE OR PROCEDURE",06,DISEASES AND DISORDERS OF THE DIGESTIVE SYSTEM,1,Minor,Minor,Medical,Blue Cross/Blue Shield,,,,,Y,44279.29,12221.99
New York City,Manhattan,7002053,001463,NYU Langone Hospitals,70 or Older,112,M,White,Not Span/Hispanic,3,Emergency,Left Against Medical Advice,2020,DIG024,POSTPROCEDURAL OR POSTOPERATIVE DIGESTIVE SYSTEM COMPLICATION,GIS004,GI SYSTEM ENDOSCOPY WITHOUT BIOPSY (DIAGNOSTIC),252,"MALFUNCTION, REACTION & COMPLICATION OF GI DEVICE OR PROCEDURE",06,DISEASES AND DISORDERS OF THE DIGESTIVE SYSTEM,2,Moderate,Moderate,Medical,Medicare,Medicaid,,,,Y,84655.16,16732.2
New York City,Manhattan,7002053,001463,NYU Langone Hospitals,0 to 17,109,F,Other Race,Not Span/Hispanic,7,Emergency,Skilled Nursing Home,2020,DIG024,POSTPROCEDURAL OR POSTOPERATIVE DIGESTIVE SYSTEM COMPLICATION,MAM011,ELECTROENCEPHALOGRAM (EEG),252,"MALFUNCTION, REACTION & COMPLICATION OF GI DEVICE OR PROCEDURE",06,DISEASES AND DISORDERS OF THE DIGESTIVE SYSTEM,4,Extreme,Major,Medical,Medicaid,,,,,Y,185135.25,41338.34
New York City,Manhattan,7002053,001463,NYU Langone Hospitals,50 to 69,112,F,Black/African American,Not Span/Hispanic,6,Emergency,Home or Self Care,2020,DIG024,POSTPROCEDURAL OR POSTOPERATIVE DIGESTIVE SYSTEM COMPLICATION,GIS004,GI SYSTEM ENDOSCOPY WITHOUT BIOPSY (DIAGNOSTIC),252,"MALFUNCTION, REACTION & COMPLICATION OF GI DEVICE OR PROCEDURE",06,DISEASES AND DISORDERS OF THE DIGESTIVE SYSTEM,3,Major,Moderate,Medical,Private Health Insurance,,,,,N,104850.04,26495.27
New York City,Manhattan,7002053,001463,NYU Langone Hospitals,70 or Older,100,M,White,Not Span/Hispanic,1,Emergency,Home or Self Care,2020,DIG024,POSTPROCEDURAL OR POSTOPERATIVE DIGESTIVE SYSTEM COMPLICATION,GIS025,OTHER GI SYSTEM DEVICE PROCEDURES,252,"MALFUNCTION, REACTION & COMPLICATION OF GI DEVICE OR PROCEDURE",06,DISEASES AND DISORDERS OF THE DIGESTIVE SYSTEM,2,Moderate,Minor,Medical,Medicare,Medicaid,,,,Y,48698.73,13615.06
New York City,Manhattan,7002053,001463,NYU Langone Hospitals,30 to 49,113,F,White,Not Span/Hispanic,24,Emergency,Home w/ Home Health Services,2020,DIG024,POSTPROCEDURAL OR POSTOPERATIVE DIGESTIVE SYSTEM COMPLICATION,GIS007,GI SYSTEM DRAINAGE (EXCLUDING PARACENTESIS),252,"MALFUNCTION, REACTION & COMPLICATION OF GI DEVICE OR PROCEDURE",06,DISEASES AND DISORDERS OF THE DIGESTIVE SYSTEM,3,Major,Moderate,Medical,Medicare,,,,,Y,295231.98,95067.68
New York City,Manhattan,7002053,001463,NYU Langone Hospitals,70 or Older,118,F,White,Not Span/Hispanic,2,Emergency,Home w/ Home Health Services,2020,DIG024,POSTPROCEDURAL OR POSTOPERATIVE DIGESTIVE SYSTEM COMPLICATION,GIS027,"UPPER GI THERAPEUTIC PROCEDURES, NEC (ENDOSCOPIC)",252,"MALFUNCTION, REACTION & COMPLICATION OF GI DEVICE OR PROCEDURE",06,DISEASES AND DISORDERS OF THE DIGESTIVE SYSTEM,2,Moderate,Minor,Medical,Medicare,,,,,Y,63128.7,13717.77
New York City,Manhattan,7002053,001463,NYU Langone Hospitals,50 to 69,100,M,White,Not Span/Hispanic,1,Emergency,Home or Self Care,2020,DIG024,POSTPROCEDURAL OR POSTOPERATIVE DIGESTIVE SYSTEM COMPLICATION,ADM018,IRRIGATION (DIAGNOSTIC AND THERAPEUTIC),252,"MALFUNCTION, REACTION & COMPLICATION OF GI DEVICE OR PROCEDURE",06,DISEASES AND DISORDERS OF THE DIGESTIVE SYSTEM,3,Major,Moderate,Medical,Medicare,,,,,Y,23832.63,7870.56
New York City,Manhattan,7002053,001463,NYU Langone Hospitals,50 to 69,100,F,Other Race,Spanish/Hispanic,3,Emergency,Home or Self Care,2020,DIG024,POSTPROCEDURAL OR POSTOPERATIVE DIGESTIVE SYSTEM COMPLICATION,ADM001,TRANSFUSION OF BLOOD AND BLOOD PRODUCTS,252,"MALFUNCTION, REACTION & COMPLICATION OF GI DEVICE OR PROCEDURE",06,DISEASES AND DISORDERS OF THE DIGESTIVE SYSTEM,2,Moderate,Minor,Medical,Medicaid,,,,,Y,56459.41,13619.8
New York City,Manhattan,7002053,001463,NYU Langone Hospitals,30 to 49,112,F,Other Race,Not Span/Hispanic,5,Emergency,Home w/ Home Health Services,2020,DIG024,POSTPROCEDURAL OR POSTOPERATIVE DIGESTIVE SYSTEM COMPLICATION,,,252,"MALFUNCTION, REACTION & COMPLICATION OF GI DEVICE OR PROCEDURE",06,DISEASES AND DISORDERS OF THE DIGESTIVE SYSTEM,2,Moderate,Minor,Medical,Medicaid,,,,,Y,56896.31,17691.24
New York City,Manhattan,7002053,001463,NYU Langone Hospitals,50 to 69,112,F,Other Race,Not Span/Hispanic,4,Emergency,Home or Self Care,2020,DIG024,POSTPROCEDURAL OR POSTOPERATIVE DIGESTIVE SYSTEM COMPLICATION,,,252,"MALFUNCTION, REACTION & COMPLICATION OF GI DEVICE OR PROCEDURE",06,DISEASES AND DISORDERS OF THE DIGESTIVE SYSTEM,2,Moderate,Moderate,Medical,Private Health Insurance,,,,,Y,62397.02,16078.16
New York City,Manhattan,7002053,001463,NYU Langone Hospitals,50 to 69,115,F,White,Not Span/Hispanic,1,Emergency,Home or Self Care,2020,DIG024,POSTPROCEDURAL OR POSTOPERATIVE DIGESTIVE SYSTEM COMPLICATION,,,252,"MALFUNCTION, REACTION & COMPLICATION OF GI DEVICE OR PROCEDURE",06,DISEASES AND DISORDERS OF THE DIGESTIVE SYSTEM,2,Moderate,Moderate,Medical,Private Health Insurance,,,,,Y,25998.94,4906.44
New York City,Manhattan,7002053,001463,NYU Langone Hospitals,30 to 49,117,M,White,Not Span/Hispanic,2,Emergency,Home or Self Care,2020,DIG024,POSTPROCEDURAL OR POSTOPERATIVE DIGESTIVE SYSTEM COMPLICATION,HEP008,COMMON BILE DUCT SPHINCTEROTOMY AND STENTING,252,"MALFUNCTION, REACTION & COMPLICATION OF GI DEVICE OR PROCEDURE",06,DISEASES AND DISORDERS OF THE DIGESTIVE SYSTEM,3,Major,Major,Medical,Medicare,Blue Cross/Blue Shield,,,,Y,98717.61,15213.74
New York City,Manhattan,7002053,001463,NYU Langone Hospitals,50 to 69,112,F,Multi-racial,Not Span/Hispanic,7,Urgent,Skilled Nursing Home,2020,DIG024,POSTPROCEDURAL OR POSTOPERATIVE DIGESTIVE SYSTEM COMPLICATION,MHT005,"MENTAL HEALTH PROCEDURES, NEC",252,"MALFUNCTION, REACTION & COMPLICATION OF GI DEVICE OR PROCEDURE",06,DISEASES AND DISORDERS OF THE DIGESTIVE SYSTEM,3,Major,Moderate,Medical,Private Health Insurance,,,,,N,62551.24,23478.64
New York City,Manhattan,7002053,001463,NYU Langone Hospitals,18 to 29,100,M,Other Race,Unknown,4,Emergency,Home or Self Care,2020,DIG024,POSTPROCEDURAL OR POSTOPERATIVE DIGESTIVE SYSTEM COMPLICATION,,,252,"MALFUNCTION, REACTION & COMPLICATION OF GI DEVICE OR PROCEDURE",06,DISEASES AND DISORDERS OF THE DIGESTIVE SYSTEM,4,Extreme,Major,Medical,Medicaid,,,,,Y,56190.99,14898.12
New York City,Manhattan,7002053,001463,NYU Langone Hospitals,30 to 49,112,M,White,Not Span/Hispanic,6,Emergency,Home w/ Home Health Services,2020,DIG024,POSTPROCEDURAL OR POSTOPERATIVE DIGESTIVE SYSTEM COMPLICATION,GIS007,GI SYSTEM DRAINAGE (EXCLUDING PARACENTESIS),252,"MALFUNCTION, REACTION & COMPLICATION OF GI DEVICE OR PROCEDURE",06,DISEASES AND DISORDERS OF THE DIGESTIVE SYSTEM,1,Minor,Minor,Medical,Medicaid,,,,,Y,89079.41,22629.27
New York City,Manhattan,7002053,001463,NYU Langone Hospitals,50 to 69,112,M,White,Not Span/Hispanic,14,Emergency,Home w/ Home Health Services,2020,DIG024,POSTPROCEDURAL OR POSTOPERATIVE DIGESTIVE SYSTEM COMPLICATION,CAR024,VENOUS AND ARTERIAL CATHETER PLACEMENT,252,"MALFUNCTION, REACTION & COMPLICATION OF GI DEVICE OR PROCEDURE",06,DISEASES AND DISORDERS OF THE DIGESTIVE SYSTEM,4,Extreme,Major,Medical,Private Health Insurance,,,,,Y,259139.71,58175.37
New York City,Manhattan,7002053,001463,NYU Langone Hospitals,30 to 49,100,M,White,Not Span/Hispanic,1,Emergency,Home or Self Care,2020,DIG024,POSTPROCEDURAL OR POSTOPERATIVE DIGESTIVE SYSTEM COMPLICATION,GIS025,OTHER GI SYSTEM DEVICE PROCEDURES,252,"MALFUNCTION, REACTION & COMPLICATION OF GI DEVICE OR PROCEDURE",06,DISEASES AND DISORDERS OF THE DIGESTIVE SYSTEM,1,Minor,Minor,Medical,Blue Cross/Blue Shield,,,,,Y,35920.61,9458.86
New York City,Manhattan,7002053,001463,NYU Langone Hospitals,0 to 17,,F,Multi-racial,Not Span/Hispanic,11,Urgent,Hospice - Home,2020,DIG024,POSTPROCEDURAL OR POSTOPERATIVE DIGESTIVE SYSTEM COMPLICATION,,,252,"MALFUNCTION, REACTION & COMPLICATION OF GI DEVICE OR PROCEDURE",06,DISEASES AND DISORDERS OF THE DIGESTIVE SYSTEM,4,Extreme,Major,Medical,Medicaid,,,,,N,104041.33,33041.94
New York City,Manhattan,7002053,001463,NYU Langone Hospitals,70 or Older,100,M,White,Not Span/Hispanic,2,Emergency,Home or Self Care,2020,DIG024,POSTPROCEDURAL OR POSTOPERATIVE DIGESTIVE SYSTEM COMPLICATION,GIS027,"UPPER GI THERAPEUTIC PROCEDURES, NEC (ENDOSCOPIC)",252,"MALFUNCTION, REACTION & COMPLICATION OF GI DEVICE OR PROCEDURE",06,DISEASES AND DISORDERS OF THE DIGESTIVE SYSTEM,2,Moderate,Moderate,Medical,Medicare,Medicare,,,,Y,108774.1,19108.9
New York City,Manhattan,7002053,001463,NYU Langone Hospitals,50 to 69,112,M,White,Unknown,4,Emergency,Skilled Nursing Home,2020,DIG024,POSTPROCEDURAL OR POSTOPERATIVE DIGESTIVE SYSTEM COMPLICATION,ADM017,ADMINISTRATION OF NUTRITIONAL AND ELECTROLYTIC SUBSTANCES,252,"MALFUNCTION, REACTION & COMPLICATION OF GI DEVICE OR PROCEDURE",06,DISEASES AND DISORDERS OF THE DIGESTIVE SYSTEM,3,Major,Major,Medical,Medicaid,,,,,Y,54941.27,15237.07
New York City,Manhattan,7002053,001463,NYU Langone Hospitals,18 to 29,112,M,White,Not Span/Hispanic,6,Emergency,Home or Self Care,2020,DIG024,POSTPROCEDURAL OR POSTOPERATIVE DIGESTIVE SYSTEM COMPLICATION,GIS007,GI SYSTEM DRAINAGE (EXCLUDING PARACENTESIS),252,"MALFUNCTION, REACTION & COMPLICATION OF GI DEVICE OR PROCEDURE",06,DISEASES AND DISORDERS OF THE DIGESTIVE SYSTEM,2,Moderate,Moderate,Medical,Private Health Insurance,Private Health Insurance,,,,Y,84764.88,23017.05
New York City,Manhattan,7002053,001463,NYU Langone Hospitals,50 to 69,114,F,Other Race,Not Span/Hispanic,4,Emergency,Home or Self Care,2020,DIG024,POSTPROCEDURAL OR POSTOPERATIVE DIGESTIVE SYSTEM COMPLICATION,,,252,"MALFUNCTION, REACTION & COMPLICATION OF GI DEVICE OR PROCEDURE",06,DISEASES AND DISORDERS OF THE DIGESTIVE SYSTEM,2,Moderate,Minor,Medical,Medicaid,,,,,Y,93258.03,23587.76
New York City,Manhattan,7002053,001463,NYU Langone Hospitals,30 to 49,117,M,White,Not Span/Hispanic,4,Emergency,Home w/ Home Health Services,2020,DIG024,POSTPROCEDURAL OR POSTOPERATIVE DIGESTIVE SYSTEM COMPLICATION,,,252,"MALFUNCTION, REACTION & COMPLICATION OF GI DEVICE OR PROCEDURE",06,DISEASES AND DISORDERS OF THE DIGESTIVE SYSTEM,2,Moderate,Minor,Medical,Private Health Insurance,,,,,N,45694.92,14277.35
New York City,Manhattan,7002053,001463,NYU Langone Hospitals,50 to 69,104,F,Other Race,Spanish/Hispanic,6,Emergency,Home or Self Care,2020,DIG024,POSTPROCEDURAL OR POSTOPERATIVE DIGESTIVE SYSTEM COMPLICATION,GIS007,GI SYSTEM DRAINAGE (EXCLUDING PARACENTESIS),252,"MALFUNCTION, REACTION & COMPLICATION OF GI DEVICE OR PROCEDURE",06,DISEASES AND DISORDERS OF THE DIGESTIVE SYSTEM,2,Moderate,Moderate,Medical,Private Health Insurance,,,,,Y,171961.56,32919.89
New York City,Manhattan,7002053,001463,NYU Langone Hospitals,30 to 49,100,F,White,Not Span/Hispanic,1,Emergency,Home or Self Care,2020,DIG024,POSTPROCEDURAL OR POSTOPERATIVE DIGESTIVE SYSTEM COMPLICATION,,,252,"MALFUNCTION, REACTION & COMPLICATION OF GI DEVICE OR PROCEDURE",06,DISEASES AND DISORDERS OF THE DIGESTIVE SYSTEM,1,Minor,Minor,Medical,Private Health Insurance,,,,,Y,27971.07,5514.31
New York City,Manhattan,7002053,001463,NYU Langone Hospitals,30 to 49,100,F,White,Not Span/Hispanic,1,Emergency,Home or Self Care,2020,DIG024,POSTPROCEDURAL OR POSTOPERATIVE DIGESTIVE SYSTEM COMPLICATION,GIS001,ESOPHAGOGASTRODUODENOSCOPY (EGD) WITH BIOPSY,252,"MALFUNCTION, REACTION & COMPLICATION OF GI DEVICE OR PROCEDURE",06,DISEASES AND DISORDERS OF THE DIGESTIVE SYSTEM,2,Moderate,Moderate,Medical,Private Health Insurance,,,,,Y,46209.61,9326.31
New York City,Manhattan,7002053,001463,NYU Langone Hospitals,30 to 49,100,F,Other Race,Not Span/Hispanic,2,Emergency,Home or Self Care,2020,DIG024,POSTPROCEDURAL OR POSTOPERATIVE DIGESTIVE SYSTEM COMPLICATION,,,252,"MALFUNCTION, REACTION & COMPLICATION OF GI DEVICE OR PROCEDURE",06,DISEASES AND DISORDERS OF THE DIGESTIVE SYSTEM,2,Moderate,Moderate,Medical,Private Health Insurance,,,,,Y,50945.93,12117.86
New York City,Manhattan,7002053,001463,NYU Langone Hospitals,70 or Older,OOS,F,Other Race,Not Span/Hispanic,4,Emergency,Home or Self Care,2020,DIG024,POSTPROCEDURAL OR POSTOPERATIVE DIGESTIVE SYSTEM COMPLICATION,,,252,"MALFUNCTION, REACTION & COMPLICATION OF GI DEVICE OR PROCEDURE",06,DISEASES AND DISORDERS OF THE DIGESTIVE SYSTEM,2,Moderate,Minor,Medical,Blue Cross/Blue Shield,Medicare,,,,Y,80674.95,24003.41
New York City,Manhattan,7002053,001463,NYU Langone Hospitals,70 or Older,112,M,Black/African American,Not Span/Hispanic,1,Emergency,Home or Self Care,2020,DIG024,POSTPROCEDURAL OR POSTOPERATIVE DIGESTIVE SYSTEM COMPLICATION,GIS004,GI SYSTEM ENDOSCOPY WITHOUT BIOPSY (DIAGNOSTIC),252,"MALFUNCTION, REACTION & COMPLICATION OF GI DEVICE OR PROCEDURE",06,DISEASES AND DISORDERS OF THE DIGESTIVE SYSTEM,2,Moderate,Moderate,Medical,Private Health Insurance,,,,,Y,39487.89,7257.08
New York City,Manhattan,7002053,001463,NYU Langone Hospitals,70 or Older,111,F,White,Spanish/Hispanic,3,Emergency,Home w/ Home Health Services,2020,DIG024,POSTPROCEDURAL OR POSTOPERATIVE DIGESTIVE SYSTEM COMPLICATION,,,252,"MALFUNCTION, REACTION & COMPLICATION OF GI DEVICE OR PROCEDURE",06,DISEASES AND DISORDERS OF THE DIGESTIVE SYSTEM,2,Moderate,Minor,Medical,Medicare,Medicaid,,,,Y,66004.94,17083.81
New York City,Manhattan,7002053,001463,NYU Langone Hospitals,18 to 29,,M,Multi-racial,Spanish/Hispanic,1,Emergency,Home or Self Care,2020,DIG024,POSTPROCEDURAL OR POSTOPERATIVE DIGESTIVE SYSTEM COMPLICATION,,,252,"MALFUNCTION, REACTION & COMPLICATION OF GI DEVICE OR PROCEDURE",06,DISEASES AND DISORDERS OF THE DIGESTIVE SYSTEM,2,Moderate,Minor,Medical,Private Health Insurance,,,,,Y,36329.43,12274.4
New York City,Manhattan,7002053,001463,NYU Langone Hospitals,30 to 49,112,M,White,Not Span/Hispanic,2,Emergency,Home or Self Care,2020,DIG024,POSTPROCEDURAL OR POSTOPERATIVE DIGESTIVE SYSTEM COMPLICATION,GIS007,GI SYSTEM DRAINAGE (EXCLUDING PARACENTESIS),252,"MALFUNCTION, REACTION & COMPLICATION OF GI DEVICE OR PROCEDURE",06,DISEASES AND DISORDERS OF THE DIGESTIVE SYSTEM,2,Moderate,Minor,Medical,Medicaid,,,,,Y,57537.8,13131.05
New York City,Manhattan,7002053,001463,NYU Langone Hospitals,50 to 69,113,F,Other Race,Spanish/Hispanic,2,Emergency,Home or Self Care,2020,DIG024,POSTPROCEDURAL OR POSTOPERATIVE DIGESTIVE SYSTEM COMPLICATION,,,252,"MALFUNCTION, REACTION & COMPLICATION OF GI DEVICE OR PROCEDURE",06,DISEASES AND DISORDERS OF THE DIGESTIVE SYSTEM,2,Moderate,Minor,Medical,Medicare,Medicaid,,,,Y,44431.88,11810.8
New York City,Manhattan,7002053,001463,NYU Langone Hospitals,50 to 69,112,F,Other Race,Not Span/Hispanic,3,Emergency,Home or Self Care,2020,DIG024,POSTPROCEDURAL OR POSTOPERATIVE DIGESTIVE SYSTEM COMPLICATION,,,252,"MALFUNCTION, REACTION & COMPLICATION OF GI DEVICE OR PROCEDURE",06,DISEASES AND DISORDERS OF THE DIGESTIVE SYSTEM,2,Moderate,Moderate,Medical,Blue Cross/Blue Shield,,,,,Y,58732.14,14331.37
New York City,Manhattan,7002053,001463,NYU Langone Hospitals,50 to 69,100,M,Other Race,Not Span/Hispanic,3,Emergency,Skilled Nursing Home,2020,DIG024,POSTPROCEDURAL OR POSTOPERATIVE DIGESTIVE SYSTEM COMPLICATION,GIS025,OTHER GI SYSTEM DEVICE PROCEDURES,252,"MALFUNCTION, REACTION & COMPLICATION OF GI DEVICE OR PROCEDURE",06,DISEASES AND DISORDERS OF THE DIGESTIVE SYSTEM,2,Moderate,Major,Medical,Medicare,Medicaid,,,,Y,57380.99,19105.04
New York City,Manhattan,7002053,001463,NYU Langone Hospitals,50 to 69,100,M,White,Spanish/Hispanic,1,Emergency,Home or Self Care,2020,DIG024,POSTPROCEDURAL OR POSTOPERATIVE DIGESTIVE SYSTEM COMPLICATION,GIS029,"LOWER GI THERAPEUTIC PROCEDURES, NEC (EXCLUDING OPEN AND LAPAROSCOPIC)",252,"MALFUNCTION, REACTION & COMPLICATION OF GI DEVICE OR PROCEDURE",06,DISEASES AND DISORDERS OF THE DIGESTIVE SYSTEM,2,Moderate,Moderate,Medical,Private Health Insurance,,,,,Y,176608.53,27214.6
New York City,Manhattan,7002053,001463,NYU Langone Hospitals,70 or Older,101,F,White,Not Span/Hispanic,3,Emergency,Home or Self Care,2020,DIG024,POSTPROCEDURAL OR POSTOPERATIVE DIGESTIVE SYSTEM COMPLICATION,,,252,"MALFUNCTION, REACTION & COMPLICATION OF GI DEVICE OR PROCEDURE",06,DISEASES AND DISORDERS OF THE DIGESTIVE SYSTEM,2,Moderate,Minor,Medical,Medicare,Blue Cross/Blue Shield,,,,Y,40725.25,15380.07
New York City,Manhattan,7002053,001463,NYU Langone Hospitals,50 to 69,104,F,Other Race,Spanish/Hispanic,3,Emergency,Home or Self Care,2020,DIG024,POSTPROCEDURAL OR POSTOPERATIVE DIGESTIVE SYSTEM COMPLICATION,,,252,"MALFUNCTION, REACTION & COMPLICATION OF GI DEVICE OR PROCEDURE",06,DISEASES AND DISORDERS OF THE DIGESTIVE SYSTEM,2,Moderate,Minor,Medical,Private Health Insurance,,,,,Y,58487.74,16732.56
New York City,Manhattan,7002053,001463,NYU Langone Hospitals,0 to 17,100,M,Other Race,Not Span/Hispanic,18,Emergency,Home or Self Care,2020,DIG024,POSTPROCEDURAL OR POSTOPERATIVE DIGESTIVE SYSTEM COMPLICATION,CAR024,VENOUS AND ARTERIAL CATHETER PLACEMENT,252,"MALFUNCTION, REACTION & COMPLICATION OF GI DEVICE OR PROCEDURE",06,DISEASES AND DISORDERS OF THE DIGESTIVE SYSTEM,3,Major,Moderate,Medical,Private Health Insurance,,,,,Y,238921.84,90054.07
New York City,Manhattan,7002053,001463,NYU Langone Hospitals,50 to 69,100,M,White,Unknown,1,Emergency,Left Against Medical Advice,2020,DIG024,POSTPROCEDURAL OR POSTOPERATIVE DIGESTIVE SYSTEM COMPLICATION,,,252,"MALFUNCTION, REACTION & COMPLICATION OF GI DEVICE OR PROCEDURE",06,DISEASES AND DISORDERS OF THE DIGESTIVE SYSTEM,2,Moderate,Minor,Medical,Medicaid,,,,,Y,33074.79,7689.92