Hospital Service Area,Hospital County,Operating Certificate Number,Permanent Facility Id,Facility Name,Age Group,Zip Code - 3 digits,Gender,Race,Ethnicity,Length of Stay,Type of Admission,Patient Disposition,Discharge Year,CCS Diagnosis Code,CCS Diagnosis Description,CCS Procedure Code,CCS Procedure Description,APR DRG Code,APR DRG Description,APR MDC Code,APR MDC Description,APR Severity of Illness Code,APR Severity of Illness Description,APR Risk of Mortality,APR Medical Surgical Description,Payment Typology 1,Payment Typology 2,Payment Typology 3,Birth Weight,Abortion Edit Indicator,Emergency Department Indicator,Total Charges,Total Costs
New York City,Manhattan,7002001,001438,Bellevue Hospital Center,70 or Older,113,M,Other Race,Spanish/Hispanic,1,Emergency,Home or Self Care,2019,DIG021,GASTROINTESTINAL HEMORRHAGE,GIS004,GI SYSTEM ENDOSCOPY WITHOUT BIOPSY (DIAGNOSTIC),253,OTHER & UNSPECIFIED GASTROINTESTINAL HEMORRHAGE,06,DISEASES AND DISORDERS OF THE DIGESTIVE SYSTEM,2,Moderate,Moderate,Medical,Department of Corrections,,,,,false,6966.53,4629.96
New York City,Manhattan,7002001,001438,Bellevue Hospital Center,50 to 69,112,M,Black/African American,Not Span/Hispanic,3,Emergency,Home or Self Care,2019,DIG021,GASTROINTESTINAL HEMORRHAGE,ADM001,TRANSFUSION OF BLOOD AND BLOOD PRODUCTS,253,OTHER & UNSPECIFIED GASTROINTESTINAL HEMORRHAGE,06,DISEASES AND DISORDERS OF THE DIGESTIVE SYSTEM,3,Major,Moderate,Medical,Medicaid,Medicaid,,,,true,18371.52,12209.71
New York City,Manhattan,7002001,001438,Bellevue Hospital Center,30 to 49,112,M,Other Race,Spanish/Hispanic,2,Emergency,Left Against Medical Advice,2019,DIG021,GASTROINTESTINAL HEMORRHAGE,SUD001,SUBSTANCE USE DETOXIFICATION,253,OTHER & UNSPECIFIED GASTROINTESTINAL HEMORRHAGE,06,DISEASES AND DISORDERS OF THE DIGESTIVE SYSTEM,2,Moderate,Minor,Medical,Medicaid,,,,,true,16408,10904.76
New York City,Manhattan,7002001,001438,Bellevue Hospital Center,50 to 69,112,M,Other Race,Not Span/Hispanic,2,Emergency,Home or Self Care,2019,DIG021,GASTROINTESTINAL HEMORRHAGE,GIS001,ESOPHAGOGASTRODUODENOSCOPY (EGD) WITH BIOPSY,253,OTHER & UNSPECIFIED GASTROINTESTINAL HEMORRHAGE,06,DISEASES AND DISORDERS OF THE DIGESTIVE SYSTEM,2,Moderate,Moderate,Medical,Medicaid,,,,,true,13421.52,8919.94
Long Island,Suffolk,5151001,000245,Stony Brook University Hospital,70 or Older,117,F,White,Not Span/Hispanic,4,Emergency,Home w/ Home Health Services,2019,DIG025,OTHER SPECIFIED AND UNSPECIFIED GASTROINTESTINAL DISORDERS,GIS001,ESOPHAGOGASTRODUODENOSCOPY (EGD) WITH BIOPSY,253,OTHER & UNSPECIFIED GASTROINTESTINAL HEMORRHAGE,06,DISEASES AND DISORDERS OF THE DIGESTIVE SYSTEM,3,Major,Extreme,Medical,Medicare,Private Health Insurance,,,,true,64855.64,17187.77
New York City,Manhattan,7002054,001458,New York-Presbyterian Hospital - New York Weill Cornell Center,70 or Older,100,M,Black/African American,Not Span/Hispanic,4,Emergency,Home or Self Care,2019,DIG008,OTHER SPECIFIED AND UNSPECIFIED DISORDERS OF STOMACH AND DUODENUM,GNR004,ENDOSCOPIC CONTROL OF BLEEDING,253,OTHER & UNSPECIFIED GASTROINTESTINAL HEMORRHAGE,06,DISEASES AND DISORDERS OF THE DIGESTIVE SYSTEM,2,Moderate,Moderate,Medical,Medicare,Medicare,Self-Pay,,,true,54761.41,12746.46
Western NY,Erie,1401013,000292,Sisters of Charity Hospital - St. Joseph Campus,70 or Older,142,F,Other Race,Not Span/Hispanic,4,Emergency,Home or Self Care,2019,DIG021,GASTROINTESTINAL HEMORRHAGE,GIS001,ESOPHAGOGASTRODUODENOSCOPY (EGD) WITH BIOPSY,253,OTHER & UNSPECIFIED GASTROINTESTINAL HEMORRHAGE,06,DISEASES AND DISORDERS OF THE DIGESTIVE SYSTEM,2,Moderate,Moderate,Medical,Medicare,Private Health Insurance,,,,true,20636.31,7456.57
New York City,Kings,7001016,001301,Kings County Hospital Center,50 to 69,112,M,Black/African American,Not Span/Hispanic,2,Emergency,Home or Self Care,2019,DIG021,GASTROINTESTINAL HEMORRHAGE,,,253,OTHER & UNSPECIFIED GASTROINTESTINAL HEMORRHAGE,06,DISEASES AND DISORDERS OF THE DIGESTIVE SYSTEM,1,Minor,Minor,Medical,Medicaid,,,,,true,13738.08,9759
New York City,Kings,7001016,001301,Kings County Hospital Center,50 to 69,112,M,Black/African American,Not Span/Hispanic,2,Emergency,Home or Self Care,2019,DIG021,GASTROINTESTINAL HEMORRHAGE,MAM006,PACEMAKER AND DEFIBRILLATOR INTERROGATION,253,OTHER & UNSPECIFIED GASTROINTESTINAL HEMORRHAGE,06,DISEASES AND DISORDERS OF THE DIGESTIVE SYSTEM,2,Moderate,Moderate,Medical,Medicaid,,,,,true,15861.82,11267.62
Hudson Valley,Westchester,5932000,001129,Phelps Hospital,30 to 49,125,M,White,Not Span/Hispanic,3,Emergency,Home or Self Care,2019,DIG021,GASTROINTESTINAL HEMORRHAGE,ADM001,TRANSFUSION OF BLOOD AND BLOOD PRODUCTS,253,OTHER & UNSPECIFIED GASTROINTESTINAL HEMORRHAGE,06,DISEASES AND DISORDERS OF THE DIGESTIVE SYSTEM,3,Major,Major,Medical,Private Health Insurance,,,,,true,42363.72,12609.69
Hudson Valley,Dutchess,1327000,000192,Northern Dutchess Hospital,70 or Older,125,F,White,Not Span/Hispanic,2,Emergency,Skilled Nursing Home,2019,DIG021,GASTROINTESTINAL HEMORRHAGE,,,253,OTHER & UNSPECIFIED GASTROINTESTINAL HEMORRHAGE,06,DISEASES AND DISORDERS OF THE DIGESTIVE SYSTEM,1,Minor,Minor,Medical,Medicare,Blue Cross/Blue Shield,,,,true,8855.06,2683.11
New York City,Manhattan,7002053,001463,NYU Langone Hospitals,50 to 69,OOS,M,White,Not Span/Hispanic,3,Emergency,Home or Self Care,2019,DIG008,OTHER SPECIFIED AND UNSPECIFIED DISORDERS OF STOMACH AND DUODENUM,GIS001,ESOPHAGOGASTRODUODENOSCOPY (EGD) WITH BIOPSY,253,OTHER & UNSPECIFIED GASTROINTESTINAL HEMORRHAGE,06,DISEASES AND DISORDERS OF THE DIGESTIVE SYSTEM,3,Major,Major,Medical,Medicare,Private Health Insurance,,,,true,72566.83,20487.02
Hudson Valley,Putnam,3950000,000752,Putnam Hospital,70 or Older,105,F,White,Not Span/Hispanic,1,Emergency,Home or Self Care,2019,DIG008,OTHER SPECIFIED AND UNSPECIFIED DISORDERS OF STOMACH AND DUODENUM,GIS016,GI SYSTEM ENDOSCOPIC THERAPEUTIC PROCEDURES,253,OTHER & UNSPECIFIED GASTROINTESTINAL HEMORRHAGE,06,DISEASES AND DISORDERS OF THE DIGESTIVE SYSTEM,2,Moderate,Major,Medical,Medicare,Blue Cross/Blue Shield,,,,true,13773.25,5193.78
Central NY,Onondaga,3301008,000636,Crouse Hospital,70 or Older,130,F,White,Not Span/Hispanic,1,Urgent,Home or Self Care,2019,DIG021,GASTROINTESTINAL HEMORRHAGE,ADM001,TRANSFUSION OF BLOOD AND BLOOD PRODUCTS,253,OTHER & UNSPECIFIED GASTROINTESTINAL HEMORRHAGE,06,DISEASES AND DISORDERS OF THE DIGESTIVE SYSTEM,3,Major,Major,Medical,Medicare,Medicare,Private Health Insurance,,,true,7635.3,3467.02
Long Island,Suffolk,5151001,000889,Stony Brook Southampton Hospital,50 to 69,119,M,White,Not Span/Hispanic,1,Elective,Home or Self Care,2019,DIG025,OTHER SPECIFIED AND UNSPECIFIED GASTROINTESTINAL DISORDERS,,,253,OTHER & UNSPECIFIED GASTROINTESTINAL HEMORRHAGE,06,DISEASES AND DISORDERS OF THE DIGESTIVE SYSTEM,3,Major,Moderate,Medical,Medicare,Blue Cross/Blue Shield,,,,true,23139.05,4027.32
Central NY,Tompkins,5401001,000977,Cayuga Medical Center at Ithaca,50 to 69,148,M,White,Not Span/Hispanic,2,Emergency,Home or Self Care,2019,DIG021,GASTROINTESTINAL HEMORRHAGE,GIS004,GI SYSTEM ENDOSCOPY WITHOUT BIOPSY (DIAGNOSTIC),253,OTHER & UNSPECIFIED GASTROINTESTINAL HEMORRHAGE,06,DISEASES AND DISORDERS OF THE DIGESTIVE SYSTEM,2,Moderate,Minor,Medical,Self-Pay,,,,,true,4468.39,2703.65
Central NY,Onondaga,3301008,000636,Crouse Hospital,70 or Older,OOS,M,White,Not Span/Hispanic,5,Emergency,Skilled Nursing Home,2019,DIG021,GASTROINTESTINAL HEMORRHAGE,ADM015,ADMINISTRATION OF ANTIBIOTICS,253,OTHER & UNSPECIFIED GASTROINTESTINAL HEMORRHAGE,06,DISEASES AND DISORDERS OF THE DIGESTIVE SYSTEM,4,Extreme,Extreme,Medical,Medicare,Medicare,Blue Cross/Blue Shield,,,true,20338.69,8622.31
New York City,Manhattan,7002054,001458,New York-Presbyterian Hospital - New York Weill Cornell Center,50 to 69,100,F,Black/African American,Not Span/Hispanic,5,Emergency,Home or Self Care,2019,DIG008,OTHER SPECIFIED AND UNSPECIFIED DISORDERS OF STOMACH AND DUODENUM,GNR004,ENDOSCOPIC CONTROL OF BLEEDING,253,OTHER & UNSPECIFIED GASTROINTESTINAL HEMORRHAGE,06,DISEASES AND DISORDERS OF THE DIGESTIVE SYSTEM,2,Moderate,Minor,Medical,Medicare,Medicaid,Self-Pay,,,true,74803,21678.14
New York City,Manhattan,7002054,001458,New York-Presbyterian Hospital - New York Weill Cornell Center,30 to 49,OOS,M,Other Race,Not Span/Hispanic,2,Emergency,Home or Self Care,2019,DIG021,GASTROINTESTINAL HEMORRHAGE,ADM001,TRANSFUSION OF BLOOD AND BLOOD PRODUCTS,253,OTHER & UNSPECIFIED GASTROINTESTINAL HEMORRHAGE,06,DISEASES AND DISORDERS OF THE DIGESTIVE SYSTEM,1,Minor,Minor,Medical,Private Health Insurance,,,,,true,33353.12,8021.15
Long Island,Nassau,2952005,000552,Plainview Hospital,70 or Older,117,F,White,Not Span/Hispanic,5,Emergency,Skilled Nursing Home,2019,DIG008,OTHER SPECIFIED AND UNSPECIFIED DISORDERS OF STOMACH AND DUODENUM,GNR004,ENDOSCOPIC CONTROL OF BLEEDING,253,OTHER & UNSPECIFIED GASTROINTESTINAL HEMORRHAGE,06,DISEASES AND DISORDERS OF THE DIGESTIVE SYSTEM,3,Major,Major,Medical,Medicare,Medicare,,,,true,37958.44,11085.57
New York City,Manhattan,7002001,001438,Bellevue Hospital Center,30 to 49,100,F,Other Race,Not Span/Hispanic,1,Emergency,Home or Self Care,2019,DIG021,GASTROINTESTINAL HEMORRHAGE,GIS004,GI SYSTEM ENDOSCOPY WITHOUT BIOPSY (DIAGNOSTIC),253,OTHER & UNSPECIFIED GASTROINTESTINAL HEMORRHAGE,06,DISEASES AND DISORDERS OF THE DIGESTIVE SYSTEM,2,Moderate,Moderate,Medical,Medicaid,Medicaid,,,,true,7213.41,4794.03
Capital/Adirond,Albany,0101004,000005,St. Peter's Hospital,50 to 69,121,M,White,Not Span/Hispanic,3,Emergency,Home or Self Care,2019,DIG021,GASTROINTESTINAL HEMORRHAGE,,,253,OTHER & UNSPECIFIED GASTROINTESTINAL HEMORRHAGE,06,DISEASES AND DISORDERS OF THE DIGESTIVE SYSTEM,2,Moderate,Moderate,Medical,Blue Cross/Blue Shield,Blue Cross/Blue Shield,,,,true,15380.45,6484.48
Finger Lakes,Wayne,5820000,001028,Newark-Wayne Community Hospital,70 or Older,145,F,White,Not Span/Hispanic,6,Emergency,Home w/ Home Health Services,2019,DIG008,OTHER SPECIFIED AND UNSPECIFIED DISORDERS OF STOMACH AND DUODENUM,GNR004,ENDOSCOPIC CONTROL OF BLEEDING,253,OTHER & UNSPECIFIED GASTROINTESTINAL HEMORRHAGE,06,DISEASES AND DISORDERS OF THE DIGESTIVE SYSTEM,3,Major,Major,Medical,Medicare,,,,,true,22379.7,9241.6
New York City,Bronx,7000006,001169,Montefiore Medical Center - Henry & Lucy Moses Div,70 or Older,104,M,Other Race,Spanish/Hispanic,2,Emergency,Home or Self Care,2019,DIG021,GASTROINTESTINAL HEMORRHAGE,GIS004,GI SYSTEM ENDOSCOPY WITHOUT BIOPSY (DIAGNOSTIC),253,OTHER & UNSPECIFIED GASTROINTESTINAL HEMORRHAGE,06,DISEASES AND DISORDERS OF THE DIGESTIVE SYSTEM,2,Moderate,Moderate,Medical,Medicare,Medicaid,,,,true,35602.48,9750.66
Hudson Valley,Rockland,4329000,000779,Good Samaritan Hospital of Suffern,70 or Older,109,F,White,Not Span/Hispanic,9,Emergency,Hospice - Home,2019,DIG021,GASTROINTESTINAL HEMORRHAGE,,,253,OTHER & UNSPECIFIED GASTROINTESTINAL HEMORRHAGE,06,DISEASES AND DISORDERS OF THE DIGESTIVE SYSTEM,3,Major,Major,Medical,Medicare,Private Health Insurance,,,,true,118172.21,19574.53
Western NY,Erie,1401005,000210,Erie County Medical Center,30 to 49,142,M,Other Race,Not Span/Hispanic,2,Emergency,Home or Self Care,2019,DIG021,GASTROINTESTINAL HEMORRHAGE,,,253,OTHER & UNSPECIFIED GASTROINTESTINAL HEMORRHAGE,06,DISEASES AND DISORDERS OF THE DIGESTIVE SYSTEM,2,Moderate,Minor,Medical,Medicaid,Medicaid,,,,true,17079.86,6066.76
Western NY,Erie,1401005,000210,Erie County Medical Center,70 or Older,143,M,Black/African American,Not Span/Hispanic,13,Emergency,Skilled Nursing Home,2019,DIG021,GASTROINTESTINAL HEMORRHAGE,GNR004,ENDOSCOPIC CONTROL OF BLEEDING,253,OTHER & UNSPECIFIED GASTROINTESTINAL HEMORRHAGE,06,DISEASES AND DISORDERS OF THE DIGESTIVE SYSTEM,4,Extreme,Major,Medical,Medicare,Medicaid,Medicare,,,true,35903.83,23070.85
Finger Lakes,Monroe,2701003,000411,Rochester General Hospital,70 or Older,146,F,White,Not Span/Hispanic,3,Elective,Home or Self Care,2019,DIG021,GASTROINTESTINAL HEMORRHAGE,GIS016,GI SYSTEM ENDOSCOPIC THERAPEUTIC PROCEDURES,253,OTHER & UNSPECIFIED GASTROINTESTINAL HEMORRHAGE,06,DISEASES AND DISORDERS OF THE DIGESTIVE SYSTEM,2,Moderate,Moderate,Medical,Medicare,,,,,false,16527.55,7555.79
Western NY,Erie,1401014,003067,Millard Fillmore Suburban Hospital,70 or Older,142,F,White,Not Span/Hispanic,3,Emergency,Home w/ Home Health Services,2019,DIG021,GASTROINTESTINAL HEMORRHAGE,GIS001,ESOPHAGOGASTRODUODENOSCOPY (EGD) WITH BIOPSY,253,OTHER & UNSPECIFIED GASTROINTESTINAL HEMORRHAGE,06,DISEASES AND DISORDERS OF THE DIGESTIVE SYSTEM,3,Major,Major,Medical,Medicare,Medicaid,Self-Pay,,,true,10054.05,4892.06
New York City,Bronx,7000001,001178,BronxCare Hospital Center,70 or Older,104,M,Black/African American,Not Span/Hispanic,5,Emergency,Skilled Nursing Home,2019,DIG008,OTHER SPECIFIED AND UNSPECIFIED DISORDERS OF STOMACH AND DUODENUM,GNR004,ENDOSCOPIC CONTROL OF BLEEDING,253,OTHER & UNSPECIFIED GASTROINTESTINAL HEMORRHAGE,06,DISEASES AND DISORDERS OF THE DIGESTIVE SYSTEM,3,Major,Major,Medical,Medicare,Medicaid,,,,false,23031.53,22906.02
Western NY,Erie,1401013,000292,Sisters of Charity Hospital - St. Joseph Campus,50 to 69,142,F,White,Not Span/Hispanic,5,Emergency,Home or Self Care,2019,DIG021,GASTROINTESTINAL HEMORRHAGE,GIS004,GI SYSTEM ENDOSCOPY WITHOUT BIOPSY (DIAGNOSTIC),253,OTHER & UNSPECIFIED GASTROINTESTINAL HEMORRHAGE,06,DISEASES AND DISORDERS OF THE DIGESTIVE SYSTEM,2,Moderate,Minor,Medical,Medicare,Medicare,,,,true,31308.01,13056.01
New York City,Kings,7001021,001306,New York - Presbyterian Brooklyn Methodist Hospital,18 to 29,112,M,Other Race,Not Span/Hispanic,7,Emergency,Home or Self Care,2019,DIG008,OTHER SPECIFIED AND UNSPECIFIED DISORDERS OF STOMACH AND DUODENUM,RES007,AIRWAY INTUBATION,253,OTHER & UNSPECIFIED GASTROINTESTINAL HEMORRHAGE,06,DISEASES AND DISORDERS OF THE DIGESTIVE SYSTEM,3,Major,Major,Medical,"Managed Care, Unspecified",Medicaid,Self-Pay,,,true,117568.51,40169.3
Long Island,Nassau,2951001,000541,North Shore University Hospital,70 or Older,114,M,White,Not Span/Hispanic,6,Emergency,Home or Self Care,2019,DIG021,GASTROINTESTINAL HEMORRHAGE,ADM001,TRANSFUSION OF BLOOD AND BLOOD PRODUCTS,253,OTHER & UNSPECIFIED GASTROINTESTINAL HEMORRHAGE,06,DISEASES AND DISORDERS OF THE DIGESTIVE SYSTEM,2,Moderate,Moderate,Medical,Medicare,Blue Cross/Blue Shield,,,,true,81407.96,17045.11
Long Island,Nassau,2951001,000541,North Shore University Hospital,70 or Older,115,M,White,Not Span/Hispanic,5,Emergency,Home or Self Care,2019,DIG021,GASTROINTESTINAL HEMORRHAGE,ESA004,NON-INVASIVE VENTILATION,253,OTHER & UNSPECIFIED GASTROINTESTINAL HEMORRHAGE,06,DISEASES AND DISORDERS OF THE DIGESTIVE SYSTEM,3,Major,Major,Medical,Medicare,Blue Cross/Blue Shield,,,,true,65824.5,11754.18
New York City,Kings,7002053,001304,NYU Langone Hospital-Brooklyn,70 or Older,112,F,Other Race,Spanish/Hispanic,4,Emergency,Home w/ Home Health Services,2019,DIG021,GASTROINTESTINAL HEMORRHAGE,ADM001,TRANSFUSION OF BLOOD AND BLOOD PRODUCTS,253,OTHER & UNSPECIFIED GASTROINTESTINAL HEMORRHAGE,06,DISEASES AND DISORDERS OF THE DIGESTIVE SYSTEM,2,Moderate,Moderate,Medical,Medicare,Medicaid,,,,true,54499.5,17250.89
Capital/Adirond,Warren,5601000,001005,Glens Falls Hospital,70 or Older,128,F,White,Not Span/Hispanic,2,Emergency,Home or Self Care,2019,DIG021,GASTROINTESTINAL HEMORRHAGE,GIS004,GI SYSTEM ENDOSCOPY WITHOUT BIOPSY (DIAGNOSTIC),253,OTHER & UNSPECIFIED GASTROINTESTINAL HEMORRHAGE,06,DISEASES AND DISORDERS OF THE DIGESTIVE SYSTEM,2,Moderate,Moderate,Medical,Medicare,Blue Cross/Blue Shield,,,,true,14208.15,4122.94
Hudson Valley,Rockland,4329000,000779,Good Samaritan Hospital of Suffern,70 or Older,109,M,White,Not Span/Hispanic,4,Emergency,Home w/ Home Health Services,2019,DIG021,GASTROINTESTINAL HEMORRHAGE,GIS001,ESOPHAGOGASTRODUODENOSCOPY (EGD) WITH BIOPSY,253,OTHER & UNSPECIFIED GASTROINTESTINAL HEMORRHAGE,06,DISEASES AND DISORDERS OF THE DIGESTIVE SYSTEM,2,Moderate,Moderate,Medical,Medicare,,,,,true,89968.45,10112.96
Long Island,Suffolk,5151001,000889,Stony Brook Southampton Hospital,70 or Older,119,M,Black/African American,Not Span/Hispanic,7,Emergency,Skilled Nursing Home,2019,DIG021,GASTROINTESTINAL HEMORRHAGE,ADM001,TRANSFUSION OF BLOOD AND BLOOD PRODUCTS,253,OTHER & UNSPECIFIED GASTROINTESTINAL HEMORRHAGE,06,DISEASES AND DISORDERS OF THE DIGESTIVE SYSTEM,3,Major,Major,Medical,Medicare,Private Health Insurance,,,,true,47071.94,14704.98
Finger Lakes,Monroe,2701003,000411,Rochester General Hospital,50 to 69,146,F,White,Not Span/Hispanic,4,Emergency,Home w/ Home Health Services,2019,DIG021,GASTROINTESTINAL HEMORRHAGE,GIS002,COLONOSCOPY AND PROCTOSCOPY WITH BIOPSY,253,OTHER & UNSPECIFIED GASTROINTESTINAL HEMORRHAGE,06,DISEASES AND DISORDERS OF THE DIGESTIVE SYSTEM,3,Major,Moderate,Medical,Medicare,Medicaid,,,,true,19414.07,9085.23
New York City,Manhattan,7002054,001458,New York-Presbyterian Hospital - New York Weill Cornell Center,70 or Older,100,M,Multi-racial,Spanish/Hispanic,8,Emergency,Home w/ Home Health Services,2019,DIG021,GASTROINTESTINAL HEMORRHAGE,GIS004,GI SYSTEM ENDOSCOPY WITHOUT BIOPSY (DIAGNOSTIC),253,OTHER & UNSPECIFIED GASTROINTESTINAL HEMORRHAGE,06,DISEASES AND DISORDERS OF THE DIGESTIVE SYSTEM,3,Major,Major,Medical,Medicare,Private Health Insurance,Self-Pay,,,true,107858.3,25918.23
Capital/Adirond,Schenectady,4601001,000829,Ellis Hospital,50 to 69,123,M,White,Spanish/Hispanic,4,Emergency,Home or Self Care,2019,DIG008,OTHER SPECIFIED AND UNSPECIFIED DISORDERS OF STOMACH AND DUODENUM,GNR004,ENDOSCOPIC CONTROL OF BLEEDING,253,OTHER & UNSPECIFIED GASTROINTESTINAL HEMORRHAGE,06,DISEASES AND DISORDERS OF THE DIGESTIVE SYSTEM,3,Major,Moderate,Medical,Blue Cross/Blue Shield,Medicaid,,,,true,28752.25,8913.26
New York City,Queens,7003010,001637,New York - Presbyterian/Queens,50 to 69,113,F,White,Not Span/Hispanic,6,Emergency,Home or Self Care,2019,DIG008,OTHER SPECIFIED AND UNSPECIFIED DISORDERS OF STOMACH AND DUODENUM,GIS004,GI SYSTEM ENDOSCOPY WITHOUT BIOPSY (DIAGNOSTIC),253,OTHER & UNSPECIFIED GASTROINTESTINAL HEMORRHAGE,06,DISEASES AND DISORDERS OF THE DIGESTIVE SYSTEM,2,Moderate,Moderate,Medical,Medicare,Medicare,Self-Pay,,,true,52862.77,17622.35
New York City,Queens,7003010,001637,New York - Presbyterian/Queens,30 to 49,113,F,Other Race,Not Span/Hispanic,3,Emergency,Home or Self Care,2019,DIG021,GASTROINTESTINAL HEMORRHAGE,ADM021,"ADMINISTRATION OF THERAPEUTIC SUBSTANCES, NEC",253,OTHER & UNSPECIFIED GASTROINTESTINAL HEMORRHAGE,06,DISEASES AND DISORDERS OF THE DIGESTIVE SYSTEM,1,Minor,Minor,Medical,"Managed Care, Unspecified",Medicaid,Self-Pay,,,true,26828.28,7662.83
Capital/Adirond,Montgomery,2801001,000484,St. Mary's Healthcare,70 or Older,120,M,White,Not Span/Hispanic,6,Emergency,Home or Self Care,2019,DIG021,GASTROINTESTINAL HEMORRHAGE,GIS004,GI SYSTEM ENDOSCOPY WITHOUT BIOPSY (DIAGNOSTIC),253,OTHER & UNSPECIFIED GASTROINTESTINAL HEMORRHAGE,06,DISEASES AND DISORDERS OF THE DIGESTIVE SYSTEM,3,Major,Major,Medical,Medicare,Medicare,Blue Cross/Blue Shield,,,true,24019.32,9282.63
Western NY,Genesee,1801000,000339,United Memorial Medical Center North Street Campus,70 or Older,140,F,White,Not Span/Hispanic,4,Emergency,Skilled Nursing Home,2019,DIG021,GASTROINTESTINAL HEMORRHAGE,,,253,OTHER & UNSPECIFIED GASTROINTESTINAL HEMORRHAGE,06,DISEASES AND DISORDERS OF THE DIGESTIVE SYSTEM,3,Major,Major,Medical,Medicare,Private Health Insurance,,,,true,11546.79,4505.25
,,,,Redacted for Confidentiality,70 or Older,,F,Multi-racial,Unknown,2,Emergency,Short-term Hospital,2019,DIG021,GASTROINTESTINAL HEMORRHAGE,ADM001,TRANSFUSION OF BLOOD AND BLOOD PRODUCTS,253,OTHER & UNSPECIFIED GASTROINTESTINAL HEMORRHAGE,06,DISEASES AND DISORDERS OF THE DIGESTIVE SYSTEM,3,Major,Major,Medical,Medicare,"Managed Care, Unspecified",,,,false,14713.98,5659.59
Western NY,Erie,1401014,003067,Millard Fillmore Suburban Hospital,70 or Older,142,F,White,Not Span/Hispanic,1,Emergency,Home or Self Care,2019,DIG021,GASTROINTESTINAL HEMORRHAGE,,,253,OTHER & UNSPECIFIED GASTROINTESTINAL HEMORRHAGE,06,DISEASES AND DISORDERS OF THE DIGESTIVE SYSTEM,1,Minor,Moderate,Medical,Medicare,Self-Pay,,,,true,5008.41,1997.79
New York City,Kings,7001033,001315,Kingsbrook Jewish Medical Center,50 to 69,112,F,Black/African American,Not Span/Hispanic,5,Emergency,Skilled Nursing Home,2019,DIG021,GASTROINTESTINAL HEMORRHAGE,ESA001,HEMODIALYSIS,253,OTHER & UNSPECIFIED GASTROINTESTINAL HEMORRHAGE,06,DISEASES AND DISORDERS OF THE DIGESTIVE SYSTEM,3,Major,Major,Medical,Medicare,Medicaid,Self-Pay,,,true,36238,13450.76
New York City,Kings,7001020,001305,Maimonides Medical Center,70 or Older,112,F,White,Not Span/Hispanic,5,Emergency,Home w/ Home Health Services,2019,DIG021,GASTROINTESTINAL HEMORRHAGE,ADM001,TRANSFUSION OF BLOOD AND BLOOD PRODUCTS,253,OTHER & UNSPECIFIED GASTROINTESTINAL HEMORRHAGE,06,DISEASES AND DISORDERS OF THE DIGESTIVE SYSTEM,4,Extreme,Extreme,Medical,Medicare,Medicaid,Self-Pay,,,true,112915.07,21578.18
Southern Tier,Broome,0303001,000058,United Health Services Hospitals Inc. - Wilson Medical Center,70 or Older,138,F,White,Not Span/Hispanic,3,Emergency,Skilled Nursing Home,2019,DIG021,GASTROINTESTINAL HEMORRHAGE,GIS004,GI SYSTEM ENDOSCOPY WITHOUT BIOPSY (DIAGNOSTIC),253,OTHER & UNSPECIFIED GASTROINTESTINAL HEMORRHAGE,06,DISEASES AND DISORDERS OF THE DIGESTIVE SYSTEM,3,Major,Major,Medical,Medicare,Medicare,Blue Cross/Blue Shield,,,true,15745.8,6389.81
New York City,Richmond,7004003,001740,Staten Island University Hosp-North,70 or Older,103,F,White,Not Span/Hispanic,13,Emergency,Home w/ Home Health Services,2019,DIG025,OTHER SPECIFIED AND UNSPECIFIED GASTROINTESTINAL DISORDERS,GNR004,ENDOSCOPIC CONTROL OF BLEEDING,253,OTHER & UNSPECIFIED GASTROINTESTINAL HEMORRHAGE,06,DISEASES AND DISORDERS OF THE DIGESTIVE SYSTEM,3,Major,Moderate,Medical,Medicare,Medicaid,,,,true,160602.27,41582.95
Southern Tier,Broome,0303001,000058,United Health Services Hospitals Inc. - Wilson Medical Center,70 or Older,137,M,White,Not Span/Hispanic,3,Emergency,Home or Self Care,2019,DIG021,GASTROINTESTINAL HEMORRHAGE,,,253,OTHER & UNSPECIFIED GASTROINTESTINAL HEMORRHAGE,06,DISEASES AND DISORDERS OF THE DIGESTIVE SYSTEM,2,Moderate,Moderate,Medical,Medicare,Medicare,Private Health Insurance,,,true,10045.7,5374.2
New York City,Manhattan,7002054,003975,New York Presbyterian Hospital - Allen Hospital,70 or Older,104,M,Other Race,Not Span/Hispanic,6,Emergency,Skilled Nursing Home,2019,DIG021,GASTROINTESTINAL HEMORRHAGE,ESA001,HEMODIALYSIS,253,OTHER & UNSPECIFIED GASTROINTESTINAL HEMORRHAGE,06,DISEASES AND DISORDERS OF THE DIGESTIVE SYSTEM,2,Moderate,Major,Medical,Medicare,Private Health Insurance,Medicaid,,,true,81856.53,24104.93
Capital/Adirond,Albany,0101004,000005,St. Peter's Hospital,30 to 49,121,F,White,Not Span/Hispanic,3,Emergency,Home or Self Care,2019,DIG021,GASTROINTESTINAL HEMORRHAGE,GIS001,ESOPHAGOGASTRODUODENOSCOPY (EGD) WITH BIOPSY,253,OTHER & UNSPECIFIED GASTROINTESTINAL HEMORRHAGE,06,DISEASES AND DISORDERS OF THE DIGESTIVE SYSTEM,4,Extreme,Moderate,Medical,Medicaid,Medicaid,,,,true,22678.45,9042.43
New York City,Kings,7001020,001305,Maimonides Medical Center,70 or Older,113,F,White,Not Span/Hispanic,6,Emergency,Home or Self Care,2019,DIG008,OTHER SPECIFIED AND UNSPECIFIED DISORDERS OF STOMACH AND DUODENUM,GNR004,ENDOSCOPIC CONTROL OF BLEEDING,253,OTHER & UNSPECIFIED GASTROINTESTINAL HEMORRHAGE,06,DISEASES AND DISORDERS OF THE DIGESTIVE SYSTEM,2,Moderate,Moderate,Medical,Medicare,Private Health Insurance,Self-Pay,,,true,52760.01,17394.3
New York City,Kings,7002002,001324,Mount Sinai Brooklyn,50 to 69,112,M,Black/African American,Unknown,3,Emergency,Home or Self Care,2019,DIG008,OTHER SPECIFIED AND UNSPECIFIED DISORDERS OF STOMACH AND DUODENUM,GNR004,ENDOSCOPIC CONTROL OF BLEEDING,253,OTHER & UNSPECIFIED GASTROINTESTINAL HEMORRHAGE,06,DISEASES AND DISORDERS OF THE DIGESTIVE SYSTEM,3,Major,Moderate,Medical,Medicare,Medicaid,Self-Pay,,,true,41374.09,7762.53