Hospital Service Area,Hospital County,Operating Certificate Number,Permanent Facility Id,Facility Name,Age Group,Zip Code - 3 digits,Gender,Race,Ethnicity,Length of Stay,Type of Admission,Patient Disposition,Discharge Year,CCS Diagnosis Code,CCS Diagnosis Description,CCS Procedure Code,CCS Procedure Description,APR DRG Code,APR DRG Description,APR MDC Code,APR MDC Description,APR Severity of Illness Code,APR Severity of Illness Description,APR Risk of Mortality,APR Medical Surgical Description,Payment Typology 1,Payment Typology 2,Payment Typology 3,Birth Weight,Abortion Edit Indicator,Emergency Department Indicator,Total Charges,Total Costs
New York City,Kings,7002053,001304,NYU Langone Hospital-Brooklyn,70 or Older,112,F,Other Race,Spanish/Hispanic,4,Emergency,Home w/ Home Health Services,2019,DIG021,GASTROINTESTINAL HEMORRHAGE,ADM001,TRANSFUSION OF BLOOD AND BLOOD PRODUCTS,253,OTHER & UNSPECIFIED GASTROINTESTINAL HEMORRHAGE,06,DISEASES AND DISORDERS OF THE DIGESTIVE SYSTEM,2,Moderate,Moderate,Medical,Medicare,Medicaid,,,,true,54499.5,17250.89
New York City,Kings,7002053,001304,NYU Langone Hospital-Brooklyn,30 to 49,112,M,Other Race,Spanish/Hispanic,4,Emergency,Home or Self Care,2019,DIG021,GASTROINTESTINAL HEMORRHAGE,GIS004,GI SYSTEM ENDOSCOPY WITHOUT BIOPSY (DIAGNOSTIC),253,OTHER & UNSPECIFIED GASTROINTESTINAL HEMORRHAGE,06,DISEASES AND DISORDERS OF THE DIGESTIVE SYSTEM,1,Minor,Minor,Medical,Medicaid,,,,,true,52595.37,16741.47
New York City,Kings,7002053,001304,NYU Langone Hospital-Brooklyn,70 or Older,112,M,Other Race,Spanish/Hispanic,3,Emergency,Home w/ Home Health Services,2019,DIG021,GASTROINTESTINAL HEMORRHAGE,GIS001,ESOPHAGOGASTRODUODENOSCOPY (EGD) WITH BIOPSY,253,OTHER & UNSPECIFIED GASTROINTESTINAL HEMORRHAGE,06,DISEASES AND DISORDERS OF THE DIGESTIVE SYSTEM,3,Major,Major,Medical,Medicare,Medicaid,,,,true,77874,18333.28
New York City,Kings,7002053,001304,NYU Langone Hospital-Brooklyn,50 to 69,112,F,White,Spanish/Hispanic,1,Emergency,Home or Self Care,2019,DIG008,OTHER SPECIFIED AND UNSPECIFIED DISORDERS OF STOMACH AND DUODENUM,ADM001,TRANSFUSION OF BLOOD AND BLOOD PRODUCTS,253,OTHER & UNSPECIFIED GASTROINTESTINAL HEMORRHAGE,06,DISEASES AND DISORDERS OF THE DIGESTIVE SYSTEM,1,Minor,Minor,Medical,Blue Cross/Blue Shield,Private Health Insurance,,,,true,25871.23,7965.83
New York City,Kings,7002053,001304,NYU Langone Hospital-Brooklyn,70 or Older,104,F,Other Race,Spanish/Hispanic,6,Emergency,Home w/ Home Health Services,2019,DIG021,GASTROINTESTINAL HEMORRHAGE,GIS004,GI SYSTEM ENDOSCOPY WITHOUT BIOPSY (DIAGNOSTIC),253,OTHER & UNSPECIFIED GASTROINTESTINAL HEMORRHAGE,06,DISEASES AND DISORDERS OF THE DIGESTIVE SYSTEM,2,Moderate,Moderate,Medical,Medicare,Medicaid,,,,true,88764.75,25294.22
New York City,Kings,7002053,001304,NYU Langone Hospital-Brooklyn,70 or Older,112,M,White,Not Span/Hispanic,1,Emergency,Home or Self Care,2019,DIG021,GASTROINTESTINAL HEMORRHAGE,,,253,OTHER & UNSPECIFIED GASTROINTESTINAL HEMORRHAGE,06,DISEASES AND DISORDERS OF THE DIGESTIVE SYSTEM,3,Major,Major,Medical,Medicare,Blue Cross/Blue Shield,,,,true,20386.47,5153.03
New York City,Kings,7002053,001304,NYU Langone Hospital-Brooklyn,70 or Older,112,M,Other Race,Not Span/Hispanic,3,Emergency,Home w/ Home Health Services,2019,DIG021,GASTROINTESTINAL HEMORRHAGE,,,253,OTHER & UNSPECIFIED GASTROINTESTINAL HEMORRHAGE,06,DISEASES AND DISORDERS OF THE DIGESTIVE SYSTEM,2,Moderate,Moderate,Medical,Medicare,Medicaid,,,,true,39231.67,12655.68
New York City,Kings,7002053,001304,NYU Langone Hospital-Brooklyn,30 to 49,112,M,Other Race,Not Span/Hispanic,2,Emergency,Home or Self Care,2019,DIG021,GASTROINTESTINAL HEMORRHAGE,GIS004,GI SYSTEM ENDOSCOPY WITHOUT BIOPSY (DIAGNOSTIC),253,OTHER & UNSPECIFIED GASTROINTESTINAL HEMORRHAGE,06,DISEASES AND DISORDERS OF THE DIGESTIVE SYSTEM,1,Minor,Minor,Medical,Medicaid,,,,,true,41800.3,10583.73
New York City,Kings,7002053,001304,NYU Langone Hospital-Brooklyn,70 or Older,112,F,Other Race,Not Span/Hispanic,2,Emergency,Home w/ Home Health Services,2019,DIG021,GASTROINTESTINAL HEMORRHAGE,ADM001,TRANSFUSION OF BLOOD AND BLOOD PRODUCTS,253,OTHER & UNSPECIFIED GASTROINTESTINAL HEMORRHAGE,06,DISEASES AND DISORDERS OF THE DIGESTIVE SYSTEM,1,Minor,Moderate,Medical,Medicare,Blue Cross/Blue Shield,,,,true,29467.29,8898.23
New York City,Kings,7002053,001304,NYU Langone Hospital-Brooklyn,70 or Older,112,F,White,Not Span/Hispanic,2,Emergency,Home w/ Home Health Services,2019,DIG021,GASTROINTESTINAL HEMORRHAGE,,,253,OTHER & UNSPECIFIED GASTROINTESTINAL HEMORRHAGE,06,DISEASES AND DISORDERS OF THE DIGESTIVE SYSTEM,3,Major,Major,Medical,Medicare,,,,,true,24206.18,8123.5
New York City,Kings,7002053,001304,NYU Langone Hospital-Brooklyn,70 or Older,112,F,Black/African American,Not Span/Hispanic,8,Emergency,Home w/ Home Health Services,2019,DIG025,OTHER SPECIFIED AND UNSPECIFIED GASTROINTESTINAL DISORDERS,GIS016,GI SYSTEM ENDOSCOPIC THERAPEUTIC PROCEDURES,253,OTHER & UNSPECIFIED GASTROINTESTINAL HEMORRHAGE,06,DISEASES AND DISORDERS OF THE DIGESTIVE SYSTEM,3,Major,Moderate,Medical,Medicare,Medicaid,,,,true,160684.13,48858
New York City,Kings,7002053,001304,NYU Langone Hospital-Brooklyn,70 or Older,112,F,Black/African American,Not Span/Hispanic,7,Emergency,Home w/ Home Health Services,2019,DIG025,OTHER SPECIFIED AND UNSPECIFIED GASTROINTESTINAL DISORDERS,GIS004,GI SYSTEM ENDOSCOPY WITHOUT BIOPSY (DIAGNOSTIC),253,OTHER & UNSPECIFIED GASTROINTESTINAL HEMORRHAGE,06,DISEASES AND DISORDERS OF THE DIGESTIVE SYSTEM,3,Major,Moderate,Medical,Medicare,Medicaid,,,,true,145488.1,31785.47
New York City,Kings,7002053,001304,NYU Langone Hospital-Brooklyn,50 to 69,112,F,White,Spanish/Hispanic,2,Emergency,Home or Self Care,2019,DIG021,GASTROINTESTINAL HEMORRHAGE,GIS001,ESOPHAGOGASTRODUODENOSCOPY (EGD) WITH BIOPSY,253,OTHER & UNSPECIFIED GASTROINTESTINAL HEMORRHAGE,06,DISEASES AND DISORDERS OF THE DIGESTIVE SYSTEM,2,Moderate,Minor,Medical,Medicaid,,,,,true,40173.55,10370.47
New York City,Kings,7002053,001304,NYU Langone Hospital-Brooklyn,70 or Older,112,F,White,Spanish/Hispanic,3,Emergency,Home or Self Care,2019,DIG021,GASTROINTESTINAL HEMORRHAGE,GIS001,ESOPHAGOGASTRODUODENOSCOPY (EGD) WITH BIOPSY,253,OTHER & UNSPECIFIED GASTROINTESTINAL HEMORRHAGE,06,DISEASES AND DISORDERS OF THE DIGESTIVE SYSTEM,3,Major,Moderate,Medical,Medicare,,,,,true,64220.65,16069.41
New York City,Kings,7002053,001304,NYU Langone Hospital-Brooklyn,70 or Older,112,F,White,Not Span/Hispanic,11,Emergency,Hospice - Medical Facility,2019,DIG021,GASTROINTESTINAL HEMORRHAGE,GIS004,GI SYSTEM ENDOSCOPY WITHOUT BIOPSY (DIAGNOSTIC),253,OTHER & UNSPECIFIED GASTROINTESTINAL HEMORRHAGE,06,DISEASES AND DISORDERS OF THE DIGESTIVE SYSTEM,4,Extreme,Extreme,Medical,Private Health Insurance,Medicaid,,,,true,106217.32,40397.1
New York City,Kings,7002053,001304,NYU Langone Hospital-Brooklyn,50 to 69,112,F,Other Race,Spanish/Hispanic,4,Emergency,Home or Self Care,2019,DIG021,GASTROINTESTINAL HEMORRHAGE,GIS002,COLONOSCOPY AND PROCTOSCOPY WITH BIOPSY,253,OTHER & UNSPECIFIED GASTROINTESTINAL HEMORRHAGE,06,DISEASES AND DISORDERS OF THE DIGESTIVE SYSTEM,2,Moderate,Moderate,Medical,Medicaid,,,,,true,66304.4,18713.43
New York City,Kings,7002053,001304,NYU Langone Hospital-Brooklyn,50 to 69,112,F,Other Race,Not Span/Hispanic,2,Emergency,Home w/ Home Health Services,2019,DIG021,GASTROINTESTINAL HEMORRHAGE,GNR004,ENDOSCOPIC CONTROL OF BLEEDING,253,OTHER & UNSPECIFIED GASTROINTESTINAL HEMORRHAGE,06,DISEASES AND DISORDERS OF THE DIGESTIVE SYSTEM,2,Moderate,Moderate,Medical,Medicaid,,,,,true,92922.22,23590.31
New York City,Kings,7002053,001304,NYU Langone Hospital-Brooklyn,70 or Older,112,F,Other Race,Spanish/Hispanic,3,Emergency,Home w/ Home Health Services,2019,DIG021,GASTROINTESTINAL HEMORRHAGE,,,253,OTHER & UNSPECIFIED GASTROINTESTINAL HEMORRHAGE,06,DISEASES AND DISORDERS OF THE DIGESTIVE SYSTEM,3,Major,Major,Medical,Medicare,Medicaid,,,,true,51938.19,11706.27
New York City,Kings,7002053,001304,NYU Langone Hospital-Brooklyn,70 or Older,112,M,Black/African American,Not Span/Hispanic,3,Emergency,Home or Self Care,2019,DIG025,OTHER SPECIFIED AND UNSPECIFIED GASTROINTESTINAL DISORDERS,GIS001,ESOPHAGOGASTRODUODENOSCOPY (EGD) WITH BIOPSY,253,OTHER & UNSPECIFIED GASTROINTESTINAL HEMORRHAGE,06,DISEASES AND DISORDERS OF THE DIGESTIVE SYSTEM,2,Moderate,Minor,Medical,Blue Cross/Blue Shield,Medicare,,,,true,76121.58,19893.69
New York City,Kings,7002053,001304,NYU Langone Hospital-Brooklyn,30 to 49,OOS,M,Other Race,Unknown,5,Emergency,Home or Self Care,2019,DIG021,GASTROINTESTINAL HEMORRHAGE,GIS002,COLONOSCOPY AND PROCTOSCOPY WITH BIOPSY,253,OTHER & UNSPECIFIED GASTROINTESTINAL HEMORRHAGE,06,DISEASES AND DISORDERS OF THE DIGESTIVE SYSTEM,2,Moderate,Minor,Medical,Self-Pay,,,,,true,96108.75,34013.76
New York City,Kings,7002053,001304,NYU Langone Hospital-Brooklyn,70 or Older,112,M,Other Race,Not Span/Hispanic,3,Emergency,Hospice - Home,2019,DIG021,GASTROINTESTINAL HEMORRHAGE,ADM001,TRANSFUSION OF BLOOD AND BLOOD PRODUCTS,253,OTHER & UNSPECIFIED GASTROINTESTINAL HEMORRHAGE,06,DISEASES AND DISORDERS OF THE DIGESTIVE SYSTEM,3,Major,Major,Medical,Medicare,Medicaid,,,,true,32653.3,11498.09
New York City,Kings,7002053,001304,NYU Langone Hospital-Brooklyn,70 or Older,112,F,White,Not Span/Hispanic,2,Emergency,Home w/ Home Health Services,2019,DIG021,GASTROINTESTINAL HEMORRHAGE,ESA001,HEMODIALYSIS,253,OTHER & UNSPECIFIED GASTROINTESTINAL HEMORRHAGE,06,DISEASES AND DISORDERS OF THE DIGESTIVE SYSTEM,3,Major,Major,Medical,Medicare,Medicaid,,,,true,35775.83,9901.69
New York City,Kings,7002053,001304,NYU Langone Hospital-Brooklyn,50 to 69,112,M,Black/African American,Not Span/Hispanic,2,Emergency,Home w/ Home Health Services,2019,DIG021,GASTROINTESTINAL HEMORRHAGE,ADM001,TRANSFUSION OF BLOOD AND BLOOD PRODUCTS,253,OTHER & UNSPECIFIED GASTROINTESTINAL HEMORRHAGE,06,DISEASES AND DISORDERS OF THE DIGESTIVE SYSTEM,3,Major,Major,Medical,Medicare,Medicaid,,,,true,33453.73,9090.49
New York City,Kings,7002053,001304,NYU Langone Hospital-Brooklyn,30 to 49,112,M,White,Not Span/Hispanic,2,Emergency,Left Against Medical Advice,2019,DIG021,GASTROINTESTINAL HEMORRHAGE,GIS001,ESOPHAGOGASTRODUODENOSCOPY (EGD) WITH BIOPSY,253,OTHER & UNSPECIFIED GASTROINTESTINAL HEMORRHAGE,06,DISEASES AND DISORDERS OF THE DIGESTIVE SYSTEM,1,Minor,Minor,Medical,Medicaid,,,,,true,55475.51,12790.33
New York City,Kings,7002053,001304,NYU Langone Hospital-Brooklyn,70 or Older,114,F,Black/African American,Not Span/Hispanic,5,Emergency,Home w/ Home Health Services,2019,DIG008,OTHER SPECIFIED AND UNSPECIFIED DISORDERS OF STOMACH AND DUODENUM,GNR004,ENDOSCOPIC CONTROL OF BLEEDING,253,OTHER & UNSPECIFIED GASTROINTESTINAL HEMORRHAGE,06,DISEASES AND DISORDERS OF THE DIGESTIVE SYSTEM,3,Major,Minor,Medical,Medicare,Blue Cross/Blue Shield,,,,true,86897.75,24016.49
New York City,Kings,7002053,001304,NYU Langone Hospital-Brooklyn,50 to 69,112,F,Black/African American,Not Span/Hispanic,1,Emergency,Home or Self Care,2019,DIG021,GASTROINTESTINAL HEMORRHAGE,ADM021,"ADMINISTRATION OF THERAPEUTIC SUBSTANCES, NEC",253,OTHER & UNSPECIFIED GASTROINTESTINAL HEMORRHAGE,06,DISEASES AND DISORDERS OF THE DIGESTIVE SYSTEM,1,Minor,Minor,Medical,Private Health Insurance,,,,,true,17488.02,4854.06
New York City,Kings,7002053,001304,NYU Langone Hospital-Brooklyn,30 to 49,112,M,White,Not Span/Hispanic,1,Emergency,Home or Self Care,2019,DIG021,GASTROINTESTINAL HEMORRHAGE,GIS001,ESOPHAGOGASTRODUODENOSCOPY (EGD) WITH BIOPSY,253,OTHER & UNSPECIFIED GASTROINTESTINAL HEMORRHAGE,06,DISEASES AND DISORDERS OF THE DIGESTIVE SYSTEM,1,Minor,Minor,Medical,Blue Cross/Blue Shield,Private Health Insurance,,,,true,41959.82,8583.36
New York City,Kings,7002053,001304,NYU Langone Hospital-Brooklyn,70 or Older,112,M,Other Race,Not Span/Hispanic,2,Emergency,Home w/ Home Health Services,2019,DIG021,GASTROINTESTINAL HEMORRHAGE,GIS001,ESOPHAGOGASTRODUODENOSCOPY (EGD) WITH BIOPSY,253,OTHER & UNSPECIFIED GASTROINTESTINAL HEMORRHAGE,06,DISEASES AND DISORDERS OF THE DIGESTIVE SYSTEM,3,Major,Major,Medical,Private Health Insurance,,,,,true,55903.59,12534.32
New York City,Kings,7002053,001304,NYU Langone Hospital-Brooklyn,70 or Older,112,M,Other Race,Not Span/Hispanic,1,Emergency,Expired,2019,DIG025,OTHER SPECIFIED AND UNSPECIFIED GASTROINTESTINAL DISORDERS,ADM001,TRANSFUSION OF BLOOD AND BLOOD PRODUCTS,253,OTHER & UNSPECIFIED GASTROINTESTINAL HEMORRHAGE,06,DISEASES AND DISORDERS OF THE DIGESTIVE SYSTEM,3,Major,Major,Medical,Medicare,Medicaid,,,,true,193431.86,23665.26
New York City,Kings,7002053,001304,NYU Langone Hospital-Brooklyn,50 to 69,112,M,Other Race,Not Span/Hispanic,3,Emergency,Left Against Medical Advice,2019,DIG021,GASTROINTESTINAL HEMORRHAGE,GIS027,"UPPER GI THERAPEUTIC PROCEDURES, NEC (ENDOSCOPIC)",253,OTHER & UNSPECIFIED GASTROINTESTINAL HEMORRHAGE,06,DISEASES AND DISORDERS OF THE DIGESTIVE SYSTEM,4,Extreme,Extreme,Medical,Medicaid,,,,,true,123753.44,26346.66
New York City,Kings,7002053,001304,NYU Langone Hospital-Brooklyn,70 or Older,112,F,White,Not Span/Hispanic,2,Emergency,Skilled Nursing Home,2019,DIG021,GASTROINTESTINAL HEMORRHAGE,,,253,OTHER & UNSPECIFIED GASTROINTESTINAL HEMORRHAGE,06,DISEASES AND DISORDERS OF THE DIGESTIVE SYSTEM,2,Moderate,Major,Medical,Medicare,Medicaid,,,,true,26883.49,8488.81
New York City,Kings,7002053,001304,NYU Langone Hospital-Brooklyn,30 to 49,112,F,Black/African American,Not Span/Hispanic,2,Emergency,Home or Self Care,2019,DIG021,GASTROINTESTINAL HEMORRHAGE,ADM001,TRANSFUSION OF BLOOD AND BLOOD PRODUCTS,253,OTHER & UNSPECIFIED GASTROINTESTINAL HEMORRHAGE,06,DISEASES AND DISORDERS OF THE DIGESTIVE SYSTEM,1,Minor,Minor,Medical,Blue Cross/Blue Shield,,,,,true,26053.36,8347.37
New York City,Kings,7002053,001304,NYU Langone Hospital-Brooklyn,70 or Older,112,F,White,Unknown,5,Emergency,Home w/ Home Health Services,2019,DIG021,GASTROINTESTINAL HEMORRHAGE,GIS004,GI SYSTEM ENDOSCOPY WITHOUT BIOPSY (DIAGNOSTIC),253,OTHER & UNSPECIFIED GASTROINTESTINAL HEMORRHAGE,06,DISEASES AND DISORDERS OF THE DIGESTIVE SYSTEM,3,Major,Major,Medical,Medicare,Private Health Insurance,,,,true,92253.47,24458.88
New York City,Kings,7002053,001304,NYU Langone Hospital-Brooklyn,50 to 69,112,F,White,Spanish/Hispanic,3,Emergency,Home or Self Care,2019,DIG008,OTHER SPECIFIED AND UNSPECIFIED DISORDERS OF STOMACH AND DUODENUM,GIS002,COLONOSCOPY AND PROCTOSCOPY WITH BIOPSY,253,OTHER & UNSPECIFIED GASTROINTESTINAL HEMORRHAGE,06,DISEASES AND DISORDERS OF THE DIGESTIVE SYSTEM,2,Moderate,Minor,Medical,Blue Cross/Blue Shield,Private Health Insurance,,,,true,60431.86,15546.93
New York City,Kings,7002053,001304,NYU Langone Hospital-Brooklyn,70 or Older,112,M,Other Race,Spanish/Hispanic,1,Emergency,Home w/ Home Health Services,2019,DIG021,GASTROINTESTINAL HEMORRHAGE,,,253,OTHER & UNSPECIFIED GASTROINTESTINAL HEMORRHAGE,06,DISEASES AND DISORDERS OF THE DIGESTIVE SYSTEM,2,Moderate,Major,Medical,Medicare,,,,,true,30723.59,7024.38
New York City,Kings,7002053,001304,NYU Langone Hospital-Brooklyn,70 or Older,112,F,White,Not Span/Hispanic,3,Emergency,Skilled Nursing Home,2019,DIG008,OTHER SPECIFIED AND UNSPECIFIED DISORDERS OF STOMACH AND DUODENUM,GNR004,ENDOSCOPIC CONTROL OF BLEEDING,253,OTHER & UNSPECIFIED GASTROINTESTINAL HEMORRHAGE,06,DISEASES AND DISORDERS OF THE DIGESTIVE SYSTEM,3,Major,Extreme,Medical,Medicare,Medicaid,,,,true,60381.07,16378.14
New York City,Kings,7002053,001304,NYU Langone Hospital-Brooklyn,70 or Older,112,F,White,Not Span/Hispanic,3,Emergency,Home w/ Home Health Services,2019,DIG021,GASTROINTESTINAL HEMORRHAGE,ADM021,"ADMINISTRATION OF THERAPEUTIC SUBSTANCES, NEC",253,OTHER & UNSPECIFIED GASTROINTESTINAL HEMORRHAGE,06,DISEASES AND DISORDERS OF THE DIGESTIVE SYSTEM,3,Major,Major,Medical,Medicare,Blue Cross/Blue Shield,,,,true,59938.56,16021.12
New York City,Kings,7002053,001304,NYU Langone Hospital-Brooklyn,50 to 69,112,F,White,Spanish/Hispanic,2,Emergency,Home or Self Care,2019,DIG008,OTHER SPECIFIED AND UNSPECIFIED DISORDERS OF STOMACH AND DUODENUM,GNR004,ENDOSCOPIC CONTROL OF BLEEDING,253,OTHER & UNSPECIFIED GASTROINTESTINAL HEMORRHAGE,06,DISEASES AND DISORDERS OF THE DIGESTIVE SYSTEM,3,Major,Major,Medical,Blue Cross/Blue Shield,Private Health Insurance,,,,true,70123.24,14850.55
New York City,Kings,7002053,001304,NYU Langone Hospital-Brooklyn,70 or Older,112,M,Other Race,Not Span/Hispanic,1,Emergency,Home w/ Home Health Services,2019,DIG025,OTHER SPECIFIED AND UNSPECIFIED GASTROINTESTINAL DISORDERS,ADM001,TRANSFUSION OF BLOOD AND BLOOD PRODUCTS,253,OTHER & UNSPECIFIED GASTROINTESTINAL HEMORRHAGE,06,DISEASES AND DISORDERS OF THE DIGESTIVE SYSTEM,3,Major,Moderate,Medical,Medicare,Medicaid,,,,true,40258.5,8330.14
New York City,Kings,7002053,001304,NYU Langone Hospital-Brooklyn,70 or Older,112,M,White,Not Span/Hispanic,13,Emergency,Hospice - Medical Facility,2019,DIG021,GASTROINTESTINAL HEMORRHAGE,GIS004,GI SYSTEM ENDOSCOPY WITHOUT BIOPSY (DIAGNOSTIC),253,OTHER & UNSPECIFIED GASTROINTESTINAL HEMORRHAGE,06,DISEASES AND DISORDERS OF THE DIGESTIVE SYSTEM,4,Extreme,Extreme,Medical,Medicare,Medicare,,,,true,341851.69,96982.32
New York City,Kings,7002053,001304,NYU Langone Hospital-Brooklyn,50 to 69,112,F,Other Race,Not Span/Hispanic,4,Emergency,Home or Self Care,2019,DIG021,GASTROINTESTINAL HEMORRHAGE,GIS004,GI SYSTEM ENDOSCOPY WITHOUT BIOPSY (DIAGNOSTIC),253,OTHER & UNSPECIFIED GASTROINTESTINAL HEMORRHAGE,06,DISEASES AND DISORDERS OF THE DIGESTIVE SYSTEM,2,Moderate,Moderate,Medical,Medicare,Medicaid,,,,true,95349.35,21813.35
New York City,Kings,7002053,001304,NYU Langone Hospital-Brooklyn,50 to 69,112,F,White,Not Span/Hispanic,3,Emergency,Home or Self Care,2019,DIG021,GASTROINTESTINAL HEMORRHAGE,IMG006,COMPUTERIZED TOMOGRAPHY (CT) WITH CONTRAST,253,OTHER & UNSPECIFIED GASTROINTESTINAL HEMORRHAGE,06,DISEASES AND DISORDERS OF THE DIGESTIVE SYSTEM,2,Moderate,Minor,Medical,Medicare,Private Health Insurance,,,,true,37920.11,12601.44
New York City,Kings,7002053,001304,NYU Langone Hospital-Brooklyn,70 or Older,112,F,White,Not Span/Hispanic,6,Emergency,Home w/ Home Health Services,2019,DIG021,GASTROINTESTINAL HEMORRHAGE,ADM001,TRANSFUSION OF BLOOD AND BLOOD PRODUCTS,253,OTHER & UNSPECIFIED GASTROINTESTINAL HEMORRHAGE,06,DISEASES AND DISORDERS OF THE DIGESTIVE SYSTEM,4,Extreme,Extreme,Medical,Medicare,Medicaid,,,,true,205067.34,36769.07
New York City,Kings,7002053,001304,NYU Langone Hospital-Brooklyn,30 to 49,112,M,Other Race,Spanish/Hispanic,3,Emergency,Home or Self Care,2019,DIG021,GASTROINTESTINAL HEMORRHAGE,GIS004,GI SYSTEM ENDOSCOPY WITHOUT BIOPSY (DIAGNOSTIC),253,OTHER & UNSPECIFIED GASTROINTESTINAL HEMORRHAGE,06,DISEASES AND DISORDERS OF THE DIGESTIVE SYSTEM,3,Major,Major,Medical,Medicaid,,,,,true,65283.86,15383.27
New York City,Kings,7002053,001304,NYU Langone Hospital-Brooklyn,70 or Older,112,F,White,Not Span/Hispanic,7,Emergency,Home w/ Home Health Services,2019,DIG021,GASTROINTESTINAL HEMORRHAGE,CAR028,INFERIOR VENA CAVA (IVC) FILTER PROCEDURES,253,OTHER & UNSPECIFIED GASTROINTESTINAL HEMORRHAGE,06,DISEASES AND DISORDERS OF THE DIGESTIVE SYSTEM,4,Extreme,Major,Medical,Medicare,Medicaid,,,,true,190539.76,35304.78
New York City,Kings,7002053,001304,NYU Langone Hospital-Brooklyn,70 or Older,112,F,Other Race,Spanish/Hispanic,1,Emergency,Home or Self Care,2019,DIG021,GASTROINTESTINAL HEMORRHAGE,,,253,OTHER & UNSPECIFIED GASTROINTESTINAL HEMORRHAGE,06,DISEASES AND DISORDERS OF THE DIGESTIVE SYSTEM,3,Major,Major,Medical,Medicare,Medicaid,,,,true,38580.14,11114.77
New York City,Kings,7002053,001304,NYU Langone Hospital-Brooklyn,70 or Older,112,F,White,Not Span/Hispanic,14,Emergency,Skilled Nursing Home,2019,DIG021,GASTROINTESTINAL HEMORRHAGE,ADM001,TRANSFUSION OF BLOOD AND BLOOD PRODUCTS,253,OTHER & UNSPECIFIED GASTROINTESTINAL HEMORRHAGE,06,DISEASES AND DISORDERS OF THE DIGESTIVE SYSTEM,4,Extreme,Extreme,Medical,Medicare,,,,,true,174806.55,62855.97
New York City,Kings,7002053,001304,NYU Langone Hospital-Brooklyn,70 or Older,112,F,White,Spanish/Hispanic,4,Emergency,Home w/ Home Health Services,2019,DIG021,GASTROINTESTINAL HEMORRHAGE,ADM001,TRANSFUSION OF BLOOD AND BLOOD PRODUCTS,253,OTHER & UNSPECIFIED GASTROINTESTINAL HEMORRHAGE,06,DISEASES AND DISORDERS OF THE DIGESTIVE SYSTEM,3,Major,Major,Medical,Medicare,Medicaid,,,,true,59592.81,18980.21
New York City,Kings,7002053,001304,NYU Langone Hospital-Brooklyn,70 or Older,112,M,White,Not Span/Hispanic,12,Emergency,Skilled Nursing Home,2019,DIG008,OTHER SPECIFIED AND UNSPECIFIED DISORDERS OF STOMACH AND DUODENUM,GIS001,ESOPHAGOGASTRODUODENOSCOPY (EGD) WITH BIOPSY,253,OTHER & UNSPECIFIED GASTROINTESTINAL HEMORRHAGE,06,DISEASES AND DISORDERS OF THE DIGESTIVE SYSTEM,4,Extreme,Major,Medical,Medicare,Private Health Insurance,,,,true,216724.29,47588.35
New York City,Kings,7002053,001304,NYU Langone Hospital-Brooklyn,70 or Older,112,F,White,Not Span/Hispanic,6,Emergency,Skilled Nursing Home,2019,DIG025,OTHER SPECIFIED AND UNSPECIFIED GASTROINTESTINAL DISORDERS,ADM001,TRANSFUSION OF BLOOD AND BLOOD PRODUCTS,253,OTHER & UNSPECIFIED GASTROINTESTINAL HEMORRHAGE,06,DISEASES AND DISORDERS OF THE DIGESTIVE SYSTEM,2,Moderate,Moderate,Medical,Medicare,Blue Cross/Blue Shield,,,,true,135521.58,37741.33
New York City,Kings,7002053,001304,NYU Langone Hospital-Brooklyn,70 or Older,112,M,Other Race,Spanish/Hispanic,2,Emergency,Home w/ Home Health Services,2019,DIG021,GASTROINTESTINAL HEMORRHAGE,GIS001,ESOPHAGOGASTRODUODENOSCOPY (EGD) WITH BIOPSY,253,OTHER & UNSPECIFIED GASTROINTESTINAL HEMORRHAGE,06,DISEASES AND DISORDERS OF THE DIGESTIVE SYSTEM,3,Major,Major,Medical,Medicare,,,,,true,40339.43,10384.04
New York City,Kings,7002053,001304,NYU Langone Hospital-Brooklyn,50 to 69,112,M,Other Race,Spanish/Hispanic,1,Emergency,Home or Self Care,2019,DIG021,GASTROINTESTINAL HEMORRHAGE,GIS001,ESOPHAGOGASTRODUODENOSCOPY (EGD) WITH BIOPSY,253,OTHER & UNSPECIFIED GASTROINTESTINAL HEMORRHAGE,06,DISEASES AND DISORDERS OF THE DIGESTIVE SYSTEM,1,Minor,Minor,Medical,Medicaid,,,,,true,38283.13,7891.93
New York City,Kings,7002053,001304,NYU Langone Hospital-Brooklyn,30 to 49,112,M,Other Race,Spanish/Hispanic,1,Emergency,Left Against Medical Advice,2019,DIG021,GASTROINTESTINAL HEMORRHAGE,,,253,OTHER & UNSPECIFIED GASTROINTESTINAL HEMORRHAGE,06,DISEASES AND DISORDERS OF THE DIGESTIVE SYSTEM,2,Moderate,Minor,Medical,Medicaid,,,,,true,14548.19,4467.3
New York City,Kings,7002053,001304,NYU Langone Hospital-Brooklyn,70 or Older,112,M,White,Not Span/Hispanic,2,Emergency,Home or Self Care,2019,DIG021,GASTROINTESTINAL HEMORRHAGE,,,253,OTHER & UNSPECIFIED GASTROINTESTINAL HEMORRHAGE,06,DISEASES AND DISORDERS OF THE DIGESTIVE SYSTEM,2,Moderate,Moderate,Medical,Medicare,,,,,true,31181.72,9321.3
New York City,Kings,7002053,001304,NYU Langone Hospital-Brooklyn,70 or Older,112,M,White,Not Span/Hispanic,2,Emergency,Expired,2019,DIG021,GASTROINTESTINAL HEMORRHAGE,ADM001,TRANSFUSION OF BLOOD AND BLOOD PRODUCTS,253,OTHER & UNSPECIFIED GASTROINTESTINAL HEMORRHAGE,06,DISEASES AND DISORDERS OF THE DIGESTIVE SYSTEM,4,Extreme,Extreme,Medical,Medicare,Medicaid,,,,true,41495.89,9380.19
New York City,Kings,7002053,001304,NYU Langone Hospital-Brooklyn,70 or Older,112,M,Other Race,Unknown,4,Emergency,Home or Self Care,2019,DIG025,OTHER SPECIFIED AND UNSPECIFIED GASTROINTESTINAL DISORDERS,GIS004,GI SYSTEM ENDOSCOPY WITHOUT BIOPSY (DIAGNOSTIC),253,OTHER & UNSPECIFIED GASTROINTESTINAL HEMORRHAGE,06,DISEASES AND DISORDERS OF THE DIGESTIVE SYSTEM,3,Major,Major,Medical,Medicaid,,,,,true,76027.35,22611.81
New York City,Kings,7002053,001304,NYU Langone Hospital-Brooklyn,70 or Older,112,F,Other Race,Not Span/Hispanic,1,Emergency,Home or Self Care,2019,DIG021,GASTROINTESTINAL HEMORRHAGE,,,253,OTHER & UNSPECIFIED GASTROINTESTINAL HEMORRHAGE,06,DISEASES AND DISORDERS OF THE DIGESTIVE SYSTEM,1,Minor,Moderate,Medical,Medicare,Medicaid,,,,true,33438.6,7012.15