Hospital Service Area,Hospital County,Operating Certificate Number,Permanent Facility Id,Facility Name,Age Group,Zip Code - 3 digits,Gender,Race,Ethnicity,Length of Stay,Type of Admission,Patient Disposition,Discharge Year,CCS Diagnosis Code,CCS Diagnosis Description,CCS Procedure Code,CCS Procedure Description,APR DRG Code,APR DRG Description,APR MDC Code,APR MDC Description,APR Severity of Illness Code,APR Severity of Illness Description,APR Risk of Mortality,APR Medical Surgical Description,Payment Typology 1,Payment Typology 2,Payment Typology 3,Birth Weight,Abortion Edit Indicator,Emergency Department Indicator,Total Charges,Total Costs
New York City,Manhattan,7002053,001463,NYU Langone Hospitals,30 to 49,104,M,Black/African American,Not Span/Hispanic,1,Emergency,Home or Self Care,2020,DIG021,GASTROINTESTINAL HEMORRHAGE,GIS001,ESOPHAGOGASTRODUODENOSCOPY (EGD) WITH BIOPSY,253,OTHER & UNSPECIFIED GASTROINTESTINAL HEMORRHAGE,06,DISEASES AND DISORDERS OF THE DIGESTIVE SYSTEM,3,Major,Major,Medical,Medicaid,,,,,Y,67112.78,9958.98
New York City,Manhattan,7002053,001463,NYU Langone Hospitals,18 to 29,105,M,White,Not Span/Hispanic,2,Emergency,Home or Self Care,2020,DIG021,GASTROINTESTINAL HEMORRHAGE,ADM001,TRANSFUSION OF BLOOD AND BLOOD PRODUCTS,253,OTHER & UNSPECIFIED GASTROINTESTINAL HEMORRHAGE,06,DISEASES AND DISORDERS OF THE DIGESTIVE SYSTEM,2,Moderate,Minor,Medical,Private Health Insurance,,,,,Y,55469.63,11507.36
New York City,Manhattan,7002053,001463,NYU Langone Hospitals,30 to 49,112,F,Black/African American,Not Span/Hispanic,2,Emergency,Home or Self Care,2020,DIG021,GASTROINTESTINAL HEMORRHAGE,GIS004,GI SYSTEM ENDOSCOPY WITHOUT BIOPSY (DIAGNOSTIC),253,OTHER & UNSPECIFIED GASTROINTESTINAL HEMORRHAGE,06,DISEASES AND DISORDERS OF THE DIGESTIVE SYSTEM,1,Minor,Minor,Medical,Blue Cross/Blue Shield,,,,,Y,38146.26,9573.35
New York City,Manhattan,7002053,001463,NYU Langone Hospitals,50 to 69,100,M,Black/African American,Not Span/Hispanic,2,Emergency,Home or Self Care,2020,DIG021,GASTROINTESTINAL HEMORRHAGE,GIS004,GI SYSTEM ENDOSCOPY WITHOUT BIOPSY (DIAGNOSTIC),253,OTHER & UNSPECIFIED GASTROINTESTINAL HEMORRHAGE,06,DISEASES AND DISORDERS OF THE DIGESTIVE SYSTEM,2,Moderate,Moderate,Medical,Blue Cross/Blue Shield,,,,,Y,67516.45,13258.66
New York City,Manhattan,7002053,001463,NYU Langone Hospitals,50 to 69,112,F,Other Race,Not Span/Hispanic,4,Emergency,Home or Self Care,2020,DIG021,GASTROINTESTINAL HEMORRHAGE,GIS016,GI SYSTEM ENDOSCOPIC THERAPEUTIC PROCEDURES,253,OTHER & UNSPECIFIED GASTROINTESTINAL HEMORRHAGE,06,DISEASES AND DISORDERS OF THE DIGESTIVE SYSTEM,4,Extreme,Major,Medical,Private Health Insurance,,,,,Y,90248.49,20139.13
New York City,Manhattan,7002053,001463,NYU Langone Hospitals,50 to 69,103,F,Black/African American,Not Span/Hispanic,10,Emergency,Home w/ Home Health Services,2020,DIG021,GASTROINTESTINAL HEMORRHAGE,ESA001,HEMODIALYSIS,253,OTHER & UNSPECIFIED GASTROINTESTINAL HEMORRHAGE,06,DISEASES AND DISORDERS OF THE DIGESTIVE SYSTEM,3,Major,Extreme,Medical,Private Health Insurance,Medicaid,,,,Y,173332.74,54752.65
New York City,Manhattan,7002053,001463,NYU Langone Hospitals,50 to 69,112,M,White,Not Span/Hispanic,1,Emergency,Home or Self Care,2020,DIG021,GASTROINTESTINAL HEMORRHAGE,GIS004,GI SYSTEM ENDOSCOPY WITHOUT BIOPSY (DIAGNOSTIC),253,OTHER & UNSPECIFIED GASTROINTESTINAL HEMORRHAGE,06,DISEASES AND DISORDERS OF THE DIGESTIVE SYSTEM,2,Moderate,Minor,Medical,Medicare,Medicaid,,,,Y,43217.6,10955.31
New York City,Manhattan,7002053,001463,NYU Langone Hospitals,70 or Older,112,M,Other Race,Spanish/Hispanic,4,Emergency,Home w/ Home Health Services,2020,DIG021,GASTROINTESTINAL HEMORRHAGE,GIS004,GI SYSTEM ENDOSCOPY WITHOUT BIOPSY (DIAGNOSTIC),253,OTHER & UNSPECIFIED GASTROINTESTINAL HEMORRHAGE,06,DISEASES AND DISORDERS OF THE DIGESTIVE SYSTEM,2,Moderate,Moderate,Medical,Medicare,Medicaid,,,,Y,85824.06,19258.43
New York City,Manhattan,7002053,001463,NYU Langone Hospitals,70 or Older,111,M,White,Not Span/Hispanic,6,Emergency,Home w/ Home Health Services,2020,DIG021,GASTROINTESTINAL HEMORRHAGE,ADM001,TRANSFUSION OF BLOOD AND BLOOD PRODUCTS,253,OTHER & UNSPECIFIED GASTROINTESTINAL HEMORRHAGE,06,DISEASES AND DISORDERS OF THE DIGESTIVE SYSTEM,2,Moderate,Major,Medical,Medicare,,,,,Y,66662.14,21739.51
New York City,Manhattan,7002053,001463,NYU Langone Hospitals,50 to 69,100,F,Black/African American,Not Span/Hispanic,7,Emergency,Home or Self Care,2020,DIG008,OTHER SPECIFIED AND UNSPECIFIED DISORDERS OF STOMACH AND DUODENUM,ADM001,TRANSFUSION OF BLOOD AND BLOOD PRODUCTS,253,OTHER & UNSPECIFIED GASTROINTESTINAL HEMORRHAGE,06,DISEASES AND DISORDERS OF THE DIGESTIVE SYSTEM,3,Major,Moderate,Medical,Medicaid,,,,,Y,91236.95,24626.86
New York City,Manhattan,7002053,001463,NYU Langone Hospitals,70 or Older,113,M,White,Not Span/Hispanic,2,Emergency,Home or Self Care,2020,DIG025,OTHER SPECIFIED AND UNSPECIFIED GASTROINTESTINAL DISORDERS,GNR004,ENDOSCOPIC CONTROL OF BLEEDING,253,OTHER & UNSPECIFIED GASTROINTESTINAL HEMORRHAGE,06,DISEASES AND DISORDERS OF THE DIGESTIVE SYSTEM,2,Moderate,Major,Medical,Medicaid,,,,,Y,55220.82,11332.09
New York City,Manhattan,7002053,001463,NYU Langone Hospitals,70 or Older,OOS,M,Black/African American,Not Span/Hispanic,7,Emergency,Home or Self Care,2020,DIG025,OTHER SPECIFIED AND UNSPECIFIED GASTROINTESTINAL DISORDERS,GNR004,ENDOSCOPIC CONTROL OF BLEEDING,253,OTHER & UNSPECIFIED GASTROINTESTINAL HEMORRHAGE,06,DISEASES AND DISORDERS OF THE DIGESTIVE SYSTEM,3,Major,Major,Medical,Medicaid,,,,,N,167436.05,43534.2
New York City,Manhattan,7002053,001463,NYU Langone Hospitals,70 or Older,112,M,White,Not Span/Hispanic,1,Emergency,Home or Self Care,2020,DIG025,OTHER SPECIFIED AND UNSPECIFIED GASTROINTESTINAL DISORDERS,ADM001,TRANSFUSION OF BLOOD AND BLOOD PRODUCTS,253,OTHER & UNSPECIFIED GASTROINTESTINAL HEMORRHAGE,06,DISEASES AND DISORDERS OF THE DIGESTIVE SYSTEM,2,Moderate,Major,Medical,Medicare,Medicare,,,,Y,22786.75,4902.8
New York City,Manhattan,7002053,001463,NYU Langone Hospitals,70 or Older,113,M,Black/African American,Not Span/Hispanic,10,Emergency,Home or Self Care,2020,DIG025,OTHER SPECIFIED AND UNSPECIFIED GASTROINTESTINAL DISORDERS,GNR004,ENDOSCOPIC CONTROL OF BLEEDING,253,OTHER & UNSPECIFIED GASTROINTESTINAL HEMORRHAGE,06,DISEASES AND DISORDERS OF THE DIGESTIVE SYSTEM,3,Major,Major,Medical,Private Health Insurance,Medicaid,,,,N,146908.64,39900.17
New York City,Manhattan,7002053,001463,NYU Langone Hospitals,70 or Older,OOS,M,Other Race,Not Span/Hispanic,3,Emergency,Hospice - Medical Facility,2020,DIG021,GASTROINTESTINAL HEMORRHAGE,,,253,OTHER & UNSPECIFIED GASTROINTESTINAL HEMORRHAGE,06,DISEASES AND DISORDERS OF THE DIGESTIVE SYSTEM,3,Major,Moderate,Medical,Medicare,,,,,Y,59974.26,12001.05
New York City,Manhattan,7002053,001463,NYU Langone Hospitals,70 or Older,100,M,Other Race,Spanish/Hispanic,5,Emergency,Home w/ Home Health Services,2020,DIG025,OTHER SPECIFIED AND UNSPECIFIED GASTROINTESTINAL DISORDERS,ADM004,TRANSFUSION OF CLOTTING FACTORS,253,OTHER & UNSPECIFIED GASTROINTESTINAL HEMORRHAGE,06,DISEASES AND DISORDERS OF THE DIGESTIVE SYSTEM,3,Major,Major,Medical,Medicare,,,,,Y,167141.65,23117.37
New York City,Manhattan,7002053,001463,NYU Langone Hospitals,30 to 49,103,M,White,Unknown,5,Emergency,Home or Self Care,2020,DIG021,GASTROINTESTINAL HEMORRHAGE,GIS004,GI SYSTEM ENDOSCOPY WITHOUT BIOPSY (DIAGNOSTIC),253,OTHER & UNSPECIFIED GASTROINTESTINAL HEMORRHAGE,06,DISEASES AND DISORDERS OF THE DIGESTIVE SYSTEM,2,Moderate,Minor,Medical,Private Health Insurance,,,,,N,105776.98,24854.52
New York City,Manhattan,7002053,001463,NYU Langone Hospitals,70 or Older,112,F,Other Race,Spanish/Hispanic,2,Emergency,Home w/ Home Health Services,2020,DIG021,GASTROINTESTINAL HEMORRHAGE,ADM001,TRANSFUSION OF BLOOD AND BLOOD PRODUCTS,253,OTHER & UNSPECIFIED GASTROINTESTINAL HEMORRHAGE,06,DISEASES AND DISORDERS OF THE DIGESTIVE SYSTEM,3,Major,Major,Medical,Medicare,Medicaid,,,,Y,48134.46,12849.08
New York City,Manhattan,7002053,001463,NYU Langone Hospitals,50 to 69,100,M,Black/African American,Not Span/Hispanic,1,Emergency,Home or Self Care,2020,DIG008,OTHER SPECIFIED AND UNSPECIFIED DISORDERS OF STOMACH AND DUODENUM,GNR004,ENDOSCOPIC CONTROL OF BLEEDING,253,OTHER & UNSPECIFIED GASTROINTESTINAL HEMORRHAGE,06,DISEASES AND DISORDERS OF THE DIGESTIVE SYSTEM,2,Moderate,Moderate,Medical,Medicare,Private Health Insurance,,,,Y,72109.9,11152.62
New York City,Manhattan,7002053,001463,NYU Langone Hospitals,70 or Older,104,F,Other Race,Spanish/Hispanic,2,Emergency,Home or Self Care,2020,DIG025,OTHER SPECIFIED AND UNSPECIFIED GASTROINTESTINAL DISORDERS,GIS004,GI SYSTEM ENDOSCOPY WITHOUT BIOPSY (DIAGNOSTIC),253,OTHER & UNSPECIFIED GASTROINTESTINAL HEMORRHAGE,06,DISEASES AND DISORDERS OF THE DIGESTIVE SYSTEM,2,Moderate,Moderate,Medical,Medicaid,,,,,Y,58758.09,12115.11
New York City,Manhattan,7002053,001463,NYU Langone Hospitals,70 or Older,113,M,Other Race,Not Span/Hispanic,3,Emergency,Home w/ Home Health Services,2020,DIG025,OTHER SPECIFIED AND UNSPECIFIED GASTROINTESTINAL DISORDERS,GIS004,GI SYSTEM ENDOSCOPY WITHOUT BIOPSY (DIAGNOSTIC),253,OTHER & UNSPECIFIED GASTROINTESTINAL HEMORRHAGE,06,DISEASES AND DISORDERS OF THE DIGESTIVE SYSTEM,2,Moderate,Moderate,Medical,Medicare,Medicaid,,,,Y,73412.68,13981.28
New York City,Manhattan,7002053,001463,NYU Langone Hospitals,70 or Older,117,M,White,Not Span/Hispanic,3,Emergency,Home w/ Home Health Services,2020,DIG021,GASTROINTESTINAL HEMORRHAGE,ADM001,TRANSFUSION OF BLOOD AND BLOOD PRODUCTS,253,OTHER & UNSPECIFIED GASTROINTESTINAL HEMORRHAGE,06,DISEASES AND DISORDERS OF THE DIGESTIVE SYSTEM,1,Minor,Minor,Medical,Medicare,Blue Cross/Blue Shield,,,,N,31059.97,10515.62
New York City,Manhattan,7002053,001463,NYU Langone Hospitals,70 or Older,103,M,White,Not Span/Hispanic,6,Emergency,Home w/ Home Health Services,2020,DIG025,OTHER SPECIFIED AND UNSPECIFIED GASTROINTESTINAL DISORDERS,GIS005,EXPLORATION OF PERITONEAL CAVITY,253,OTHER & UNSPECIFIED GASTROINTESTINAL HEMORRHAGE,06,DISEASES AND DISORDERS OF THE DIGESTIVE SYSTEM,3,Major,Major,Medical,Medicare,Medicaid,,,,Y,75484.71,21466.43
New York City,Manhattan,7002053,001463,NYU Langone Hospitals,70 or Older,100,F,Other Race,Spanish/Hispanic,2,Emergency,Home w/ Home Health Services,2020,DIG025,OTHER SPECIFIED AND UNSPECIFIED GASTROINTESTINAL DISORDERS,ADM001,TRANSFUSION OF BLOOD AND BLOOD PRODUCTS,253,OTHER & UNSPECIFIED GASTROINTESTINAL HEMORRHAGE,06,DISEASES AND DISORDERS OF THE DIGESTIVE SYSTEM,3,Major,Major,Medical,Medicare,Blue Cross/Blue Shield,,,,Y,78017.1,21029.58
New York City,Manhattan,7002053,001463,NYU Langone Hospitals,50 to 69,103,M,Other Race,Spanish/Hispanic,3,Emergency,Home w/ Home Health Services,2020,DIG021,GASTROINTESTINAL HEMORRHAGE,GNR004,ENDOSCOPIC CONTROL OF BLEEDING,253,OTHER & UNSPECIFIED GASTROINTESTINAL HEMORRHAGE,06,DISEASES AND DISORDERS OF THE DIGESTIVE SYSTEM,3,Major,Extreme,Medical,Private Health Insurance,,,,,Y,70160.3,16369.98
New York City,Manhattan,7002053,001463,NYU Langone Hospitals,70 or Older,113,M,White,Not Span/Hispanic,8,Emergency,Home w/ Home Health Services,2020,DIG021,GASTROINTESTINAL HEMORRHAGE,ADM001,TRANSFUSION OF BLOOD AND BLOOD PRODUCTS,253,OTHER & UNSPECIFIED GASTROINTESTINAL HEMORRHAGE,06,DISEASES AND DISORDERS OF THE DIGESTIVE SYSTEM,3,Major,Major,Medical,Medicare,Blue Cross/Blue Shield,,,,Y,91809.19,31799.3
New York City,Manhattan,7002053,001463,NYU Langone Hospitals,70 or Older,112,M,White,Not Span/Hispanic,2,Emergency,Home or Self Care,2020,DIG021,GASTROINTESTINAL HEMORRHAGE,GIS004,GI SYSTEM ENDOSCOPY WITHOUT BIOPSY (DIAGNOSTIC),253,OTHER & UNSPECIFIED GASTROINTESTINAL HEMORRHAGE,06,DISEASES AND DISORDERS OF THE DIGESTIVE SYSTEM,1,Minor,Minor,Medical,Medicare,Medicare,,,,Y,39407.33,9401.73
New York City,Manhattan,7002053,001463,NYU Langone Hospitals,50 to 69,112,F,White,Not Span/Hispanic,3,Emergency,Home or Self Care,2020,DIG021,GASTROINTESTINAL HEMORRHAGE,ADM001,TRANSFUSION OF BLOOD AND BLOOD PRODUCTS,253,OTHER & UNSPECIFIED GASTROINTESTINAL HEMORRHAGE,06,DISEASES AND DISORDERS OF THE DIGESTIVE SYSTEM,2,Moderate,Moderate,Medical,Medicaid,,,,,Y,82153.62,19798.63
New York City,Manhattan,7002053,001463,NYU Langone Hospitals,70 or Older,103,F,White,Not Span/Hispanic,7,Emergency,Hospice - Home,2020,DIG021,GASTROINTESTINAL HEMORRHAGE,GIS001,ESOPHAGOGASTRODUODENOSCOPY (EGD) WITH BIOPSY,253,OTHER & UNSPECIFIED GASTROINTESTINAL HEMORRHAGE,06,DISEASES AND DISORDERS OF THE DIGESTIVE SYSTEM,3,Major,Major,Medical,Medicare,,,,,Y,102918.87,28513.14
New York City,Manhattan,7002053,001463,NYU Langone Hospitals,50 to 69,OOS,M,White,Not Span/Hispanic,2,Emergency,Home or Self Care,2020,DIG021,GASTROINTESTINAL HEMORRHAGE,GIS004,GI SYSTEM ENDOSCOPY WITHOUT BIOPSY (DIAGNOSTIC),253,OTHER & UNSPECIFIED GASTROINTESTINAL HEMORRHAGE,06,DISEASES AND DISORDERS OF THE DIGESTIVE SYSTEM,2,Moderate,Moderate,Medical,Medicare,,,,,Y,49194.57,10560.62
New York City,Manhattan,7002053,001463,NYU Langone Hospitals,70 or Older,115,M,White,Not Span/Hispanic,6,Emergency,Home w/ Home Health Services,2020,DIG025,OTHER SPECIFIED AND UNSPECIFIED GASTROINTESTINAL DISORDERS,GNR004,ENDOSCOPIC CONTROL OF BLEEDING,253,OTHER & UNSPECIFIED GASTROINTESTINAL HEMORRHAGE,06,DISEASES AND DISORDERS OF THE DIGESTIVE SYSTEM,3,Major,Moderate,Medical,Medicare,Private Health Insurance,,,,N,104861.83,26459.42
New York City,Manhattan,7002053,001463,NYU Langone Hospitals,50 to 69,114,M,Other Race,Not Span/Hispanic,3,Emergency,Short-term Hospital,2020,DIG008,OTHER SPECIFIED AND UNSPECIFIED DISORDERS OF STOMACH AND DUODENUM,GNR004,ENDOSCOPIC CONTROL OF BLEEDING,253,OTHER & UNSPECIFIED GASTROINTESTINAL HEMORRHAGE,06,DISEASES AND DISORDERS OF THE DIGESTIVE SYSTEM,3,Major,Moderate,Medical,Medicare,Private Health Insurance,,,,N,86662.34,16460.58
New York City,Manhattan,7002053,001463,NYU Langone Hospitals,50 to 69,100,M,Other Race,Unknown,1,Emergency,Left Against Medical Advice,2020,DIG021,GASTROINTESTINAL HEMORRHAGE,,,253,OTHER & UNSPECIFIED GASTROINTESTINAL HEMORRHAGE,06,DISEASES AND DISORDERS OF THE DIGESTIVE SYSTEM,2,Moderate,Moderate,Medical,Medicaid,,,,,Y,35555.75,9192.71
New York City,Manhattan,7002053,001463,NYU Langone Hospitals,50 to 69,112,F,Black/African American,Not Span/Hispanic,10,Emergency,Home w/ Home Health Services,2020,DIG021,GASTROINTESTINAL HEMORRHAGE,GIS004,GI SYSTEM ENDOSCOPY WITHOUT BIOPSY (DIAGNOSTIC),253,OTHER & UNSPECIFIED GASTROINTESTINAL HEMORRHAGE,06,DISEASES AND DISORDERS OF THE DIGESTIVE SYSTEM,2,Moderate,Moderate,Medical,Medicare,,,,,Y,109530.27,36299.61
New York City,Manhattan,7002053,001463,NYU Langone Hospitals,50 to 69,112,M,Black/African American,Unknown,1,Emergency,Home or Self Care,2020,DIG021,GASTROINTESTINAL HEMORRHAGE,ENT013,ENT REPAIR,253,OTHER & UNSPECIFIED GASTROINTESTINAL HEMORRHAGE,06,DISEASES AND DISORDERS OF THE DIGESTIVE SYSTEM,2,Moderate,Minor,Medical,Medicaid,,,,,Y,25435.87,5434.26
New York City,Manhattan,7002053,001463,NYU Langone Hospitals,70 or Older,100,F,Other Race,Not Span/Hispanic,2,Emergency,Home w/ Home Health Services,2020,DIG021,GASTROINTESTINAL HEMORRHAGE,ADM010,VACCINATIONS,253,OTHER & UNSPECIFIED GASTROINTESTINAL HEMORRHAGE,06,DISEASES AND DISORDERS OF THE DIGESTIVE SYSTEM,3,Major,Moderate,Medical,Medicare,Medicaid,,,,Y,37493.79,9143.07
New York City,Manhattan,7002053,001463,NYU Langone Hospitals,50 to 69,100,M,White,Not Span/Hispanic,3,Emergency,Home or Self Care,2020,DIG008,OTHER SPECIFIED AND UNSPECIFIED DISORDERS OF STOMACH AND DUODENUM,GIS004,GI SYSTEM ENDOSCOPY WITHOUT BIOPSY (DIAGNOSTIC),253,OTHER & UNSPECIFIED GASTROINTESTINAL HEMORRHAGE,06,DISEASES AND DISORDERS OF THE DIGESTIVE SYSTEM,2,Moderate,Minor,Medical,Medicare,Medicare,,,,Y,75521.76,19214.21
New York City,Manhattan,7002053,001463,NYU Langone Hospitals,70 or Older,113,M,White,Not Span/Hispanic,8,Emergency,Home or Self Care,2020,DIG008,OTHER SPECIFIED AND UNSPECIFIED DISORDERS OF STOMACH AND DUODENUM,ADM001,TRANSFUSION OF BLOOD AND BLOOD PRODUCTS,253,OTHER & UNSPECIFIED GASTROINTESTINAL HEMORRHAGE,06,DISEASES AND DISORDERS OF THE DIGESTIVE SYSTEM,2,Moderate,Extreme,Medical,Medicare,,,,,Y,160854.63,38790.84
New York City,Manhattan,7002053,001463,NYU Langone Hospitals,70 or Older,OOS,M,Other Race,Spanish/Hispanic,4,Emergency,Home w/ Home Health Services,2020,DIG025,OTHER SPECIFIED AND UNSPECIFIED GASTROINTESTINAL DISORDERS,GNR004,ENDOSCOPIC CONTROL OF BLEEDING,253,OTHER & UNSPECIFIED GASTROINTESTINAL HEMORRHAGE,06,DISEASES AND DISORDERS OF THE DIGESTIVE SYSTEM,2,Moderate,Moderate,Medical,Medicare,Blue Cross/Blue Shield,,,,Y,84496.68,22881.02
New York City,Manhattan,7002053,001463,NYU Langone Hospitals,70 or Older,103,M,White,Not Span/Hispanic,3,Emergency,Home w/ Home Health Services,2020,DIG025,OTHER SPECIFIED AND UNSPECIFIED GASTROINTESTINAL DISORDERS,ADM001,TRANSFUSION OF BLOOD AND BLOOD PRODUCTS,253,OTHER & UNSPECIFIED GASTROINTESTINAL HEMORRHAGE,06,DISEASES AND DISORDERS OF THE DIGESTIVE SYSTEM,3,Major,Major,Medical,Medicare,Medicaid,,,,Y,48556.79,11817.83
New York City,Manhattan,7002053,001463,NYU Langone Hospitals,70 or Older,111,M,White,Not Span/Hispanic,2,Emergency,Home or Self Care,2020,DIG008,OTHER SPECIFIED AND UNSPECIFIED DISORDERS OF STOMACH AND DUODENUM,GNR004,ENDOSCOPIC CONTROL OF BLEEDING,253,OTHER & UNSPECIFIED GASTROINTESTINAL HEMORRHAGE,06,DISEASES AND DISORDERS OF THE DIGESTIVE SYSTEM,2,Moderate,Moderate,Medical,Medicare,Private Health Insurance,,,,Y,82903.82,15713.73
New York City,Manhattan,7002053,001463,NYU Langone Hospitals,70 or Older,100,F,White,Not Span/Hispanic,4,Emergency,Skilled Nursing Home,2020,DIG021,GASTROINTESTINAL HEMORRHAGE,,,253,OTHER & UNSPECIFIED GASTROINTESTINAL HEMORRHAGE,06,DISEASES AND DISORDERS OF THE DIGESTIVE SYSTEM,2,Moderate,Moderate,Medical,Medicare,,,,,Y,47559.82,15099.78
New York City,Manhattan,7002053,001463,NYU Langone Hospitals,50 to 69,112,F,Other Race,Spanish/Hispanic,2,Emergency,Home or Self Care,2020,DIG021,GASTROINTESTINAL HEMORRHAGE,GIS016,GI SYSTEM ENDOSCOPIC THERAPEUTIC PROCEDURES,253,OTHER & UNSPECIFIED GASTROINTESTINAL HEMORRHAGE,06,DISEASES AND DISORDERS OF THE DIGESTIVE SYSTEM,1,Minor,Minor,Medical,Medicare,Medicaid,,,,Y,60258.82,12371.6
New York City,Manhattan,7002053,001463,NYU Langone Hospitals,18 to 29,100,F,White,Not Span/Hispanic,7,Emergency,Short-term Hospital,2020,DIG025,OTHER SPECIFIED AND UNSPECIFIED GASTROINTESTINAL DISORDERS,,,253,OTHER & UNSPECIFIED GASTROINTESTINAL HEMORRHAGE,06,DISEASES AND DISORDERS OF THE DIGESTIVE SYSTEM,2,Moderate,Moderate,Medical,Private Health Insurance,,,,,Y,128936.79,45189.25
New York City,Manhattan,7002053,001463,NYU Langone Hospitals,50 to 69,104,M,Other Race,Spanish/Hispanic,5,Emergency,Home or Self Care,2020,DIG021,GASTROINTESTINAL HEMORRHAGE,GIS004,GI SYSTEM ENDOSCOPY WITHOUT BIOPSY (DIAGNOSTIC),253,OTHER & UNSPECIFIED GASTROINTESTINAL HEMORRHAGE,06,DISEASES AND DISORDERS OF THE DIGESTIVE SYSTEM,3,Major,Major,Medical,Medicaid,,,,,N,82571.43,20840.18
New York City,Manhattan,7002053,001463,NYU Langone Hospitals,70 or Older,,F,White,Not Span/Hispanic,1,Emergency,Home or Self Care,2020,DIG025,OTHER SPECIFIED AND UNSPECIFIED GASTROINTESTINAL DISORDERS,GNR004,ENDOSCOPIC CONTROL OF BLEEDING,253,OTHER & UNSPECIFIED GASTROINTESTINAL HEMORRHAGE,06,DISEASES AND DISORDERS OF THE DIGESTIVE SYSTEM,2,Moderate,Minor,Medical,Medicare,Blue Cross/Blue Shield,,,,Y,63208.02,11036.21
New York City,Manhattan,7002053,001463,NYU Langone Hospitals,70 or Older,100,M,White,Not Span/Hispanic,5,Emergency,Home or Self Care,2020,DIG025,OTHER SPECIFIED AND UNSPECIFIED GASTROINTESTINAL DISORDERS,GIS004,GI SYSTEM ENDOSCOPY WITHOUT BIOPSY (DIAGNOSTIC),253,OTHER & UNSPECIFIED GASTROINTESTINAL HEMORRHAGE,06,DISEASES AND DISORDERS OF THE DIGESTIVE SYSTEM,3,Major,Extreme,Medical,Medicare,Medicare,,,,Y,92049.34,22858.73
New York City,Manhattan,7002053,001463,NYU Langone Hospitals,70 or Older,100,F,Other Race,Spanish/Hispanic,3,Emergency,Home or Self Care,2020,DIG025,OTHER SPECIFIED AND UNSPECIFIED GASTROINTESTINAL DISORDERS,ADM001,TRANSFUSION OF BLOOD AND BLOOD PRODUCTS,253,OTHER & UNSPECIFIED GASTROINTESTINAL HEMORRHAGE,06,DISEASES AND DISORDERS OF THE DIGESTIVE SYSTEM,2,Moderate,Major,Medical,Medicare,Blue Cross/Blue Shield,,,,Y,52990.66,12086.6
New York City,Manhattan,7002053,001463,NYU Langone Hospitals,50 to 69,100,M,Other Race,Spanish/Hispanic,1,Emergency,Left Against Medical Advice,2020,DIG021,GASTROINTESTINAL HEMORRHAGE,ADM001,TRANSFUSION OF BLOOD AND BLOOD PRODUCTS,253,OTHER & UNSPECIFIED GASTROINTESTINAL HEMORRHAGE,06,DISEASES AND DISORDERS OF THE DIGESTIVE SYSTEM,3,Major,Major,Medical,Medicaid,,,,,Y,19444.56,4641.12
New York City,Manhattan,7002053,001463,NYU Langone Hospitals,50 to 69,100,M,Other Race,Spanish/Hispanic,1,Emergency,Home or Self Care,2020,DIG021,GASTROINTESTINAL HEMORRHAGE,,,253,OTHER & UNSPECIFIED GASTROINTESTINAL HEMORRHAGE,06,DISEASES AND DISORDERS OF THE DIGESTIVE SYSTEM,2,Moderate,Major,Medical,Medicaid,,,,,Y,25302.18,5391.06
New York City,Manhattan,7002053,001463,NYU Langone Hospitals,70 or Older,117,M,White,Not Span/Hispanic,5,Emergency,Expired,2020,DIG021,GASTROINTESTINAL HEMORRHAGE,OTR004,ISOLATION PROCEDURES,253,OTHER & UNSPECIFIED GASTROINTESTINAL HEMORRHAGE,06,DISEASES AND DISORDERS OF THE DIGESTIVE SYSTEM,2,Moderate,Moderate,Medical,Medicare,Medicare,,,,N,40626.62,18364.73
New York City,Manhattan,7002053,001463,NYU Langone Hospitals,50 to 69,111,M,White,Not Span/Hispanic,6,Emergency,Home w/ Home Health Services,2020,DIG021,GASTROINTESTINAL HEMORRHAGE,GNR004,ENDOSCOPIC CONTROL OF BLEEDING,253,OTHER & UNSPECIFIED GASTROINTESTINAL HEMORRHAGE,06,DISEASES AND DISORDERS OF THE DIGESTIVE SYSTEM,3,Major,Major,Medical,Medicare,Medicare,,,,Y,108340.61,26862.13
New York City,Manhattan,7002053,001463,NYU Langone Hospitals,70 or Older,100,F,Other Race,Spanish/Hispanic,8,Emergency,Home or Self Care,2020,DIG008,OTHER SPECIFIED AND UNSPECIFIED DISORDERS OF STOMACH AND DUODENUM,GNR004,ENDOSCOPIC CONTROL OF BLEEDING,253,OTHER & UNSPECIFIED GASTROINTESTINAL HEMORRHAGE,06,DISEASES AND DISORDERS OF THE DIGESTIVE SYSTEM,4,Extreme,Extreme,Medical,Medicare,Blue Cross/Blue Shield,,,,Y,171801.04,37396.51
New York City,Manhattan,7002053,001463,NYU Langone Hospitals,50 to 69,112,M,White,Not Span/Hispanic,2,Emergency,Home or Self Care,2020,DIG021,GASTROINTESTINAL HEMORRHAGE,GIS004,GI SYSTEM ENDOSCOPY WITHOUT BIOPSY (DIAGNOSTIC),253,OTHER & UNSPECIFIED GASTROINTESTINAL HEMORRHAGE,06,DISEASES AND DISORDERS OF THE DIGESTIVE SYSTEM,3,Major,Major,Medical,Blue Cross/Blue Shield,Medicare,,,,Y,74305.93,13622.62
New York City,Manhattan,7002053,001463,NYU Langone Hospitals,70 or Older,100,M,Other Race,Spanish/Hispanic,1,Emergency,Home or Self Care,2020,DIG008,OTHER SPECIFIED AND UNSPECIFIED DISORDERS OF STOMACH AND DUODENUM,GIS001,ESOPHAGOGASTRODUODENOSCOPY (EGD) WITH BIOPSY,253,OTHER & UNSPECIFIED GASTROINTESTINAL HEMORRHAGE,06,DISEASES AND DISORDERS OF THE DIGESTIVE SYSTEM,2,Moderate,Moderate,Medical,Medicare,,,,,Y,45547.73,7926.92
New York City,Manhattan,7002053,001463,NYU Langone Hospitals,50 to 69,100,F,Black/African American,Not Span/Hispanic,2,Emergency,Home or Self Care,2020,DIG025,OTHER SPECIFIED AND UNSPECIFIED GASTROINTESTINAL DISORDERS,ADM001,TRANSFUSION OF BLOOD AND BLOOD PRODUCTS,253,OTHER & UNSPECIFIED GASTROINTESTINAL HEMORRHAGE,06,DISEASES AND DISORDERS OF THE DIGESTIVE SYSTEM,3,Major,Major,Medical,Medicaid,,,,,Y,41851,9056.22
New York City,Manhattan,7002053,001463,NYU Langone Hospitals,70 or Older,115,M,White,Not Span/Hispanic,4,Emergency,Home or Self Care,2020,DIG025,OTHER SPECIFIED AND UNSPECIFIED GASTROINTESTINAL DISORDERS,GNR004,ENDOSCOPIC CONTROL OF BLEEDING,253,OTHER & UNSPECIFIED GASTROINTESTINAL HEMORRHAGE,06,DISEASES AND DISORDERS OF THE DIGESTIVE SYSTEM,3,Major,Moderate,Medical,Medicare,Private Health Insurance,,,,Y,94250.61,20938.35