Hospital Service Area,Hospital County,Operating Certificate Number,Permanent Facility Id,Facility Name,Age Group,Zip Code - 3 digits,Gender,Race,Ethnicity,Length of Stay,Type of Admission,Patient Disposition,Discharge Year,CCS Diagnosis Code,CCS Diagnosis Description,CCS Procedure Code,CCS Procedure Description,APR DRG Code,APR DRG Description,APR MDC Code,APR MDC Description,APR Severity of Illness Code,APR Severity of Illness Description,APR Risk of Mortality,APR Medical Surgical Description,Payment Typology 1,Payment Typology 2,Payment Typology 3,Birth Weight,Abortion Edit Indicator,Emergency Department Indicator,Total Charges,Total Costs
Long Island,Nassau,2908000,000511,NYU Langone Hospital-Long Island,18 to 29,110,M,White,Spanish/Hispanic,4,Emergency,Home or Self Care,2019,DIG025,OTHER SPECIFIED AND UNSPECIFIED GASTROINTESTINAL DISORDERS,GIS004,GI SYSTEM ENDOSCOPY WITHOUT BIOPSY (DIAGNOSTIC),254,OTHER DIGESTIVE SYSTEM DIAGNOSES,06,DISEASES AND DISORDERS OF THE DIGESTIVE SYSTEM,1,Minor,Minor,Medical,Medicaid,,,,,true,47550.6,9400.73
Long Island,Nassau,2908000,000511,NYU Langone Hospital-Long Island,50 to 69,113,F,Other Race,Not Span/Hispanic,6,Urgent,Home or Self Care,2019,NEO073,BENIGN NEOPLASMS,GIS016,GI SYSTEM ENDOSCOPIC THERAPEUTIC PROCEDURES,254,OTHER DIGESTIVE SYSTEM DIAGNOSES,06,DISEASES AND DISORDERS OF THE DIGESTIVE SYSTEM,2,Moderate,Minor,Medical,Medicare,Medicare,,,,false,134468.61,22021.91
Long Island,Nassau,2908000,000511,NYU Langone Hospital-Long Island,70 or Older,117,F,White,Not Span/Hispanic,5,Emergency,Home w/ Home Health Services,2019,DIG021,GASTROINTESTINAL HEMORRHAGE,GIS005,EXPLORATION OF PERITONEAL CAVITY,254,OTHER DIGESTIVE SYSTEM DIAGNOSES,06,DISEASES AND DISORDERS OF THE DIGESTIVE SYSTEM,3,Major,Major,Medical,Medicare,Medicare,,,,true,120521.62,20555.97
Long Island,Nassau,2908000,000511,NYU Langone Hospital-Long Island,70 or Older,110,M,White,Not Span/Hispanic,12,Emergency,Home w/ Home Health Services,2019,FAC010,OTHER AFTERCARE ENCOUNTER,GIS017,GASTROSTOMY,254,OTHER DIGESTIVE SYSTEM DIAGNOSES,06,DISEASES AND DISORDERS OF THE DIGESTIVE SYSTEM,3,Major,Major,Medical,Medicare,Medicare,Private Health Insurance,,,true,267793.44,46228.34
Long Island,Nassau,2908000,000511,NYU Langone Hospital-Long Island,70 or Older,110,F,White,Not Span/Hispanic,1,Emergency,Home or Self Care,2019,DIG025,OTHER SPECIFIED AND UNSPECIFIED GASTROINTESTINAL DISORDERS,,,254,OTHER DIGESTIVE SYSTEM DIAGNOSES,06,DISEASES AND DISORDERS OF THE DIGESTIVE SYSTEM,1,Minor,Minor,Medical,Medicare,Medicare,Blue Cross/Blue Shield,,,true,33137.57,4479.22
Long Island,Nassau,2908000,000511,NYU Langone Hospital-Long Island,70 or Older,115,M,White,Not Span/Hispanic,4,Emergency,Home or Self Care,2019,DIG015,ANAL AND RECTAL CONDITIONS,GIS002,COLONOSCOPY AND PROCTOSCOPY WITH BIOPSY,254,OTHER DIGESTIVE SYSTEM DIAGNOSES,06,DISEASES AND DISORDERS OF THE DIGESTIVE SYSTEM,3,Major,Minor,Medical,Medicare,Medicare,Private Health Insurance,,,true,130657.27,20543.32
Long Island,Nassau,2908000,000511,NYU Langone Hospital-Long Island,50 to 69,115,M,White,Not Span/Hispanic,3,Emergency,Home or Self Care,2019,SYM005,DYSPHAGIA,RES001,BRONCHOSCOPY (DIAGNOSTIC),254,OTHER DIGESTIVE SYSTEM DIAGNOSES,06,DISEASES AND DISORDERS OF THE DIGESTIVE SYSTEM,1,Minor,Minor,Medical,Private Health Insurance,,,,,true,110736.95,14073.97
Long Island,Nassau,2908000,000511,NYU Langone Hospital-Long Island,30 to 49,115,M,White,Spanish/Hispanic,1,Emergency,Home or Self Care,2019,DIG014,HEMORRHOIDS,ADM001,TRANSFUSION OF BLOOD AND BLOOD PRODUCTS,254,OTHER DIGESTIVE SYSTEM DIAGNOSES,06,DISEASES AND DISORDERS OF THE DIGESTIVE SYSTEM,1,Minor,Minor,Medical,Federal/State/Local/VA,,,,,true,32335.11,4528.83
Long Island,Nassau,2908000,000511,NYU Langone Hospital-Long Island,70 or Older,115,M,White,Not Span/Hispanic,3,Emergency,Home w/ Home Health Services,2019,DIG014,HEMORRHOIDS,GIS004,GI SYSTEM ENDOSCOPY WITHOUT BIOPSY (DIAGNOSTIC),254,OTHER DIGESTIVE SYSTEM DIAGNOSES,06,DISEASES AND DISORDERS OF THE DIGESTIVE SYSTEM,1,Minor,Moderate,Medical,Medicare,Medicare,Private Health Insurance,,,true,43238.68,7767.93
Long Island,Nassau,2908000,000511,NYU Langone Hospital-Long Island,50 to 69,115,F,White,Not Span/Hispanic,14,Emergency,Home w/ Home Health Services,2019,DIG025,OTHER SPECIFIED AND UNSPECIFIED GASTROINTESTINAL DISORDERS,GIS001,ESOPHAGOGASTRODUODENOSCOPY (EGD) WITH BIOPSY,254,OTHER DIGESTIVE SYSTEM DIAGNOSES,06,DISEASES AND DISORDERS OF THE DIGESTIVE SYSTEM,3,Major,Major,Medical,Medicare,Medicare,Blue Cross/Blue Shield,,,true,161681.06,32715.34
Long Island,Nassau,2908000,000511,NYU Langone Hospital-Long Island,30 to 49,115,M,White,Not Span/Hispanic,3,Emergency,Home or Self Care,2019,DIG021,GASTROINTESTINAL HEMORRHAGE,GIS001,ESOPHAGOGASTRODUODENOSCOPY (EGD) WITH BIOPSY,254,OTHER DIGESTIVE SYSTEM DIAGNOSES,06,DISEASES AND DISORDERS OF THE DIGESTIVE SYSTEM,2,Moderate,Minor,Medical,Blue Cross/Blue Shield,,,,,true,44506.39,7518.75
Long Island,Nassau,2908000,000511,NYU Langone Hospital-Long Island,70 or Older,117,M,White,Not Span/Hispanic,13,Urgent,Home or Self Care,2019,NEO072,NEOPLASMS OF UNSPECIFIED NATURE OR UNCERTAIN BEHAVIOR,GIS016,GI SYSTEM ENDOSCOPIC THERAPEUTIC PROCEDURES,254,OTHER DIGESTIVE SYSTEM DIAGNOSES,06,DISEASES AND DISORDERS OF THE DIGESTIVE SYSTEM,3,Major,Minor,Medical,Medicare,Medicare,Blue Cross/Blue Shield,,,false,320626.72,74262.43
Long Island,Nassau,2908000,000511,NYU Langone Hospital-Long Island,70 or Older,110,F,White,Spanish/Hispanic,3,Emergency,Home or Self Care,2019,DIG025,OTHER SPECIFIED AND UNSPECIFIED GASTROINTESTINAL DISORDERS,,,254,OTHER DIGESTIVE SYSTEM DIAGNOSES,06,DISEASES AND DISORDERS OF THE DIGESTIVE SYSTEM,2,Moderate,Minor,Medical,Medicare,Medicare,Private Health Insurance,,,true,42824.8,7338.67
Long Island,Nassau,2908000,000511,NYU Langone Hospital-Long Island,0 to 17,115,M,White,Not Span/Hispanic,2,Emergency,Home or Self Care,2019,DIG025,OTHER SPECIFIED AND UNSPECIFIED GASTROINTESTINAL DISORDERS,GIS001,ESOPHAGOGASTRODUODENOSCOPY (EGD) WITH BIOPSY,254,OTHER DIGESTIVE SYSTEM DIAGNOSES,06,DISEASES AND DISORDERS OF THE DIGESTIVE SYSTEM,1,Minor,Minor,Medical,Blue Cross/Blue Shield,,,,,true,51365.3,6448.02
Long Island,Nassau,2908000,000511,NYU Langone Hospital-Long Island,70 or Older,115,F,White,Not Span/Hispanic,3,Emergency,Skilled Nursing Home,2019,DIG021,GASTROINTESTINAL HEMORRHAGE,,,254,OTHER DIGESTIVE SYSTEM DIAGNOSES,06,DISEASES AND DISORDERS OF THE DIGESTIVE SYSTEM,3,Major,Major,Medical,Medicare,Medicaid,,,,true,30001.83,6313.21
Long Island,Nassau,2908000,000511,NYU Langone Hospital-Long Island,30 to 49,115,M,White,Not Span/Hispanic,3,Emergency,Home or Self Care,2019,DIG014,HEMORRHOIDS,ADM001,TRANSFUSION OF BLOOD AND BLOOD PRODUCTS,254,OTHER DIGESTIVE SYSTEM DIAGNOSES,06,DISEASES AND DISORDERS OF THE DIGESTIVE SYSTEM,1,Minor,Minor,Medical,Private Health Insurance,,,,,true,61471.95,9261.66
Long Island,Nassau,2908000,000511,NYU Langone Hospital-Long Island,50 to 69,115,F,White,Not Span/Hispanic,1,Emergency,Left Against Medical Advice,2019,DIG025,OTHER SPECIFIED AND UNSPECIFIED GASTROINTESTINAL DISORDERS,,,254,OTHER DIGESTIVE SYSTEM DIAGNOSES,06,DISEASES AND DISORDERS OF THE DIGESTIVE SYSTEM,1,Minor,Minor,Medical,Medicaid,,,,,true,22058.41,2937.61
Long Island,Nassau,2908000,000511,NYU Langone Hospital-Long Island,70 or Older,115,M,Black/African American,Not Span/Hispanic,6,Emergency,Skilled Nursing Home,2019,INJ030,DRUG INDUCED OR TOXIC RELATED CONDITION,,,254,OTHER DIGESTIVE SYSTEM DIAGNOSES,06,DISEASES AND DISORDERS OF THE DIGESTIVE SYSTEM,2,Moderate,Major,Medical,Medicare,Medicare,Medicaid,,,true,71369.54,13413.61
Long Island,Nassau,2908000,000511,NYU Langone Hospital-Long Island,50 to 69,115,F,Black/African American,Not Span/Hispanic,15,Emergency,Skilled Nursing Home,2019,DIG021,GASTROINTESTINAL HEMORRHAGE,ADM001,TRANSFUSION OF BLOOD AND BLOOD PRODUCTS,254,OTHER DIGESTIVE SYSTEM DIAGNOSES,06,DISEASES AND DISORDERS OF THE DIGESTIVE SYSTEM,3,Major,Major,Medical,Medicare,Medicare,Medicaid,,,true,430514.58,65333.23
Long Island,Nassau,2908000,000511,NYU Langone Hospital-Long Island,50 to 69,117,F,White,Not Span/Hispanic,7,Emergency,Home w/ Home Health Services,2019,DIG025,OTHER SPECIFIED AND UNSPECIFIED GASTROINTESTINAL DISORDERS,GIS002,COLONOSCOPY AND PROCTOSCOPY WITH BIOPSY,254,OTHER DIGESTIVE SYSTEM DIAGNOSES,06,DISEASES AND DISORDERS OF THE DIGESTIVE SYSTEM,3,Major,Major,Medical,Medicare,Medicare,Medicaid,,,true,106116.55,17592.85
Long Island,Nassau,2908000,000511,NYU Langone Hospital-Long Island,50 to 69,115,M,Black/African American,Not Span/Hispanic,1,Emergency,Home or Self Care,2019,DIG010,ABDOMINAL HERNIA,,,254,OTHER DIGESTIVE SYSTEM DIAGNOSES,06,DISEASES AND DISORDERS OF THE DIGESTIVE SYSTEM,2,Moderate,Minor,Medical,Blue Cross/Blue Shield,Medicare,Medicare,,,true,24348.24,3129.6
Long Island,Nassau,2908000,000511,NYU Langone Hospital-Long Island,50 to 69,110,M,Other Race,Spanish/Hispanic,1,Emergency,Home or Self Care,2019,DIG010,ABDOMINAL HERNIA,,,254,OTHER DIGESTIVE SYSTEM DIAGNOSES,06,DISEASES AND DISORDERS OF THE DIGESTIVE SYSTEM,2,Moderate,Minor,Medical,Blue Cross/Blue Shield,,,,,true,25348.89,3229.52
Long Island,Nassau,2908000,000511,NYU Langone Hospital-Long Island,50 to 69,113,M,White,Spanish/Hispanic,2,Urgent,Home or Self Care,2019,NEO073,BENIGN NEOPLASMS,GIS001,ESOPHAGOGASTRODUODENOSCOPY (EGD) WITH BIOPSY,254,OTHER DIGESTIVE SYSTEM DIAGNOSES,06,DISEASES AND DISORDERS OF THE DIGESTIVE SYSTEM,2,Moderate,Minor,Medical,Medicaid,Medicaid,,,,false,63584.5,10017.16
Long Island,Nassau,2908000,000511,NYU Langone Hospital-Long Island,70 or Older,115,M,White,Spanish/Hispanic,10,Emergency,Skilled Nursing Home,2019,DIG025,OTHER SPECIFIED AND UNSPECIFIED GASTROINTESTINAL DISORDERS,GIS029,"LOWER GI THERAPEUTIC PROCEDURES, NEC (EXCLUDING OPEN AND LAPAROSCOPIC)",254,OTHER DIGESTIVE SYSTEM DIAGNOSES,06,DISEASES AND DISORDERS OF THE DIGESTIVE SYSTEM,1,Minor,Moderate,Medical,Medicare,Medicare,Blue Cross/Blue Shield,,,true,100222.6,20940.95
Long Island,Nassau,2908000,000511,NYU Langone Hospital-Long Island,70 or Older,115,F,White,Not Span/Hispanic,4,Emergency,Home w/ Home Health Services,2019,DIG025,OTHER SPECIFIED AND UNSPECIFIED GASTROINTESTINAL DISORDERS,,,254,OTHER DIGESTIVE SYSTEM DIAGNOSES,06,DISEASES AND DISORDERS OF THE DIGESTIVE SYSTEM,2,Moderate,Major,Medical,Medicare,Medicare,Private Health Insurance,,,true,66903.48,9995.59
Long Island,Nassau,2908000,000511,NYU Langone Hospital-Long Island,70 or Older,118,F,Black/African American,Not Span/Hispanic,14,Emergency,Skilled Nursing Home,2019,DIG025,OTHER SPECIFIED AND UNSPECIFIED GASTROINTESTINAL DISORDERS,,,254,OTHER DIGESTIVE SYSTEM DIAGNOSES,06,DISEASES AND DISORDERS OF THE DIGESTIVE SYSTEM,2,Moderate,Major,Medical,Medicare,Medicare,,,,true,124954.83,28771.45
Long Island,Nassau,2908000,000511,NYU Langone Hospital-Long Island,70 or Older,117,M,Other Race,Not Span/Hispanic,1,Emergency,Home or Self Care,2019,NEO072,NEOPLASMS OF UNSPECIFIED NATURE OR UNCERTAIN BEHAVIOR,ADM001,TRANSFUSION OF BLOOD AND BLOOD PRODUCTS,254,OTHER DIGESTIVE SYSTEM DIAGNOSES,06,DISEASES AND DISORDERS OF THE DIGESTIVE SYSTEM,1,Minor,Moderate,Medical,Medicare,Medicare,,,,true,39496.9,5111.32
Long Island,Nassau,2908000,000511,NYU Langone Hospital-Long Island,70 or Older,113,M,White,Spanish/Hispanic,2,Emergency,Home w/ Home Health Services,2019,DIG015,ANAL AND RECTAL CONDITIONS,,,254,OTHER DIGESTIVE SYSTEM DIAGNOSES,06,DISEASES AND DISORDERS OF THE DIGESTIVE SYSTEM,3,Major,Major,Medical,Medicare,Medicare,Medicaid,,,true,24045.23,4545.37
Long Island,Nassau,2908000,000511,NYU Langone Hospital-Long Island,50 to 69,115,F,White,Not Span/Hispanic,1,Emergency,Home or Self Care,2019,DIG025,OTHER SPECIFIED AND UNSPECIFIED GASTROINTESTINAL DISORDERS,,,254,OTHER DIGESTIVE SYSTEM DIAGNOSES,06,DISEASES AND DISORDERS OF THE DIGESTIVE SYSTEM,1,Minor,Minor,Medical,Private Health Insurance,,,,,true,25444.5,3110.05
Long Island,Nassau,2908000,000511,NYU Langone Hospital-Long Island,50 to 69,115,F,White,Not Span/Hispanic,3,Emergency,Home or Self Care,2019,INJ020,"EFFECT OF FOREIGN BODY ENTERING OPENING, INITIAL ENCOUNTER",GIS027,"UPPER GI THERAPEUTIC PROCEDURES, NEC (ENDOSCOPIC)",254,OTHER DIGESTIVE SYSTEM DIAGNOSES,06,DISEASES AND DISORDERS OF THE DIGESTIVE SYSTEM,1,Minor,Minor,Medical,Blue Cross/Blue Shield,,,,,true,57099.48,8923.81
Long Island,Nassau,2908000,000511,NYU Langone Hospital-Long Island,18 to 29,115,M,White,Not Span/Hispanic,4,Emergency,Home or Self Care,2019,DIG008,OTHER SPECIFIED AND UNSPECIFIED DISORDERS OF STOMACH AND DUODENUM,,,254,OTHER DIGESTIVE SYSTEM DIAGNOSES,06,DISEASES AND DISORDERS OF THE DIGESTIVE SYSTEM,1,Minor,Minor,Medical,Medicaid,,,,,true,40652.92,8320.87
Long Island,Nassau,2908000,000511,NYU Langone Hospital-Long Island,50 to 69,117,F,White,Spanish/Hispanic,1,Elective,Home or Self Care,2019,FAC010,OTHER AFTERCARE ENCOUNTER,GIS029,"LOWER GI THERAPEUTIC PROCEDURES, NEC (EXCLUDING OPEN AND LAPAROSCOPIC)",254,OTHER DIGESTIVE SYSTEM DIAGNOSES,06,DISEASES AND DISORDERS OF THE DIGESTIVE SYSTEM,1,Minor,Minor,Medical,Medicaid,Medicaid,,,,false,35105.95,5848.06
Long Island,Nassau,2908000,000511,NYU Langone Hospital-Long Island,30 to 49,115,M,Other Race,Spanish/Hispanic,5,Emergency,Home or Self Care,2019,DIG021,GASTROINTESTINAL HEMORRHAGE,,,254,OTHER DIGESTIVE SYSTEM DIAGNOSES,06,DISEASES AND DISORDERS OF THE DIGESTIVE SYSTEM,3,Major,Moderate,Medical,Medicaid,,,,,true,71230.84,13075.78
Long Island,Nassau,2908000,000511,NYU Langone Hospital-Long Island,30 to 49,OOS,F,White,Spanish/Hispanic,2,Urgent,Home or Self Care,2019,NEO073,BENIGN NEOPLASMS,GIS016,GI SYSTEM ENDOSCOPIC THERAPEUTIC PROCEDURES,254,OTHER DIGESTIVE SYSTEM DIAGNOSES,06,DISEASES AND DISORDERS OF THE DIGESTIVE SYSTEM,1,Minor,Minor,Medical,Private Health Insurance,,,,,false,268799.96,39722.07
Long Island,Nassau,2908000,000511,NYU Langone Hospital-Long Island,18 to 29,,F,White,Not Span/Hispanic,3,Emergency,Home or Self Care,2019,DIG008,OTHER SPECIFIED AND UNSPECIFIED DISORDERS OF STOMACH AND DUODENUM,GIS001,ESOPHAGOGASTRODUODENOSCOPY (EGD) WITH BIOPSY,254,OTHER DIGESTIVE SYSTEM DIAGNOSES,06,DISEASES AND DISORDERS OF THE DIGESTIVE SYSTEM,3,Major,Moderate,Medical,Private Health Insurance,,,,,true,50367.01,8420.27
Long Island,Nassau,2908000,000511,NYU Langone Hospital-Long Island,70 or Older,115,F,White,Not Span/Hispanic,4,Emergency,Home w/ Home Health Services,2019,DIG010,ABDOMINAL HERNIA,,,254,OTHER DIGESTIVE SYSTEM DIAGNOSES,06,DISEASES AND DISORDERS OF THE DIGESTIVE SYSTEM,2,Moderate,Moderate,Medical,Medicare,Medicare,Private Health Insurance,,,true,45157.33,8512.82
Long Island,Nassau,2908000,000511,NYU Langone Hospital-Long Island,70 or Older,115,F,White,Not Span/Hispanic,13,Emergency,Hospice - Medical Facility,2019,DIG010,ABDOMINAL HERNIA,RES001,BRONCHOSCOPY (DIAGNOSTIC),254,OTHER DIGESTIVE SYSTEM DIAGNOSES,06,DISEASES AND DISORDERS OF THE DIGESTIVE SYSTEM,4,Extreme,Extreme,Medical,Medicare,Medicare,Private Health Insurance,,,true,318836.13,48150.28
Long Island,Nassau,2908000,000511,NYU Langone Hospital-Long Island,70 or Older,110,F,White,Not Span/Hispanic,9,Emergency,Hospice - Medical Facility,2019,DIG010,ABDOMINAL HERNIA,GIS007,GI SYSTEM DRAINAGE (EXCLUDING PARACENTESIS),254,OTHER DIGESTIVE SYSTEM DIAGNOSES,06,DISEASES AND DISORDERS OF THE DIGESTIVE SYSTEM,4,Extreme,Extreme,Medical,Medicare,Medicare,Private Health Insurance,,,true,134524.05,22152.32
Long Island,Nassau,2908000,000511,NYU Langone Hospital-Long Island,30 to 49,115,F,White,Not Span/Hispanic,2,Emergency,Left Against Medical Advice,2019,INJ020,"EFFECT OF FOREIGN BODY ENTERING OPENING, INITIAL ENCOUNTER",,,254,OTHER DIGESTIVE SYSTEM DIAGNOSES,06,DISEASES AND DISORDERS OF THE DIGESTIVE SYSTEM,2,Moderate,Minor,Medical,Medicare,Medicare,Medicaid,,,true,61520.56,8998.87
Long Island,Nassau,2908000,000511,NYU Langone Hospital-Long Island,70 or Older,115,F,Black/African American,Not Span/Hispanic,4,Emergency,Home w/ Home Health Services,2019,DIG025,OTHER SPECIFIED AND UNSPECIFIED GASTROINTESTINAL DISORDERS,,,254,OTHER DIGESTIVE SYSTEM DIAGNOSES,06,DISEASES AND DISORDERS OF THE DIGESTIVE SYSTEM,2,Moderate,Major,Medical,Medicare,Medicare,,,,true,47383.55,8946.06
Long Island,Nassau,2908000,000511,NYU Langone Hospital-Long Island,50 to 69,115,M,White,Not Span/Hispanic,6,Emergency,Home or Self Care,2019,DIG008,OTHER SPECIFIED AND UNSPECIFIED DISORDERS OF STOMACH AND DUODENUM,,,254,OTHER DIGESTIVE SYSTEM DIAGNOSES,06,DISEASES AND DISORDERS OF THE DIGESTIVE SYSTEM,2,Moderate,Minor,Medical,Private Health Insurance,,,,,true,61288.15,12703.28
Long Island,Nassau,2908000,000511,NYU Langone Hospital-Long Island,70 or Older,115,F,White,Not Span/Hispanic,5,Emergency,Home w/ Home Health Services,2019,DIG025,OTHER SPECIFIED AND UNSPECIFIED GASTROINTESTINAL DISORDERS,GIS001,ESOPHAGOGASTRODUODENOSCOPY (EGD) WITH BIOPSY,254,OTHER DIGESTIVE SYSTEM DIAGNOSES,06,DISEASES AND DISORDERS OF THE DIGESTIVE SYSTEM,2,Moderate,Minor,Medical,Medicare,Medicare,,,,true,85066.61,14021.54
Long Island,Nassau,2908000,000511,NYU Langone Hospital-Long Island,50 to 69,117,F,White,Not Span/Hispanic,2,Emergency,Home or Self Care,2019,DIG025,OTHER SPECIFIED AND UNSPECIFIED GASTROINTESTINAL DISORDERS,ESA004,NON-INVASIVE VENTILATION,254,OTHER DIGESTIVE SYSTEM DIAGNOSES,06,DISEASES AND DISORDERS OF THE DIGESTIVE SYSTEM,3,Major,Major,Medical,Medicare,Medicare,Medicaid,,,true,48671.48,6902.55
Long Island,Nassau,2908000,000511,NYU Langone Hospital-Long Island,0 to 17,115,F,Black/African American,Not Span/Hispanic,1,Emergency,Home or Self Care,2019,DIG025,OTHER SPECIFIED AND UNSPECIFIED GASTROINTESTINAL DISORDERS,,,254,OTHER DIGESTIVE SYSTEM DIAGNOSES,06,DISEASES AND DISORDERS OF THE DIGESTIVE SYSTEM,1,Minor,Minor,Medical,Blue Cross/Blue Shield,,,,,true,19436.47,3505.39
Long Island,Nassau,2908000,000511,NYU Langone Hospital-Long Island,0 to 17,115,F,White,Spanish/Hispanic,5,Emergency,Home or Self Care,2019,DIG025,OTHER SPECIFIED AND UNSPECIFIED GASTROINTESTINAL DISORDERS,GIS025,OTHER GI SYSTEM DEVICE PROCEDURES,254,OTHER DIGESTIVE SYSTEM DIAGNOSES,06,DISEASES AND DISORDERS OF THE DIGESTIVE SYSTEM,1,Minor,Minor,Medical,Medicaid,,,,,true,95487.72,14146.28
Long Island,Nassau,2908000,000511,NYU Langone Hospital-Long Island,50 to 69,115,F,White,Not Span/Hispanic,2,Emergency,Home or Self Care,2019,DIG008,OTHER SPECIFIED AND UNSPECIFIED DISORDERS OF STOMACH AND DUODENUM,GIS001,ESOPHAGOGASTRODUODENOSCOPY (EGD) WITH BIOPSY,254,OTHER DIGESTIVE SYSTEM DIAGNOSES,06,DISEASES AND DISORDERS OF THE DIGESTIVE SYSTEM,1,Minor,Minor,Medical,Blue Cross/Blue Shield,,,,,true,49875.03,7364.54
Long Island,Nassau,2908000,000511,NYU Langone Hospital-Long Island,70 or Older,115,M,White,Not Span/Hispanic,2,Emergency,Home w/ Home Health Services,2019,DIG025,OTHER SPECIFIED AND UNSPECIFIED GASTROINTESTINAL DISORDERS,,,254,OTHER DIGESTIVE SYSTEM DIAGNOSES,06,DISEASES AND DISORDERS OF THE DIGESTIVE SYSTEM,1,Minor,Moderate,Medical,Medicare,Private Health Insurance,,,,true,38537.96,5282.44
Long Island,Nassau,2908000,000511,NYU Langone Hospital-Long Island,0 to 17,117,F,Black/African American,Not Span/Hispanic,1,Emergency,Home or Self Care,2019,INJ020,"EFFECT OF FOREIGN BODY ENTERING OPENING, INITIAL ENCOUNTER",GIS027,"UPPER GI THERAPEUTIC PROCEDURES, NEC (ENDOSCOPIC)",254,OTHER DIGESTIVE SYSTEM DIAGNOSES,06,DISEASES AND DISORDERS OF THE DIGESTIVE SYSTEM,1,Minor,Minor,Medical,Private Health Insurance,,,,,true,28126.24,4469.26
Long Island,Nassau,2908000,000511,NYU Langone Hospital-Long Island,50 to 69,117,F,White,Not Span/Hispanic,1,Emergency,Home or Self Care,2019,INJ020,"EFFECT OF FOREIGN BODY ENTERING OPENING, INITIAL ENCOUNTER",GIS001,ESOPHAGOGASTRODUODENOSCOPY (EGD) WITH BIOPSY,254,OTHER DIGESTIVE SYSTEM DIAGNOSES,06,DISEASES AND DISORDERS OF THE DIGESTIVE SYSTEM,2,Moderate,Minor,Medical,Blue Cross/Blue Shield,,,,,true,54924.12,5349.29
Long Island,Nassau,2908000,000511,NYU Langone Hospital-Long Island,70 or Older,117,F,White,Not Span/Hispanic,9,Emergency,Home w/ Home Health Services,2019,SYM005,DYSPHAGIA,HEP001,LIVER BIOPSY,254,OTHER DIGESTIVE SYSTEM DIAGNOSES,06,DISEASES AND DISORDERS OF THE DIGESTIVE SYSTEM,3,Major,Major,Medical,Medicare,Medicare,,,,true,134567.44,22909.29
Long Island,Nassau,2908000,000511,NYU Langone Hospital-Long Island,70 or Older,117,M,White,Not Span/Hispanic,3,Emergency,Home or Self Care,2019,DIG025,OTHER SPECIFIED AND UNSPECIFIED GASTROINTESTINAL DISORDERS,,,254,OTHER DIGESTIVE SYSTEM DIAGNOSES,06,DISEASES AND DISORDERS OF THE DIGESTIVE SYSTEM,1,Minor,Minor,Medical,Medicare,Medicare,Private Health Insurance,,,true,45291.9,7103.62
Long Island,Nassau,2908000,000511,NYU Langone Hospital-Long Island,18 to 29,115,M,Black/African American,Not Span/Hispanic,1,Emergency,Home or Self Care,2019,DIG008,OTHER SPECIFIED AND UNSPECIFIED DISORDERS OF STOMACH AND DUODENUM,,,254,OTHER DIGESTIVE SYSTEM DIAGNOSES,06,DISEASES AND DISORDERS OF THE DIGESTIVE SYSTEM,1,Minor,Minor,Medical,Medicaid,Medicaid,,,,true,29594.74,3872.02
Long Island,Nassau,2908000,000511,NYU Langone Hospital-Long Island,70 or Older,110,F,White,Not Span/Hispanic,3,Urgent,Home w/ Home Health Services,2019,NEO073,BENIGN NEOPLASMS,GIS001,ESOPHAGOGASTRODUODENOSCOPY (EGD) WITH BIOPSY,254,OTHER DIGESTIVE SYSTEM DIAGNOSES,06,DISEASES AND DISORDERS OF THE DIGESTIVE SYSTEM,3,Major,Major,Medical,Medicare,Medicare,,,,false,129416.4,18879.16
Long Island,Nassau,2908000,000511,NYU Langone Hospital-Long Island,30 to 49,115,F,White,Spanish/Hispanic,1,Emergency,Home or Self Care,2019,DIG016,PERITONITIS AND INTRA-ABDOMINAL ABSCESS,MST005,INCISION AND DRAINAGE OF SUBCUTANEOUS TISSUE AND FASCIA,254,OTHER DIGESTIVE SYSTEM DIAGNOSES,06,DISEASES AND DISORDERS OF THE DIGESTIVE SYSTEM,1,Minor,Minor,Medical,Federal/State/Local/VA,,,,,true,38716.62,5404.03
Long Island,Nassau,2908000,000511,NYU Langone Hospital-Long Island,30 to 49,115,F,Black/African American,Not Span/Hispanic,5,Emergency,Home or Self Care,2019,GEN025,OTHER SPECIFIED FEMALE GENITAL DISORDERS,,,254,OTHER DIGESTIVE SYSTEM DIAGNOSES,06,DISEASES AND DISORDERS OF THE DIGESTIVE SYSTEM,1,Minor,Minor,Medical,Medicaid,Medicaid,,,,true,53839.42,10545.75
Long Island,Nassau,2908000,000511,NYU Langone Hospital-Long Island,70 or Older,115,F,White,Spanish/Hispanic,2,Emergency,Home w/ Home Health Services,2019,INJ020,"EFFECT OF FOREIGN BODY ENTERING OPENING, INITIAL ENCOUNTER",,,254,OTHER DIGESTIVE SYSTEM DIAGNOSES,06,DISEASES AND DISORDERS OF THE DIGESTIVE SYSTEM,2,Moderate,Moderate,Medical,Medicare,Medicare,Private Health Insurance,,,true,34793.76,6020.02
Long Island,Nassau,2908000,000511,NYU Langone Hospital-Long Island,70 or Older,117,F,White,Not Span/Hispanic,2,Emergency,Home w/ Home Health Services,2019,DIG025,OTHER SPECIFIED AND UNSPECIFIED GASTROINTESTINAL DISORDERS,,,254,OTHER DIGESTIVE SYSTEM DIAGNOSES,06,DISEASES AND DISORDERS OF THE DIGESTIVE SYSTEM,1,Minor,Moderate,Medical,Medicare,Medicare,Blue Cross/Blue Shield,,,true,44639.19,6467.74
Long Island,Nassau,2908000,000511,NYU Langone Hospital-Long Island,70 or Older,115,F,White,Spanish/Hispanic,1,Emergency,Home or Self Care,2019,DIG025,OTHER SPECIFIED AND UNSPECIFIED GASTROINTESTINAL DISORDERS,,,254,OTHER DIGESTIVE SYSTEM DIAGNOSES,06,DISEASES AND DISORDERS OF THE DIGESTIVE SYSTEM,3,Major,Major,Medical,Medicare,Medicare,Medicaid,,,true,34671.99,5425.86
Long Island,Nassau,2908000,000511,NYU Langone Hospital-Long Island,50 to 69,115,M,White,Not Span/Hispanic,5,Emergency,Home or Self Care,2019,DIG014,HEMORRHOIDS,GIS005,EXPLORATION OF PERITONEAL CAVITY,254,OTHER DIGESTIVE SYSTEM DIAGNOSES,06,DISEASES AND DISORDERS OF THE DIGESTIVE SYSTEM,1,Minor,Minor,Medical,Medicaid,Medicaid,,,,true,74341.74,12781.61