Hospital Service Area,Hospital County,Operating Certificate Number,Permanent Facility Id,Facility Name,Age Group,Zip Code - 3 digits,Gender,Race,Ethnicity,Length of Stay,Type of Admission,Patient Disposition,Discharge Year,CCS Diagnosis Code,CCS Diagnosis Description,CCS Procedure Code,CCS Procedure Description,APR DRG Code,APR DRG Description,APR MDC Code,APR MDC Description,APR Severity of Illness Code,APR Severity of Illness Description,APR Risk of Mortality,APR Medical Surgical Description,Payment Typology 1,Payment Typology 2,Payment Typology 3,Birth Weight,Abortion Edit Indicator,Emergency Department Indicator,Total Charges,Total Costs
Long Island,Nassau,2908000,000511,NYU Langone Hospital-Long Island,0 to 17,115,F,Other Race,Spanish/Hispanic,1,Emergency,Home or Self Care,2020,INJ020,"EFFECT OF FOREIGN BODY ENTERING OPENING, INITIAL ENCOUNTER",GIS027,"UPPER GI THERAPEUTIC PROCEDURES, NEC (ENDOSCOPIC)",254,OTHER DIGESTIVE SYSTEM DIAGNOSES,06,DISEASES AND DISORDERS OF THE DIGESTIVE SYSTEM,1,Minor,Minor,Medical,Medicaid,,,,,Y,27733.53,5063.92
Long Island,Nassau,2908000,000511,NYU Langone Hospital-Long Island,50 to 69,117,F,Other Race,Not Span/Hispanic,5,Emergency,Home or Self Care,2020,DIG015,ANAL AND RECTAL CONDITIONS,GIS002,COLONOSCOPY AND PROCTOSCOPY WITH BIOPSY,254,OTHER DIGESTIVE SYSTEM DIAGNOSES,06,DISEASES AND DISORDERS OF THE DIGESTIVE SYSTEM,3,Major,Moderate,Medical,Medicaid,,,,,Y,116619.77,31650.96
Long Island,Nassau,2908000,000511,NYU Langone Hospital-Long Island,70 or Older,110,M,White,Not Span/Hispanic,2,Emergency,Home or Self Care,2020,DIG014,HEMORRHOIDS,GIS004,GI SYSTEM ENDOSCOPY WITHOUT BIOPSY (DIAGNOSTIC),254,OTHER DIGESTIVE SYSTEM DIAGNOSES,06,DISEASES AND DISORDERS OF THE DIGESTIVE SYSTEM,1,Minor,Moderate,Medical,Medicare,Private Health Insurance,,,,Y,53060.62,10213.48
Long Island,Nassau,2908000,000511,NYU Langone Hospital-Long Island,30 to 49,114,F,White,Spanish/Hispanic,3,Emergency,Home or Self Care,2020,DIG015,ANAL AND RECTAL CONDITIONS,,,254,OTHER DIGESTIVE SYSTEM DIAGNOSES,06,DISEASES AND DISORDERS OF THE DIGESTIVE SYSTEM,2,Moderate,Minor,Medical,Blue Cross/Blue Shield,,,,,Y,37910.12,11997.35
Long Island,Nassau,2908000,000511,NYU Langone Hospital-Long Island,70 or Older,115,M,White,Not Span/Hispanic,5,Emergency,Home or Self Care,2020,DIG021,GASTROINTESTINAL HEMORRHAGE,GIS005,EXPLORATION OF PERITONEAL CAVITY,254,OTHER DIGESTIVE SYSTEM DIAGNOSES,06,DISEASES AND DISORDERS OF THE DIGESTIVE SYSTEM,3,Major,Moderate,Medical,Medicare,Blue Cross/Blue Shield,,,,Y,65761.83,18189.29
Long Island,Nassau,2908000,000511,NYU Langone Hospital-Long Island,30 to 49,117,F,Other Race,Spanish/Hispanic,1,Emergency,Home or Self Care,2020,DIG010,ABDOMINAL HERNIA,,,254,OTHER DIGESTIVE SYSTEM DIAGNOSES,06,DISEASES AND DISORDERS OF THE DIGESTIVE SYSTEM,1,Minor,Minor,Medical,Blue Cross/Blue Shield,,,,,Y,28011.69,5450.49
Long Island,Nassau,2908000,000511,NYU Langone Hospital-Long Island,70 or Older,115,F,White,Not Span/Hispanic,3,Emergency,Home w/ Home Health Services,2020,DIG025,OTHER SPECIFIED AND UNSPECIFIED GASTROINTESTINAL DISORDERS,GIS007,GI SYSTEM DRAINAGE (EXCLUDING PARACENTESIS),254,OTHER DIGESTIVE SYSTEM DIAGNOSES,06,DISEASES AND DISORDERS OF THE DIGESTIVE SYSTEM,2,Moderate,Minor,Medical,Medicare,Blue Cross/Blue Shield,,,,Y,42911.19,12159.72
Long Island,Nassau,2908000,000511,NYU Langone Hospital-Long Island,70 or Older,115,M,White,Not Span/Hispanic,1,Emergency,Home or Self Care,2020,DIG015,ANAL AND RECTAL CONDITIONS,ADM018,IRRIGATION (DIAGNOSTIC AND THERAPEUTIC),254,OTHER DIGESTIVE SYSTEM DIAGNOSES,06,DISEASES AND DISORDERS OF THE DIGESTIVE SYSTEM,1,Minor,Minor,Medical,Medicare,Blue Cross/Blue Shield,,,,Y,25451.56,5320.73
Long Island,Nassau,2908000,000511,NYU Langone Hospital-Long Island,50 to 69,OOS,M,White,Not Span/Hispanic,3,Elective,Home or Self Care,2020,SYM005,DYSPHAGIA,GIS016,GI SYSTEM ENDOSCOPIC THERAPEUTIC PROCEDURES,254,OTHER DIGESTIVE SYSTEM DIAGNOSES,06,DISEASES AND DISORDERS OF THE DIGESTIVE SYSTEM,1,Minor,Minor,Medical,Blue Cross/Blue Shield,,,,,N,81791.05,17272.59
Long Island,Nassau,2908000,000511,NYU Langone Hospital-Long Island,50 to 69,117,F,White,Not Span/Hispanic,3,Elective,Home or Self Care,2020,NEO073,BENIGN NEOPLASMS,GIS016,GI SYSTEM ENDOSCOPIC THERAPEUTIC PROCEDURES,254,OTHER DIGESTIVE SYSTEM DIAGNOSES,06,DISEASES AND DISORDERS OF THE DIGESTIVE SYSTEM,1,Minor,Minor,Medical,Blue Cross/Blue Shield,,,,,N,72419.76,15840.61
Long Island,Nassau,2908000,000511,NYU Langone Hospital-Long Island,50 to 69,117,M,White,Not Span/Hispanic,3,Emergency,Home or Self Care,2020,DIG010,ABDOMINAL HERNIA,,,254,OTHER DIGESTIVE SYSTEM DIAGNOSES,06,DISEASES AND DISORDERS OF THE DIGESTIVE SYSTEM,3,Major,Moderate,Medical,Blue Cross/Blue Shield,Medicare,,,,Y,43424.22,11837.94
Long Island,Nassau,2908000,000511,NYU Langone Hospital-Long Island,70 or Older,117,F,White,Not Span/Hispanic,1,Emergency,Home or Self Care,2020,DIG014,HEMORRHOIDS,,,254,OTHER DIGESTIVE SYSTEM DIAGNOSES,06,DISEASES AND DISORDERS OF THE DIGESTIVE SYSTEM,2,Moderate,Major,Medical,Medicare,Medicare,,,,Y,34968.69,10312.78
Long Island,Nassau,2908000,000511,NYU Langone Hospital-Long Island,70 or Older,115,F,White,Not Span/Hispanic,5,Emergency,Home w/ Home Health Services,2020,DIG025,OTHER SPECIFIED AND UNSPECIFIED GASTROINTESTINAL DISORDERS,,,254,OTHER DIGESTIVE SYSTEM DIAGNOSES,06,DISEASES AND DISORDERS OF THE DIGESTIVE SYSTEM,3,Major,Major,Medical,Medicare,Medicare,,,,Y,78268.92,19369.86
Long Island,Nassau,2908000,000511,NYU Langone Hospital-Long Island,70 or Older,115,F,Black/African American,Not Span/Hispanic,2,Emergency,Home w/ Home Health Services,2020,DIG021,GASTROINTESTINAL HEMORRHAGE,,,254,OTHER DIGESTIVE SYSTEM DIAGNOSES,06,DISEASES AND DISORDERS OF THE DIGESTIVE SYSTEM,3,Major,Major,Medical,Private Health Insurance,,,,,Y,22454.56,7468.7
Long Island,Nassau,2908000,000511,NYU Langone Hospital-Long Island,50 to 69,115,M,Other Race,Not Span/Hispanic,1,Emergency,Home or Self Care,2020,DIG025,OTHER SPECIFIED AND UNSPECIFIED GASTROINTESTINAL DISORDERS,,,254,OTHER DIGESTIVE SYSTEM DIAGNOSES,06,DISEASES AND DISORDERS OF THE DIGESTIVE SYSTEM,1,Minor,Minor,Medical,Blue Cross/Blue Shield,,,,,Y,34335.63,6613.12
Long Island,Nassau,2908000,000511,NYU Langone Hospital-Long Island,0 to 17,115,F,Black/African American,Not Span/Hispanic,1,Emergency,Home or Self Care,2020,INJ020,"EFFECT OF FOREIGN BODY ENTERING OPENING, INITIAL ENCOUNTER",GIS001,ESOPHAGOGASTRODUODENOSCOPY (EGD) WITH BIOPSY,254,OTHER DIGESTIVE SYSTEM DIAGNOSES,06,DISEASES AND DISORDERS OF THE DIGESTIVE SYSTEM,1,Minor,Minor,Medical,Medicaid,,,,,Y,49347.53,7327.69
Long Island,Nassau,2908000,000511,NYU Langone Hospital-Long Island,50 to 69,115,M,Black/African American,Not Span/Hispanic,1,Emergency,Left Against Medical Advice,2020,DIG010,ABDOMINAL HERNIA,,,254,OTHER DIGESTIVE SYSTEM DIAGNOSES,06,DISEASES AND DISORDERS OF THE DIGESTIVE SYSTEM,2,Moderate,Minor,Medical,Medicare,,,,,Y,25618.72,5549.27
Long Island,Nassau,2908000,000511,NYU Langone Hospital-Long Island,70 or Older,115,M,White,Not Span/Hispanic,5,Emergency,Home w/ Home Health Services,2020,INJ020,"EFFECT OF FOREIGN BODY ENTERING OPENING, INITIAL ENCOUNTER",GIS027,"UPPER GI THERAPEUTIC PROCEDURES, NEC (ENDOSCOPIC)",254,OTHER DIGESTIVE SYSTEM DIAGNOSES,06,DISEASES AND DISORDERS OF THE DIGESTIVE SYSTEM,3,Major,Major,Medical,Private Health Insurance,,,,,Y,77403.12,21333.29
Long Island,Nassau,2908000,000511,NYU Langone Hospital-Long Island,70 or Older,117,F,White,Not Span/Hispanic,3,Emergency,Home or Self Care,2020,DIG008,OTHER SPECIFIED AND UNSPECIFIED DISORDERS OF STOMACH AND DUODENUM,GIS027,"UPPER GI THERAPEUTIC PROCEDURES, NEC (ENDOSCOPIC)",254,OTHER DIGESTIVE SYSTEM DIAGNOSES,06,DISEASES AND DISORDERS OF THE DIGESTIVE SYSTEM,3,Major,Moderate,Medical,Medicare,Blue Cross/Blue Shield,,,,Y,59873.72,13535.54
Long Island,Nassau,2908000,000511,NYU Langone Hospital-Long Island,18 to 29,118,F,White,Not Span/Hispanic,1,Emergency,Home or Self Care,2020,DIG015,ANAL AND RECTAL CONDITIONS,,,254,OTHER DIGESTIVE SYSTEM DIAGNOSES,06,DISEASES AND DISORDERS OF THE DIGESTIVE SYSTEM,1,Minor,Minor,Medical,Private Health Insurance,,,,,Y,20203.76,4254.85
Long Island,Nassau,2908000,000511,NYU Langone Hospital-Long Island,50 to 69,115,M,Other Race,Spanish/Hispanic,3,Emergency,Home or Self Care,2020,DIG021,GASTROINTESTINAL HEMORRHAGE,GIS001,ESOPHAGOGASTRODUODENOSCOPY (EGD) WITH BIOPSY,254,OTHER DIGESTIVE SYSTEM DIAGNOSES,06,DISEASES AND DISORDERS OF THE DIGESTIVE SYSTEM,2,Moderate,Moderate,Medical,Medicaid,,,,,Y,72905.17,14672.71
Long Island,Nassau,2908000,000511,NYU Langone Hospital-Long Island,70 or Older,115,F,White,Not Span/Hispanic,5,Emergency,Home w/ Home Health Services,2020,INJ020,"EFFECT OF FOREIGN BODY ENTERING OPENING, INITIAL ENCOUNTER",GIS027,"UPPER GI THERAPEUTIC PROCEDURES, NEC (ENDOSCOPIC)",254,OTHER DIGESTIVE SYSTEM DIAGNOSES,06,DISEASES AND DISORDERS OF THE DIGESTIVE SYSTEM,2,Moderate,Major,Medical,Medicare,Private Health Insurance,,,,Y,96673.22,23451.17
Long Island,Nassau,2908000,000511,NYU Langone Hospital-Long Island,70 or Older,117,F,Other Race,Not Span/Hispanic,3,Emergency,Home w/ Home Health Services,2020,DIG010,ABDOMINAL HERNIA,GIS004,GI SYSTEM ENDOSCOPY WITHOUT BIOPSY (DIAGNOSTIC),254,OTHER DIGESTIVE SYSTEM DIAGNOSES,06,DISEASES AND DISORDERS OF THE DIGESTIVE SYSTEM,3,Major,Minor,Medical,Medicare,Medicaid,,,,Y,60943.63,15389.96
Long Island,Nassau,2908000,000511,NYU Langone Hospital-Long Island,50 to 69,117,F,White,Not Span/Hispanic,2,Elective,Home or Self Care,2020,NEO073,BENIGN NEOPLASMS,GIS016,GI SYSTEM ENDOSCOPIC THERAPEUTIC PROCEDURES,254,OTHER DIGESTIVE SYSTEM DIAGNOSES,06,DISEASES AND DISORDERS OF THE DIGESTIVE SYSTEM,1,Minor,Minor,Medical,Private Health Insurance,,,,,N,200042.15,31479.1
Long Island,Nassau,2908000,000511,NYU Langone Hospital-Long Island,50 to 69,117,F,White,Not Span/Hispanic,1,Emergency,Home or Self Care,2020,DIG014,HEMORRHOIDS,,,254,OTHER DIGESTIVE SYSTEM DIAGNOSES,06,DISEASES AND DISORDERS OF THE DIGESTIVE SYSTEM,1,Minor,Minor,Medical,Medicaid,,,,,Y,23870.29,5248.7
Long Island,Nassau,2908000,000511,NYU Langone Hospital-Long Island,18 to 29,115,M,White,Not Span/Hispanic,2,Emergency,Home or Self Care,2020,DIG025,OTHER SPECIFIED AND UNSPECIFIED GASTROINTESTINAL DISORDERS,,,254,OTHER DIGESTIVE SYSTEM DIAGNOSES,06,DISEASES AND DISORDERS OF THE DIGESTIVE SYSTEM,1,Minor,Minor,Medical,Private Health Insurance,,,,,Y,38528.24,9370.9
Long Island,Nassau,2908000,000511,NYU Langone Hospital-Long Island,50 to 69,115,M,White,Not Span/Hispanic,2,Emergency,Home or Self Care,2020,DIG021,GASTROINTESTINAL HEMORRHAGE,GIS004,GI SYSTEM ENDOSCOPY WITHOUT BIOPSY (DIAGNOSTIC),254,OTHER DIGESTIVE SYSTEM DIAGNOSES,06,DISEASES AND DISORDERS OF THE DIGESTIVE SYSTEM,3,Major,Minor,Medical,Blue Cross/Blue Shield,,,,,Y,35829.34,8962.82
Long Island,Nassau,2908000,000511,NYU Langone Hospital-Long Island,50 to 69,115,F,White,Not Span/Hispanic,1,Emergency,Home or Self Care,2020,DIG010,ABDOMINAL HERNIA,,,254,OTHER DIGESTIVE SYSTEM DIAGNOSES,06,DISEASES AND DISORDERS OF THE DIGESTIVE SYSTEM,1,Minor,Minor,Medical,Medicare,Blue Cross/Blue Shield,,,,Y,46023.45,12132.83
Long Island,Nassau,2908000,000511,NYU Langone Hospital-Long Island,50 to 69,118,M,Other Race,Not Span/Hispanic,1,Emergency,Home or Self Care,2020,DIG021,GASTROINTESTINAL HEMORRHAGE,GIS001,ESOPHAGOGASTRODUODENOSCOPY (EGD) WITH BIOPSY,254,OTHER DIGESTIVE SYSTEM DIAGNOSES,06,DISEASES AND DISORDERS OF THE DIGESTIVE SYSTEM,2,Moderate,Minor,Medical,Private Health Insurance,,,,,Y,36972.98,7095
Long Island,Nassau,2908000,000511,NYU Langone Hospital-Long Island,0 to 17,115,M,Other Race,Not Span/Hispanic,1,Emergency,Home or Self Care,2020,DIG025,OTHER SPECIFIED AND UNSPECIFIED GASTROINTESTINAL DISORDERS,,,254,OTHER DIGESTIVE SYSTEM DIAGNOSES,06,DISEASES AND DISORDERS OF THE DIGESTIVE SYSTEM,1,Minor,Minor,Medical,Blue Cross/Blue Shield,,,,,Y,15960.83,3342.09
Long Island,Nassau,2908000,000511,NYU Langone Hospital-Long Island,70 or Older,115,F,White,Not Span/Hispanic,4,Emergency,Home w/ Home Health Services,2020,DIG025,OTHER SPECIFIED AND UNSPECIFIED GASTROINTESTINAL DISORDERS,GIS001,ESOPHAGOGASTRODUODENOSCOPY (EGD) WITH BIOPSY,254,OTHER DIGESTIVE SYSTEM DIAGNOSES,06,DISEASES AND DISORDERS OF THE DIGESTIVE SYSTEM,3,Major,Major,Medical,Medicare,Blue Cross/Blue Shield,,,,Y,71882.92,17896.98
Long Island,Nassau,2908000,000511,NYU Langone Hospital-Long Island,70 or Older,115,M,White,Not Span/Hispanic,3,Emergency,Skilled Nursing Home,2020,DIG014,HEMORRHOIDS,,,254,OTHER DIGESTIVE SYSTEM DIAGNOSES,06,DISEASES AND DISORDERS OF THE DIGESTIVE SYSTEM,1,Minor,Moderate,Medical,Medicare,Blue Cross/Blue Shield,,,,Y,33064.65,10743.01
Long Island,Nassau,2908000,000511,NYU Langone Hospital-Long Island,30 to 49,115,F,Other Race,Not Span/Hispanic,2,Emergency,Home or Self Care,2020,DIG025,OTHER SPECIFIED AND UNSPECIFIED GASTROINTESTINAL DISORDERS,,,254,OTHER DIGESTIVE SYSTEM DIAGNOSES,06,DISEASES AND DISORDERS OF THE DIGESTIVE SYSTEM,1,Minor,Minor,Medical,Medicaid,,,,,Y,44707.75,8502.62
Long Island,Nassau,2908000,000511,NYU Langone Hospital-Long Island,18 to 29,110,M,White,Not Span/Hispanic,3,Emergency,Home or Self Care,2020,DIG008,OTHER SPECIFIED AND UNSPECIFIED DISORDERS OF STOMACH AND DUODENUM,GIS007,GI SYSTEM DRAINAGE (EXCLUDING PARACENTESIS),254,OTHER DIGESTIVE SYSTEM DIAGNOSES,06,DISEASES AND DISORDERS OF THE DIGESTIVE SYSTEM,1,Minor,Minor,Medical,Private Health Insurance,,,,,Y,50904.29,12698.04
Long Island,Nassau,2908000,000511,NYU Langone Hospital-Long Island,50 to 69,115,F,White,Not Span/Hispanic,10,Emergency,Inpatient Rehabilitation Facility,2020,DIG021,GASTROINTESTINAL HEMORRHAGE,GIS004,GI SYSTEM ENDOSCOPY WITHOUT BIOPSY (DIAGNOSTIC),254,OTHER DIGESTIVE SYSTEM DIAGNOSES,06,DISEASES AND DISORDERS OF THE DIGESTIVE SYSTEM,3,Major,Major,Medical,Medicare,Medicare,,,,Y,153858.45,43125.56
Long Island,Nassau,2908000,000511,NYU Langone Hospital-Long Island,70 or Older,110,M,White,Not Span/Hispanic,6,Emergency,Home w/ Home Health Services,2020,DIG021,GASTROINTESTINAL HEMORRHAGE,GIS001,ESOPHAGOGASTRODUODENOSCOPY (EGD) WITH BIOPSY,254,OTHER DIGESTIVE SYSTEM DIAGNOSES,06,DISEASES AND DISORDERS OF THE DIGESTIVE SYSTEM,4,Extreme,Extreme,Medical,Medicare,Medicare,,,,Y,90279.17,24507.51
Long Island,Nassau,2908000,000511,NYU Langone Hospital-Long Island,70 or Older,115,M,White,Not Span/Hispanic,1,Emergency,Home or Self Care,2020,DIG010,ABDOMINAL HERNIA,,,254,OTHER DIGESTIVE SYSTEM DIAGNOSES,06,DISEASES AND DISORDERS OF THE DIGESTIVE SYSTEM,1,Minor,Minor,Medical,Private Health Insurance,,,,,Y,35957.17,6830.87
Long Island,Nassau,2908000,000511,NYU Langone Hospital-Long Island,50 to 69,115,F,White,Spanish/Hispanic,3,Emergency,Home or Self Care,2020,DIG008,OTHER SPECIFIED AND UNSPECIFIED DISORDERS OF STOMACH AND DUODENUM,GIS004,GI SYSTEM ENDOSCOPY WITHOUT BIOPSY (DIAGNOSTIC),254,OTHER DIGESTIVE SYSTEM DIAGNOSES,06,DISEASES AND DISORDERS OF THE DIGESTIVE SYSTEM,2,Moderate,Moderate,Medical,Medicaid,,,,,Y,65785.35,14530.67
Long Island,Nassau,2908000,000511,NYU Langone Hospital-Long Island,50 to 69,114,F,Black/African American,Not Span/Hispanic,3,Emergency,Home or Self Care,2020,SYM006,ABDOMINAL PAIN AND OTHER DIGESTIVE/ABDOMEN SIGNS AND SYMPTOMS,,,254,OTHER DIGESTIVE SYSTEM DIAGNOSES,06,DISEASES AND DISORDERS OF THE DIGESTIVE SYSTEM,2,Moderate,Minor,Medical,Private Health Insurance,,,,,Y,60291.34,14070.11
Long Island,Nassau,2908000,000511,NYU Langone Hospital-Long Island,30 to 49,115,F,White,Not Span/Hispanic,2,Emergency,Home or Self Care,2020,DIG016,PERITONITIS AND INTRA-ABDOMINAL ABSCESS,,,254,OTHER DIGESTIVE SYSTEM DIAGNOSES,06,DISEASES AND DISORDERS OF THE DIGESTIVE SYSTEM,2,Moderate,Moderate,Medical,Blue Cross/Blue Shield,,,,,Y,31093.4,8386.56
Long Island,Nassau,2908000,000511,NYU Langone Hospital-Long Island,50 to 69,OOS,F,Black/African American,Not Span/Hispanic,1,Emergency,Home or Self Care,2020,DIG014,HEMORRHOIDS,,,254,OTHER DIGESTIVE SYSTEM DIAGNOSES,06,DISEASES AND DISORDERS OF THE DIGESTIVE SYSTEM,1,Minor,Minor,Medical,Miscellaneous/Other,,,,,Y,17937.93,4606.56
Long Island,Nassau,2908000,000511,NYU Langone Hospital-Long Island,50 to 69,115,M,White,Not Span/Hispanic,3,Emergency,Home or Self Care,2020,DIG025,OTHER SPECIFIED AND UNSPECIFIED GASTROINTESTINAL DISORDERS,,,254,OTHER DIGESTIVE SYSTEM DIAGNOSES,06,DISEASES AND DISORDERS OF THE DIGESTIVE SYSTEM,1,Minor,Minor,Medical,Medicare,,,,,Y,59356.47,15641.74
Long Island,Nassau,2908000,000511,NYU Langone Hospital-Long Island,18 to 29,117,F,White,Not Span/Hispanic,2,Emergency,Home or Self Care,2020,DIG025,OTHER SPECIFIED AND UNSPECIFIED GASTROINTESTINAL DISORDERS,,,254,OTHER DIGESTIVE SYSTEM DIAGNOSES,06,DISEASES AND DISORDERS OF THE DIGESTIVE SYSTEM,1,Minor,Minor,Medical,Private Health Insurance,,,,,Y,41991.52,9894.81
Long Island,Nassau,2908000,000511,NYU Langone Hospital-Long Island,0 to 17,115,M,Black/African American,Not Span/Hispanic,1,Emergency,Home or Self Care,2020,INJ020,"EFFECT OF FOREIGN BODY ENTERING OPENING, INITIAL ENCOUNTER",GIS027,"UPPER GI THERAPEUTIC PROCEDURES, NEC (ENDOSCOPIC)",254,OTHER DIGESTIVE SYSTEM DIAGNOSES,06,DISEASES AND DISORDERS OF THE DIGESTIVE SYSTEM,1,Minor,Minor,Medical,Blue Cross/Blue Shield,Blue Cross/Blue Shield,,,,Y,37125.98,5875.19
Long Island,Nassau,2908000,000511,NYU Langone Hospital-Long Island,70 or Older,115,M,White,Not Span/Hispanic,5,Emergency,Home or Self Care,2020,DIG025,OTHER SPECIFIED AND UNSPECIFIED GASTROINTESTINAL DISORDERS,GNR004,ENDOSCOPIC CONTROL OF BLEEDING,254,OTHER DIGESTIVE SYSTEM DIAGNOSES,06,DISEASES AND DISORDERS OF THE DIGESTIVE SYSTEM,3,Major,Major,Medical,Medicare,,,,,Y,62632.54,19161.11
Long Island,Nassau,2908000,000511,NYU Langone Hospital-Long Island,70 or Older,115,M,White,Not Span/Hispanic,15,Emergency,Home w/ Home Health Services,2020,DIG015,ANAL AND RECTAL CONDITIONS,GNR004,ENDOSCOPIC CONTROL OF BLEEDING,254,OTHER DIGESTIVE SYSTEM DIAGNOSES,06,DISEASES AND DISORDERS OF THE DIGESTIVE SYSTEM,4,Extreme,Extreme,Medical,Medicare,,,,,Y,240510.4,64599.16
Long Island,Nassau,2908000,000511,NYU Langone Hospital-Long Island,30 to 49,117,F,White,Not Span/Hispanic,1,Emergency,Home or Self Care,2020,DIG009,APPENDICITIS AND OTHER APPENDICEAL CONDITIONS,,,254,OTHER DIGESTIVE SYSTEM DIAGNOSES,06,DISEASES AND DISORDERS OF THE DIGESTIVE SYSTEM,2,Moderate,Minor,Medical,Blue Cross/Blue Shield,,,,,Y,25027.34,5186.53
Long Island,Nassau,2908000,000511,NYU Langone Hospital-Long Island,0 to 17,117,F,White,Not Span/Hispanic,1,Emergency,Home or Self Care,2020,INJ020,"EFFECT OF FOREIGN BODY ENTERING OPENING, INITIAL ENCOUNTER",GIS027,"UPPER GI THERAPEUTIC PROCEDURES, NEC (ENDOSCOPIC)",254,OTHER DIGESTIVE SYSTEM DIAGNOSES,06,DISEASES AND DISORDERS OF THE DIGESTIVE SYSTEM,1,Minor,Minor,Medical,Blue Cross/Blue Shield,,,,,Y,33643.37,6842.59
Long Island,Nassau,2908000,000511,NYU Langone Hospital-Long Island,30 to 49,115,F,White,Not Span/Hispanic,2,Emergency,Home or Self Care,2020,DIG025,OTHER SPECIFIED AND UNSPECIFIED GASTROINTESTINAL DISORDERS,OTR004,ISOLATION PROCEDURES,254,OTHER DIGESTIVE SYSTEM DIAGNOSES,06,DISEASES AND DISORDERS OF THE DIGESTIVE SYSTEM,2,Moderate,Minor,Medical,Medicare,,,,,Y,38028.99,9128.99
Long Island,Nassau,2908000,000511,NYU Langone Hospital-Long Island,70 or Older,115,F,White,Not Span/Hispanic,2,Emergency,Home w/ Home Health Services,2020,DIG025,OTHER SPECIFIED AND UNSPECIFIED GASTROINTESTINAL DISORDERS,,,254,OTHER DIGESTIVE SYSTEM DIAGNOSES,06,DISEASES AND DISORDERS OF THE DIGESTIVE SYSTEM,1,Minor,Minor,Medical,Medicare,,,,,Y,29439.27,8149.42
Long Island,Nassau,2908000,000511,NYU Langone Hospital-Long Island,70 or Older,117,F,White,Not Span/Hispanic,4,Emergency,Home w/ Home Health Services,2020,DIG021,GASTROINTESTINAL HEMORRHAGE,GIS004,GI SYSTEM ENDOSCOPY WITHOUT BIOPSY (DIAGNOSTIC),254,OTHER DIGESTIVE SYSTEM DIAGNOSES,06,DISEASES AND DISORDERS OF THE DIGESTIVE SYSTEM,2,Moderate,Major,Medical,Private Health Insurance,,,,,Y,67991.55,21721.44
Long Island,Nassau,2908000,000511,NYU Langone Hospital-Long Island,30 to 49,115,F,Other Race,Not Span/Hispanic,1,Emergency,Home or Self Care,2020,INJ020,"EFFECT OF FOREIGN BODY ENTERING OPENING, INITIAL ENCOUNTER",,,254,OTHER DIGESTIVE SYSTEM DIAGNOSES,06,DISEASES AND DISORDERS OF THE DIGESTIVE SYSTEM,2,Moderate,Minor,Medical,Private Health Insurance,,,,,Y,19599.88,4846.43
Long Island,Nassau,2908000,000511,NYU Langone Hospital-Long Island,30 to 49,110,F,White,Not Span/Hispanic,2,Elective,Home or Self Care,2020,NEO073,BENIGN NEOPLASMS,GIS016,GI SYSTEM ENDOSCOPIC THERAPEUTIC PROCEDURES,254,OTHER DIGESTIVE SYSTEM DIAGNOSES,06,DISEASES AND DISORDERS OF THE DIGESTIVE SYSTEM,1,Minor,Minor,Medical,Private Health Insurance,,,,,N,293755.94,44414.14
Long Island,Nassau,2908000,000511,NYU Langone Hospital-Long Island,30 to 49,115,F,White,Not Span/Hispanic,2,Emergency,Home or Self Care,2020,DIG024,POSTPROCEDURAL OR POSTOPERATIVE DIGESTIVE SYSTEM COMPLICATION,,,254,OTHER DIGESTIVE SYSTEM DIAGNOSES,06,DISEASES AND DISORDERS OF THE DIGESTIVE SYSTEM,2,Moderate,Minor,Medical,Blue Cross/Blue Shield,,,,,Y,31607.16,8412.32
Long Island,Nassau,2908000,000511,NYU Langone Hospital-Long Island,70 or Older,117,F,White,Not Span/Hispanic,1,Emergency,Home or Self Care,2020,DIG010,ABDOMINAL HERNIA,,,254,OTHER DIGESTIVE SYSTEM DIAGNOSES,06,DISEASES AND DISORDERS OF THE DIGESTIVE SYSTEM,2,Moderate,Moderate,Medical,Medicare,,,,,Y,26538.53,5502.84
Long Island,Nassau,2908000,000511,NYU Langone Hospital-Long Island,70 or Older,115,M,Black/African American,Not Span/Hispanic,2,Emergency,Home or Self Care,2020,DIG021,GASTROINTESTINAL HEMORRHAGE,ESA001,HEMODIALYSIS,254,OTHER DIGESTIVE SYSTEM DIAGNOSES,06,DISEASES AND DISORDERS OF THE DIGESTIVE SYSTEM,3,Major,Major,Medical,Medicare,,,,,Y,45122.4,14488.32
Long Island,Nassau,2908000,000511,NYU Langone Hospital-Long Island,70 or Older,115,F,White,Not Span/Hispanic,9,Emergency,Inpatient Rehabilitation Facility,2020,DIG014,HEMORRHOIDS,,,254,OTHER DIGESTIVE SYSTEM DIAGNOSES,06,DISEASES AND DISORDERS OF THE DIGESTIVE SYSTEM,1,Minor,Moderate,Medical,Medicare,,,,,Y,72798.7,29727.44
Long Island,Nassau,2908000,000511,NYU Langone Hospital-Long Island,30 to 49,115,M,White,Not Span/Hispanic,1,Emergency,Home or Self Care,2020,DIG024,POSTPROCEDURAL OR POSTOPERATIVE DIGESTIVE SYSTEM COMPLICATION,,,254,OTHER DIGESTIVE SYSTEM DIAGNOSES,06,DISEASES AND DISORDERS OF THE DIGESTIVE SYSTEM,2,Moderate,Minor,Medical,Medicaid,,,,,Y,23297.54,5126.3
Long Island,Nassau,2908000,000511,NYU Langone Hospital-Long Island,70 or Older,115,M,Black/African American,Not Span/Hispanic,1,Emergency,Home or Self Care,2020,DIG014,HEMORRHOIDS,,,254,OTHER DIGESTIVE SYSTEM DIAGNOSES,06,DISEASES AND DISORDERS OF THE DIGESTIVE SYSTEM,1,Minor,Moderate,Medical,Medicare,,,,,Y,27198.9,8069.54
Long Island,Nassau,2908000,000511,NYU Langone Hospital-Long Island,70 or Older,115,F,Black/African American,Not Span/Hispanic,4,Emergency,Home or Self Care,2020,DIG021,GASTROINTESTINAL HEMORRHAGE,GIS005,EXPLORATION OF PERITONEAL CAVITY,254,OTHER DIGESTIVE SYSTEM DIAGNOSES,06,DISEASES AND DISORDERS OF THE DIGESTIVE SYSTEM,2,Moderate,Moderate,Medical,Medicare,,,,,Y,46354.96,14352.7
Long Island,Nassau,2908000,000511,NYU Langone Hospital-Long Island,50 to 69,OOS,F,White,Not Span/Hispanic,2,Emergency,Home or Self Care,2020,DIG025,OTHER SPECIFIED AND UNSPECIFIED GASTROINTESTINAL DISORDERS,,,254,OTHER DIGESTIVE SYSTEM DIAGNOSES,06,DISEASES AND DISORDERS OF THE DIGESTIVE SYSTEM,3,Major,Major,Medical,Private Health Insurance,,,,,Y,35720.53,8831.44
Long Island,Nassau,2908000,000511,NYU Langone Hospital-Long Island,0 to 17,113,M,White,Not Span/Hispanic,3,Emergency,Home or Self Care,2020,DIG025,OTHER SPECIFIED AND UNSPECIFIED GASTROINTESTINAL DISORDERS,,,254,OTHER DIGESTIVE SYSTEM DIAGNOSES,06,DISEASES AND DISORDERS OF THE DIGESTIVE SYSTEM,1,Minor,Minor,Medical,Medicaid,,,,,Y,41172.67,8980.28