Hospital Service Area,Hospital County,Operating Certificate Number,Permanent Facility Id,Facility Name,Age Group,Zip Code - 3 digits,Gender,Race,Ethnicity,Length of Stay,Type of Admission,Patient Disposition,Discharge Year,CCS Diagnosis Code,CCS Diagnosis Description,CCS Procedure Code,CCS Procedure Description,APR DRG Code,APR DRG Description,APR MDC Code,APR MDC Description,APR Severity of Illness Code,APR Severity of Illness Description,APR Risk of Mortality,APR Medical Surgical Description,Payment Typology 1,Payment Typology 2,Payment Typology 3,Birth Weight,Abortion Edit Indicator,Emergency Department Indicator,Total Charges,Total Costs
Hudson Valley,Westchester,5904001,001072,Montefiore New Rochelle Hospital,30 to 49,108,M,Other Race,Spanish/Hispanic,3,Emergency,Home or Self Care,2017,233,Intracranial injury,171,SUTURE SKIN/SUBCUT TISS,026,Other nervous system & related procedures,01,Diseases and Disorders of the Nervous System,1,Minor,Minor,Surgical,Medicaid,Self-Pay,,,N,N,26425.00,11381.85
New York City,Bronx,7000006,001168,Montefiore Medical Center-Wakefield Hospital,30 to 49,100,M,Black/African American,Not Span/Hispanic,2,Emergency,Home or Self Care,2017,050,Diabetes mellitus with complications,168,"INCIS/DRAIN, SKIN/SUBCU",026,Other nervous system & related procedures,01,Diseases and Disorders of the Nervous System,3,Major,Moderate,Surgical,Medicaid,,,,N,Y,41842.38,6597.27
New York City,Bronx,7000006,001169,Montefiore Medical Center - Henry & Lucy Moses Div,70 or Older,105,F,Black/African American,Not Span/Hispanic,24,Emergency,Skilled Nursing Home,2017,083,Epilepsy; convulsions,067,OT THER PRCS; HEM/LYMPH,026,Other nervous system & related procedures,01,Diseases and Disorders of the Nervous System,3,Major,Major,Surgical,Medicare,Private Health Insurance,,,N,Y,258558.75,55715.24
New York City,Manhattan,7002024,001456,Mount Sinai Hospital,0 to 17,100,F,Other Race,Not Span/Hispanic,4,Elective,Home w/ Home Health Services,2017,095,Other nervous system disorders,067,OT THER PRCS; HEM/LYMPH,026,Other nervous system & related procedures,01,Diseases and Disorders of the Nervous System,2,Moderate,Minor,Surgical,Self-Pay,Self-Pay,,,N,N,50843.04,14409.33
Hudson Valley,Orange,3523000,000699,Orange Regional Medical Center,70 or Older,127,M,White,Not Span/Hispanic,11,Emergency,Home w/ Home Health Services,2017,042,Secondary malignancies,067,OT THER PRCS; HEM/LYMPH,026,Other nervous system & related procedures,01,Diseases and Disorders of the Nervous System,3,Major,Major,Surgical,Medicare,Private Health Insurance,,,N,Y,98383.61,42559.80
New York City,Manhattan,7002032,001469,Mount Sinai St. Luke's,50 to 69,100,F,Black/African American,Not Span/Hispanic,7,Emergency,Skilled Nursing Home,2017,109,Acute cerebrovascular disease,173,OT DX PRC SKIN/SUBCUTAN,026,Other nervous system & related procedures,01,Diseases and Disorders of the Nervous System,3,Major,Moderate,Surgical,Medicare,Medicare,Self-Pay,,N,Y,87761.76,25423.08
New York City,Bronx,7000006,003058,Montefiore Med Center - Jack D Weiler Hosp of A Einstein College Div,50 to 69,104,F,Black/African American,Not Span/Hispanic,15,Emergency,Home or Self Care,2017,042,Secondary malignancies,165,BREAST BIOPSY & DX PRCS,026,Other nervous system & related procedures,01,Diseases and Disorders of the Nervous System,2,Moderate,Moderate,Surgical,Private Health Insurance,,,,N,Y,216540.41,34747.78
New York City,Manhattan,7002002,001439,Mount Sinai Beth Israel,50 to 69,OOS,F,Other Race,Not Span/Hispanic,1,Urgent,Home or Self Care,2017,095,Other nervous system disorders,006,DECOMP PERIPHERAL NERVE,026,Other nervous system & related procedures,01,Diseases and Disorders of the Nervous System,1,Minor,Minor,Surgical,Private Health Insurance,Self-Pay,,,N,N,25998.23,8251.71
New York City,Manhattan,7002024,001456,Mount Sinai Hospital,70 or Older,114,F,Black/African American,Not Span/Hispanic,9,Urgent,Home w/ Home Health Services,2017,076,Meningitis (except that caused by tuberculosis or sexually transmitted disease),050,EXTRA CIRC AUX OPEN HRT,026,Other nervous system & related procedures,01,Diseases and Disorders of the Nervous System,3,Major,Major,Surgical,Medicare,Blue Cross/Blue Shield,Self-Pay,,N,N,123478.29,36396.91
New York City,Manhattan,7002032,001466,Mount Sinai West,30 to 49,100,M,White,Not Span/Hispanic,9,Emergency,Home or Self Care,2017,042,Secondary malignancies,067,OT THER PRCS; HEM/LYMPH,026,Other nervous system & related procedures,01,Diseases and Disorders of the Nervous System,3,Major,Major,Surgical,Private Health Insurance,Self-Pay,,,N,Y,130286.07,33436.32
Long Island,Nassau,2950002,000528,Nassau University Medical Center,18 to 29,,F,Other Race,Spanish/Hispanic,1,Emergency,Home or Self Care,2017,233,Intracranial injury,171,SUTURE SKIN/SUBCUT TISS,026,Other nervous system & related procedures,01,Diseases and Disorders of the Nervous System,1,Minor,Minor,Surgical,Blue Cross/Blue Shield,Self-Pay,,,N,N,14785.56,5492.34
Long Island,Nassau,2950002,000528,Nassau University Medical Center,18 to 29,115,M,Other Race,Spanish/Hispanic,2,Trauma,Home or Self Care,2017,233,Intracranial injury,171,SUTURE SKIN/SUBCUT TISS,026,Other nervous system & related procedures,01,Diseases and Disorders of the Nervous System,2,Moderate,Minor,Surgical,Medicaid,Self-Pay,,,N,Y,28060.27,12071.47
Long Island,Nassau,2950002,000528,Nassau University Medical Center,70 or Older,113,M,Other Race,Not Span/Hispanic,1,Trauma,Home or Self Care,2017,233,Intracranial injury,171,SUTURE SKIN/SUBCUT TISS,026,Other nervous system & related procedures,01,Diseases and Disorders of the Nervous System,1,Minor,Minor,Surgical,Private Health Insurance,Medicare,Self-Pay,,N,Y,25621.68,9425.63
New York City,Kings,7001021,001306,New York - Presbyterian Brooklyn Methodist Hospital,30 to 49,112,M,Black/African American,Not Span/Hispanic,3,Emergency,Home or Self Care,2017,095,Other nervous system disorders,006,DECOMP PERIPHERAL NERVE,026,Other nervous system & related procedures,01,Diseases and Disorders of the Nervous System,3,Major,Moderate,Surgical,Private Health Insurance,Self-Pay,,,N,N,30918.41,13429.49
New York City,Manhattan,7002002,001439,Mount Sinai Beth Israel,50 to 69,OOS,M,Other Race,Not Span/Hispanic,1,Urgent,Home or Self Care,2017,095,Other nervous system disorders,006,DECOMP PERIPHERAL NERVE,026,Other nervous system & related procedures,01,Diseases and Disorders of the Nervous System,1,Minor,Minor,Surgical,Private Health Insurance,Self-Pay,,,N,N,23912.52,8544.97
New York City,Manhattan,7002002,001439,Mount Sinai Beth Israel,30 to 49,112,M,Other Race,Not Span/Hispanic,3,Emergency,Left Against Medical Advice,2017,095,Other nervous system disorders,198,MAG RESONANCE IMAGING,026,Other nervous system & related procedures,01,Diseases and Disorders of the Nervous System,2,Moderate,Moderate,Surgical,Medicaid,Medicaid,Self-Pay,,N,Y,32961.78,10319.76
New York City,Manhattan,7002024,001456,Mount Sinai Hospital,50 to 69,112,M,Other Race,Not Span/Hispanic,2,Elective,Home or Self Care,2017,035,Cancer of brain and nervous system,211,THERAPEUTIC RADIOLOGY,026,Other nervous system & related procedures,01,Diseases and Disorders of the Nervous System,4,Extreme,Extreme,Surgical,Medicaid,Medicaid,Self-Pay,,N,N,56839.58,27378.13
New York City,Manhattan,7002054,001464,New York Presbyterian Hospital - Columbia Presbyterian Center,18 to 29,109,M,White,Not Span/Hispanic,1,Elective,Home or Self Care,2017,095,Other nervous system disorders,161,OT OR THER PRCS ON BONE,026,Other nervous system & related procedures,01,Diseases and Disorders of the Nervous System,2,Moderate,Minor,Surgical,Private Health Insurance,Self-Pay,,,N,N,28681.42,9288.89
New York City,Manhattan,7002054,001464,New York Presbyterian Hospital - Columbia Presbyterian Center,50 to 69,100,M,Multi-racial,Multi-ethnic,10,Urgent,Home w/ Home Health Services,2017,050,Diabetes mellitus with complications,175,OT OR THER PRC SKN/BRST,026,Other nervous system & related procedures,01,Diseases and Disorders of the Nervous System,2,Moderate,Minor,Surgical,Medicaid,Medicaid,Self-Pay,,N,N,109785.59,28054.04
New York City,Manhattan,7002054,001464,New York Presbyterian Hospital - Columbia Presbyterian Center,70 or Older,100,M,Multi-racial,Spanish/Hispanic,6,Elective,Inpatient Rehabilitation Facility,2017,205,Spondylosis; intervertebral disc disorders; other back problems,006,DECOMP PERIPHERAL NERVE,026,Other nervous system & related procedures,01,Diseases and Disorders of the Nervous System,2,Moderate,Moderate,Surgical,Medicare,Private Health Insurance,Self-Pay,,N,N,98518.13,30516.74
New York City,Manhattan,7002054,001464,New York Presbyterian Hospital - Columbia Presbyterian Center,50 to 69,107,F,White,Not Span/Hispanic,7,Urgent,Skilled Nursing Home,2017,050,Diabetes mellitus with complications,162,OT OR THER PRC ON JOINT,026,Other nervous system & related procedures,01,Diseases and Disorders of the Nervous System,3,Major,Moderate,Surgical,Medicare,Medicaid,Self-Pay,,N,N,79012.77,19765.09
New York City,Queens,7003010,001637,New York - Presbyterian/Queens,70 or Older,113,M,Other Race,Not Span/Hispanic,3,Emergency,Skilled Nursing Home,2017,233,Intracranial injury,019,OT THER PRCS EYELIDS,026,Other nervous system & related procedures,01,Diseases and Disorders of the Nervous System,3,Major,Moderate,Surgical,Medicare,Medicare,Self-Pay,,N,Y,40789.49,7608.98
New York City,Queens,7003010,001637,New York - Presbyterian/Queens,70 or Older,113,M,Other Race,Not Span/Hispanic,7,Emergency,Skilled Nursing Home,2017,109,Acute cerebrovascular disease,177,COMP AXIAL TOMOGR (CT),026,Other nervous system & related procedures,01,Diseases and Disorders of the Nervous System,2,Moderate,Moderate,Surgical,Medicare,Medicaid,Self-Pay,,N,Y,101980.49,36326.92
Hudson Valley,Rockland,4329000,000779,Good Samaritan Hospital of Suffern,50 to 69,104,F,Other Race,Spanish/Hispanic,2,Elective,Home or Self Care,2017,205,Spondylosis; intervertebral disc disorders; other back problems,006,DECOMP PERIPHERAL NERVE,026,Other nervous system & related procedures,01,Diseases and Disorders of the Nervous System,2,Moderate,Minor,Surgical,Blue Cross/Blue Shield,,,,N,N,54997.17,10591.72
Hudson Valley,Rockland,4329000,000779,Good Samaritan Hospital of Suffern,70 or Older,109,F,White,Not Span/Hispanic,8,Emergency,Skilled Nursing Home,2017,109,Acute cerebrovascular disease,048,CARDIAC PACEMAKER/DEFIB,026,Other nervous system & related procedures,01,Diseases and Disorders of the Nervous System,3,Major,Extreme,Surgical,Medicare,Medicaid,,,N,Y,303097.23,49975.14
New York City,Manhattan,7002024,001456,Mount Sinai Hospital,0 to 17,114,F,Other Race,Not Span/Hispanic,2,Elective,Home w/ Home Health Services,2017,083,Epilepsy; convulsions,009,OTHER OR THER NERV SYS,026,Other nervous system & related procedures,01,Diseases and Disorders of the Nervous System,2,Moderate,Moderate,Surgical,Medicaid,Self-Pay,,,N,N,98538.04,56904.76
New York City,Manhattan,7002053,001463,NYU Langone Hospitals,18 to 29,112,M,Black/African American,Not Span/Hispanic,1,Elective,Home or Self Care,2017,095,Other nervous system disorders,175,OT OR THER PRC SKN/BRST,026,Other nervous system & related procedures,01,Diseases and Disorders of the Nervous System,2,Moderate,Minor,Surgical,Medicaid,,,,N,N,138117.48,29207.45
New York City,Manhattan,7002053,001463,NYU Langone Hospitals,50 to 69,100,M,White,Not Span/Hispanic,3,Elective,Home w/ Home Health Services,2017,050,Diabetes mellitus with complications,160,OT THER PRCS ON MUSCLES,026,Other nervous system & related procedures,01,Diseases and Disorders of the Nervous System,3,Major,Moderate,Surgical,Medicaid,,,,N,N,144818.58,33048.56
Long Island,Suffolk,5123000,000885,Brookhaven Memorial Hospital Medical Center Inc,70 or Older,117,M,White,Not Span/Hispanic,7,Elective,Skilled Nursing Home,2017,050,Diabetes mellitus with complications,160,OT THER PRCS ON MUSCLES,026,Other nervous system & related procedures,01,Diseases and Disorders of the Nervous System,3,Major,Major,Surgical,Medicare,Medicare,Private Health Insurance,,N,N,153088.19,30061.38
Western NY,Erie,1401014,000207,Buffalo General Medical Center,50 to 69,142,M,White,Not Span/Hispanic,1,Elective,Home or Self Care,2017,095,Other nervous system disorders,006,DECOMP PERIPHERAL NERVE,026,Other nervous system & related procedures,01,Diseases and Disorders of the Nervous System,2,Moderate,Minor,Surgical,Medicare,Blue Cross/Blue Shield,Self-Pay,,N,N,27569.00,10153.32
Western NY,Erie,1401014,000207,Buffalo General Medical Center,70 or Older,143,F,White,Not Span/Hispanic,4,Emergency,Home w/ Home Health Services,2017,095,Other nervous system disorders,001,INCISION & EXCISION CNS,026,Other nervous system & related procedures,01,Diseases and Disorders of the Nervous System,1,Minor,Moderate,Surgical,Medicare,Self-Pay,,,N,Y,23583.23,9354.77
Western NY,Erie,1401014,000207,Buffalo General Medical Center,50 to 69,140,M,White,Not Span/Hispanic,4,Emergency,Home w/ Home Health Services,2017,233,Intracranial injury,048,CARDIAC PACEMAKER/DEFIB,026,Other nervous system & related procedures,01,Diseases and Disorders of the Nervous System,1,Minor,Minor,Surgical,Private Health Insurance,Self-Pay,,,N,Y,52978.93,18899.71
Western NY,Erie,1401014,000208,Women And Children's Hospital Of Buffalo,18 to 29,140,F,White,Not Span/Hispanic,4,Elective,Home or Self Care,2017,095,Other nervous system disorders,160,OT THER PRCS ON MUSCLES,026,Other nervous system & related procedures,01,Diseases and Disorders of the Nervous System,1,Minor,Minor,Surgical,Private Health Insurance,Self-Pay,,,N,N,27391.27,11763.55
Western NY,Erie,1401014,000208,Women And Children's Hospital Of Buffalo,0 to 17,141,M,White,Not Span/Hispanic,1,Elective,Home or Self Care,2017,082,Paralysis,175,OT OR THER PRC SKN/BRST,026,Other nervous system & related procedures,01,Diseases and Disorders of the Nervous System,2,Moderate,Moderate,Surgical,Blue Cross/Blue Shield,Medicaid,Self-Pay,,N,N,52517.36,22973.89
Western NY,Erie,1401005,000210,Erie County Medical Center,18 to 29,142,F,White,Unknown,8,Emergency,Inpatient Rehabilitation Facility,2017,233,Intracranial injury,160,OT THER PRCS ON MUSCLES,026,Other nervous system & related procedures,01,Diseases and Disorders of the Nervous System,3,Major,Moderate,Surgical,Miscellaneous/Other,Medicaid,,,N,Y,44878.86,17060.75
Capital/Adirond,Rensselaer,4102002,000756,Samaritan Hospital,50 to 69,121,F,Black/African American,Not Span/Hispanic,6,Emergency,Skilled Nursing Home,2017,095,Other nervous system disorders,157,AMPUTATE LOWER EXTRMITY,026,Other nervous system & related procedures,01,Diseases and Disorders of the Nervous System,3,Major,Moderate,Surgical,Private Health Insurance,Self-Pay,Self-Pay,,N,Y,24917.70,9374.05
Hudson Valley,Orange,3523000,000699,Orange Regional Medical Center,70 or Older,115,F,White,Not Span/Hispanic,8,Emergency,Home or Self Care,2017,042,Secondary malignancies,067,OT THER PRCS; HEM/LYMPH,026,Other nervous system & related procedures,01,Diseases and Disorders of the Nervous System,2,Moderate,Moderate,Surgical,Medicare,,,,N,Y,80691.51,33802.19
New York City,Bronx,7000006,001169,Montefiore Medical Center - Henry & Lucy Moses Div,30 to 49,OOS,F,White,Not Span/Hispanic,1,Emergency,Home or Self Care,2017,216,Nervous system congenital anomalies,009,OTHER OR THER NERV SYS,026,Other nervous system & related procedures,01,Diseases and Disorders of the Nervous System,2,Moderate,Minor,Surgical,Private Health Insurance,,,,N,N,29435.34,6387.69
New York City,Bronx,7000006,001169,Montefiore Medical Center - Henry & Lucy Moses Div,0 to 17,107,M,Other Race,Not Span/Hispanic,8,Elective,Skilled Nursing Home,2017,082,Paralysis,175,OT OR THER PRC SKN/BRST,026,Other nervous system & related procedures,01,Diseases and Disorders of the Nervous System,3,Major,Moderate,Surgical,Medicaid,,,,N,N,169200.61,50162.21
New York City,Bronx,7000006,001169,Montefiore Medical Center - Henry & Lucy Moses Div,30 to 49,104,F,Other Race,Spanish/Hispanic,1,Elective,Home or Self Care,2017,083,Epilepsy; convulsions,009,OTHER OR THER NERV SYS,026,Other nervous system & related procedures,01,Diseases and Disorders of the Nervous System,1,Minor,Minor,Surgical,Medicaid,,,,N,N,111221.80,41223.32
New York City,Bronx,7000006,001169,Montefiore Medical Center - Henry & Lucy Moses Div,50 to 69,OOS,M,Other Race,Spanish/Hispanic,3,Emergency,Inpatient Rehabilitation Facility,2017,082,Paralysis,175,OT OR THER PRC SKN/BRST,026,Other nervous system & related procedures,01,Diseases and Disorders of the Nervous System,1,Minor,Minor,Surgical,Private Health Insurance,,,,N,N,88194.07,26462.68
New York City,Bronx,7000006,001169,Montefiore Medical Center - Henry & Lucy Moses Div,30 to 49,104,F,Other Race,Spanish/Hispanic,2,Emergency,Home or Self Care,2017,095,Other nervous system disorders,048,CARDIAC PACEMAKER/DEFIB,026,Other nervous system & related procedures,01,Diseases and Disorders of the Nervous System,1,Minor,Minor,Surgical,Medicaid,,,,N,Y,88468.16,28899.76
New York City,Manhattan,7002024,001456,Mount Sinai Hospital,50 to 69,112,F,Other Race,Not Span/Hispanic,1,Elective,Home or Self Care,2017,095,Other nervous system disorders,006,DECOMP PERIPHERAL NERVE,026,Other nervous system & related procedures,01,Diseases and Disorders of the Nervous System,2,Moderate,Minor,Surgical,Medicare,Medicare,Medicaid,,N,N,23786.86,10001.03
New York City,Manhattan,7002032,001466,Mount Sinai West,50 to 69,100,F,White,Spanish/Hispanic,5,Emergency,Skilled Nursing Home,2017,042,Secondary malignancies,211,THERAPEUTIC RADIOLOGY,026,Other nervous system & related procedures,01,Diseases and Disorders of the Nervous System,3,Major,Major,Surgical,Medicare,Private Health Insurance,Medicaid,,N,Y,173314.19,61619.61
New York City,Richmond,7004003,001740,Staten Island University Hosp-North,50 to 69,103,M,White,Not Span/Hispanic,1,Emergency,Home or Self Care,2017,109,Acute cerebrovascular disease,160,OT THER PRCS ON MUSCLES,026,Other nervous system & related procedures,01,Diseases and Disorders of the Nervous System,2,Moderate,Moderate,Surgical,Private Health Insurance,,,,N,Y,21406.20,3490.56
Capital/Adirond,Otsego,3824000,000746,Mary Imogene Bassett Hospital,50 to 69,138,M,White,Not Span/Hispanic,24,Urgent,Inpatient Rehabilitation Facility,2017,216,Nervous system congenital anomalies,175,OT OR THER PRC SKN/BRST,026,Other nervous system & related procedures,01,Diseases and Disorders of the Nervous System,2,Moderate,Minor,Surgical,Medicare,Private Health Insurance,Medicaid,,N,N,56157.78,30958.71
Capital/Adirond,Schenectady,4601001,000829,Ellis Hospital,70 or Older,123,M,White,Not Span/Hispanic,5,Emergency,Skilled Nursing Home,2017,233,Intracranial injury,171,SUTURE SKIN/SUBCUT TISS,026,Other nervous system & related procedures,01,Diseases and Disorders of the Nervous System,2,Moderate,Moderate,Surgical,Medicare,Medicare,Medicaid,,N,N,23567.65,11494.36
New York City,Bronx,7000006,001169,Montefiore Medical Center - Henry & Lucy Moses Div,0 to 17,104,F,Other Race,Not Span/Hispanic,7,Emergency,Home w/ Home Health Services,2017,082,Paralysis,175,OT OR THER PRC SKN/BRST,026,Other nervous system & related procedures,01,Diseases and Disorders of the Nervous System,3,Major,Moderate,Surgical,Blue Cross/Blue Shield,,,,N,N,115315.92,30619.37
New York City,Manhattan,7002024,001456,Mount Sinai Hospital,50 to 69,119,F,Black/African American,Not Span/Hispanic,2,Elective,Home or Self Care,2017,095,Other nervous system disorders,160,OT THER PRCS ON MUSCLES,026,Other nervous system & related procedures,01,Diseases and Disorders of the Nervous System,1,Minor,Minor,Surgical,Private Health Insurance,Self-Pay,,,N,N,37124.11,15475.73
New York City,Manhattan,7002053,001463,NYU Langone Hospitals,30 to 49,112,M,White,Not Span/Hispanic,1,Elective,Home or Self Care,2017,095,Other nervous system disorders,006,DECOMP PERIPHERAL NERVE,026,Other nervous system & related procedures,01,Diseases and Disorders of the Nervous System,1,Minor,Minor,Surgical,Private Health Insurance,,,,N,N,59419.87,12630.58
New York City,Manhattan,7002053,001463,NYU Langone Hospitals,0 to 17,OOS,F,White,Not Span/Hispanic,1,Elective,Home or Self Care,2017,095,Other nervous system disorders,006,DECOMP PERIPHERAL NERVE,026,Other nervous system & related procedures,01,Diseases and Disorders of the Nervous System,1,Minor,Minor,Surgical,Private Health Insurance,,,,N,N,61583.78,11640.35
New York City,Manhattan,7002032,001466,Mount Sinai West,18 to 29,105,F,White,Not Span/Hispanic,11,Emergency,Hospice - Medical Facility,2017,083,Epilepsy; convulsions,009,OTHER OR THER NERV SYS,026,Other nervous system & related procedures,01,Diseases and Disorders of the Nervous System,4,Extreme,Major,Surgical,Private Health Insurance,Self-Pay,,,N,N,298722.85,112030.82
New York City,Manhattan,7002032,001466,Mount Sinai West,30 to 49,104,M,White,Not Span/Hispanic,1,Elective,Home or Self Care,2017,083,Epilepsy; convulsions,211,THERAPEUTIC RADIOLOGY,026,Other nervous system & related procedures,01,Diseases and Disorders of the Nervous System,2,Moderate,Moderate,Surgical,Medicaid,Medicaid,Self-Pay,,N,N,159030.42,58374.26
Long Island,Nassau,2952006,000551,St. Joseph Hospital,50 to 69,117,F,White,Not Span/Hispanic,1,Emergency,Home or Self Care,2017,233,Intracranial injury,160,OT THER PRCS ON MUSCLES,026,Other nervous system & related procedures,01,Diseases and Disorders of the Nervous System,1,Minor,Minor,Surgical,Medicaid,Medicaid,,,N,Y,14940.27,2437.24
Long Island,Suffolk,5154001,000925,Good Samaritan Hospital Medical Center,70 or Older,117,F,White,Not Span/Hispanic,19,Emergency,Skilled Nursing Home,2017,109,Acute cerebrovascular disease,079,LOC EXC LRG INTEST LESN,026,Other nervous system & related procedures,01,Diseases and Disorders of the Nervous System,3,Major,Moderate,Surgical,Medicare,Private Health Insurance,,,N,Y,193983.12,33802.14
Long Island,Suffolk,5154001,000925,Good Samaritan Hospital Medical Center,50 to 69,117,M,White,Not Span/Hispanic,4,Emergency,Home or Self Care,2017,228,Skull and face fractures,144,"TRTMNT,FACE FRACT/DISLC",026,Other nervous system & related procedures,01,Diseases and Disorders of the Nervous System,2,Moderate,Minor,Surgical,Private Health Insurance,,,,N,Y,62393.29,10897.05
Long Island,Suffolk,5154001,000925,Good Samaritan Hospital Medical Center,70 or Older,117,M,White,Not Span/Hispanic,3,Emergency,Home w/ Home Health Services,2017,109,Acute cerebrovascular disease,048,CARDIAC PACEMAKER/DEFIB,026,Other nervous system & related procedures,01,Diseases and Disorders of the Nervous System,3,Major,Moderate,Surgical,Medicare,Medicare,,,N,Y,89688.00,16796.85
New York City,Kings,7001003,001288,Brooklyn Hospital Center - Downtown Campus,70 or Older,112,F,Black/African American,Not Span/Hispanic,5,Emergency,Skilled Nursing Home,2017,083,Epilepsy; convulsions,160,OT THER PRCS ON MUSCLES,026,Other nervous system & related procedures,01,Diseases and Disorders of the Nervous System,3,Major,Major,Surgical,Medicare,Medicaid,Self-Pay,,N,Y,42800.46,7716.99
New York City,Kings,7001009,001294,Coney Island Hospital,18 to 29,112,M,Other Race,Spanish/Hispanic,1,Emergency,Home or Self Care,2017,244,Other injuries and conditions due to external causes,009,OTHER OR THER NERV SYS,026,Other nervous system & related procedures,01,Diseases and Disorders of the Nervous System,1,Minor,Minor,Surgical,Blue Cross/Blue Shield,,,,N,Y,7955.37,3905.06
New York City,Kings,7001021,001306,New York - Presbyterian Brooklyn Methodist Hospital,30 to 49,112,M,Black/African American,Not Span/Hispanic,4,Emergency,Home or Self Care,2017,050,Diabetes mellitus with complications,172,SKIN GRAFT,026,Other nervous system & related procedures,01,Diseases and Disorders of the Nervous System,3,Major,Moderate,Surgical,Medicaid,Medicaid,Self-Pay,,N,Y,36910.03,14758.88