Hospital Service Area,Hospital County,Operating Certificate Number,Permanent Facility Id,Facility Name,Age Group,Zip Code - 3 digits,Gender,Race,Ethnicity,Length of Stay,Type of Admission,Patient Disposition,Discharge Year,CCS Diagnosis Code,CCS Diagnosis Description,CCS Procedure Code,CCS Procedure Description,APR DRG Code,APR DRG Description,APR MDC Code,APR MDC Description,APR Severity of Illness Code,APR Severity of Illness Description,APR Risk of Mortality,APR Medical Surgical Description,Payment Typology 1,Payment Typology 2,Payment Typology 3,Birth Weight,Abortion Edit Indicator,Emergency Department Indicator,Total Charges,Total Costs
Hudson Valley,Westchester,5902001,001045,White Plains Hospital Center,70 or Older,106,M,Other Race,Not Span/Hispanic,13,Emergency,Expired,2019,CIR020,CEREBRAL INFARCTION,ADM001,TRANSFUSION OF BLOOD AND BLOOD PRODUCTS,026,OTHER NERVOUS SYSTEM & RELATED PROCEDURES,01,DISEASES AND DISORDERS OF THE NERVOUS SYSTEM,3,Major,Extreme,Surgical,Medicare,,,,,true,109219,27255.25
New York City,Manhattan,7002054,001458,New York-Presbyterian Hospital - New York Weill Cornell Center,18 to 29,117,M,White,Not Span/Hispanic,4,Elective,Home w/ Home Health Services,2019,NVS017,NERVE AND NERVE ROOT DISORDERS,MST018,BONE EXCISION,026,OTHER NERVOUS SYSTEM & RELATED PROCEDURES,01,DISEASES AND DISORDERS OF THE NERVOUS SYSTEM,1,Minor,Minor,Surgical,Blue Cross/Blue Shield,Self-Pay,,,,false,79505.19,22727.18
Capital/Adirond,Albany,0101004,000005,St. Peter's Hospital,30 to 49,121,F,White,Not Span/Hispanic,4,Elective,Home or Self Care,2019,NVS018,MYOPATHIES,LYM004,THYMECTOMY,026,OTHER NERVOUS SYSTEM & RELATED PROCEDURES,01,DISEASES AND DISORDERS OF THE NERVOUS SYSTEM,2,Moderate,Minor,Surgical,Private Health Insurance,,,,,false,41966.2,17488.8
New York City,Manhattan,7002054,001458,New York-Presbyterian Hospital - New York Weill Cornell Center,50 to 69,113,F,Other Race,Not Span/Hispanic,7,Emergency,Home w/ Home Health Services,2019,NVS017,NERVE AND NERVE ROOT DISORDERS,PNS003,PERIPHERAL NERVE DECOMPRESSION (EXCLUDING LUMBOSACRAL AND CERVICOTHORACIC),026,OTHER NERVOUS SYSTEM & RELATED PROCEDURES,01,DISEASES AND DISORDERS OF THE NERVOUS SYSTEM,2,Moderate,Minor,Surgical,Private Health Insurance,Self-Pay,,,,true,113825.87,29199.03
New York City,Manhattan,7002054,001464,New York-Presbyterian Hospital - Columbia Presbyterian Center,50 to 69,104,M,White,Multi-ethnic,10,Emergency,Home w/ Home Health Services,2019,NVS004,PARKINSON`S DISEASE,MST028,"SUBCUTANEOUS TISSUE AND FASCIA PROCEDURES, NEC",026,OTHER NERVOUS SYSTEM & RELATED PROCEDURES,01,DISEASES AND DISORDERS OF THE NERVOUS SYSTEM,2,Moderate,Minor,Surgical,Medicare,Medicaid,Self-Pay,,,true,130935.63,31724.56
New York City,Kings,7001002,001286,Brookdale Hospital Medical Center,70 or Older,112,F,Black/African American,Not Span/Hispanic,38,Emergency,Hospice - Home,2019,CIR020,CEREBRAL INFARCTION,CAR026,PACEMAKER AND DEFIBRILLATOR PROCEDURES,026,OTHER NERVOUS SYSTEM & RELATED PROCEDURES,01,DISEASES AND DISORDERS OF THE NERVOUS SYSTEM,4,Extreme,Extreme,Surgical,Medicare,,,,,true,213191.02,124035.03
New York City,Kings,7002053,001304,NYU Langone Hospital-Brooklyn,70 or Older,112,F,White,Not Span/Hispanic,5,Emergency,Skilled Nursing Home,2019,INJ008,"TRAUMATIC BRAIN INJURY (TBI); CONCUSSION, INITIAL ENCOUNTER",MST028,"SUBCUTANEOUS TISSUE AND FASCIA PROCEDURES, NEC",026,OTHER NERVOUS SYSTEM & RELATED PROCEDURES,01,DISEASES AND DISORDERS OF THE NERVOUS SYSTEM,4,Extreme,Major,Surgical,Medicare,Private Health Insurance,,,,true,117642.7,34410.74
New York City,Kings,7001021,001306,New York - Presbyterian Brooklyn Methodist Hospital,70 or Older,112,F,White,Not Span/Hispanic,14,Emergency,Skilled Nursing Home,2019,CIR021,ACUTE HEMORRHAGIC CEREBROVASCULAR DISEASE,CAR026,PACEMAKER AND DEFIBRILLATOR PROCEDURES,026,OTHER NERVOUS SYSTEM & RELATED PROCEDURES,01,DISEASES AND DISORDERS OF THE NERVOUS SYSTEM,4,Extreme,Extreme,Surgical,Medicare,Blue Cross/Blue Shield,Self-Pay,,,true,183062.14,52196.48
New York City,Manhattan,7002024,001456,Mount Sinai Hospital,70 or Older,115,M,White,Not Span/Hispanic,1,Elective,Home or Self Care,2019,NVS017,NERVE AND NERVE ROOT DISORDERS,EYP002,EYELID PROCEDURES,026,OTHER NERVOUS SYSTEM & RELATED PROCEDURES,01,DISEASES AND DISORDERS OF THE NERVOUS SYSTEM,2,Moderate,Moderate,Surgical,Medicare,Blue Cross/Blue Shield,Self-Pay,,,false,37169.09,12585.77
New York City,Manhattan,7002001,001438,Bellevue Hospital Center,50 to 69,100,F,Other Race,Not Span/Hispanic,13,Emergency,Home or Self Care,2019,NVS009,EPILEPSY; CONVULSIONS,CAR026,PACEMAKER AND DEFIBRILLATOR PROCEDURES,026,OTHER NERVOUS SYSTEM & RELATED PROCEDURES,01,DISEASES AND DISORDERS OF THE NERVOUS SYSTEM,3,Major,Major,Surgical,Medicare,Medicaid,,,,true,75811.63,50384.41
Long Island,Nassau,2908000,000511,NYU Langone Hospital-Long Island,50 to 69,115,M,Other Race,Not Span/Hispanic,6,Trauma,Psychiatric Hospital or Unit of Hosp,2019,INJ025,"INJURY TO NERVES, MUSCLES AND TENDONS, INITIAL ENCOUNTER",MST022,"TENDON, MUSCLE, BURSA, AND LIGAMENT REPAIR (EXCLUDING PERINEAL)",026,OTHER NERVOUS SYSTEM & RELATED PROCEDURES,01,DISEASES AND DISORDERS OF THE NERVOUS SYSTEM,4,Extreme,Extreme,Surgical,Medicaid,,,,,true,255863.59,49259.7
Capital/Adirond,Albany,0101000,000001,Albany Medical Center Hospital,70 or Older,137,M,White,Not Span/Hispanic,30,Emergency,Skilled Nursing Home,2019,CIR020,CEREBRAL INFARCTION,MST019,"MUSCLE, TENDON, BURSA, AND LIGAMENT EXCISION",026,OTHER NERVOUS SYSTEM & RELATED PROCEDURES,01,DISEASES AND DISORDERS OF THE NERVOUS SYSTEM,4,Extreme,Extreme,Surgical,Medicare,Blue Cross/Blue Shield,,,,true,241782.59,75099.58
New York City,Kings,7001002,001286,Brookdale Hospital Medical Center,70 or Older,112,M,Black/African American,Not Span/Hispanic,6,Emergency,Skilled Nursing Home,2019,CIR020,CEREBRAL INFARCTION,MST028,"SUBCUTANEOUS TISSUE AND FASCIA PROCEDURES, NEC",026,OTHER NERVOUS SYSTEM & RELATED PROCEDURES,01,DISEASES AND DISORDERS OF THE NERVOUS SYSTEM,2,Moderate,Moderate,Surgical,Medicare,,,,,true,31270.35,15508.42
New York City,Kings,7001021,001306,New York - Presbyterian Brooklyn Methodist Hospital,70 or Older,112,F,Black/African American,Not Span/Hispanic,15,Emergency,Skilled Nursing Home,2019,CIR020,CEREBRAL INFARCTION,MST023,TOE AND MID FOOT AMPUTATION,026,OTHER NERVOUS SYSTEM & RELATED PROCEDURES,01,DISEASES AND DISORDERS OF THE NERVOUS SYSTEM,3,Major,Major,Surgical,Medicare,Medicare,Medicaid,,,true,135285.48,35300.27
New York City,Manhattan,7002054,001464,New York-Presbyterian Hospital - Columbia Presbyterian Center,0 to 17,112,M,Black/African American,Not Span/Hispanic,1,Elective,Home or Self Care,2019,NVS009,EPILEPSY; CONVULSIONS,MST028,"SUBCUTANEOUS TISSUE AND FASCIA PROCEDURES, NEC",026,OTHER NERVOUS SYSTEM & RELATED PROCEDURES,01,DISEASES AND DISORDERS OF THE NERVOUS SYSTEM,2,Moderate,Minor,Surgical,Medicaid,Medicaid,Self-Pay,,,false,12558.55,3634.67
Capital/Adirond,Albany,0101004,000005,St. Peter's Hospital,70 or Older,123,M,White,Not Span/Hispanic,7,Emergency,Skilled Nursing Home,2019,NVS004,PARKINSON`S DISEASE,CAR026,PACEMAKER AND DEFIBRILLATOR PROCEDURES,026,OTHER NERVOUS SYSTEM & RELATED PROCEDURES,01,DISEASES AND DISORDERS OF THE NERVOUS SYSTEM,2,Moderate,Moderate,Surgical,Medicare,Blue Cross/Blue Shield,,,,true,44209.6,18925.24
Long Island,Nassau,2951001,000541,North Shore University Hospital,50 to 69,111,F,Other Race,Not Span/Hispanic,13,Elective,Home or Self Care,2019,NEO049,NERVOUS SYSTEM CANCERS - ALL OTHER TYPES,CNS007,CNS EXCISION PROCEDURES,026,OTHER NERVOUS SYSTEM & RELATED PROCEDURES,01,DISEASES AND DISORDERS OF THE NERVOUS SYSTEM,1,Minor,Moderate,Surgical,Medicaid,Medicaid,,,,false,232175.44,46903.58
Hudson Valley,Westchester,5922000,001122,New York - Presbyterian Hospital,30 to 49,105,M,Black/African American,Not Span/Hispanic,8,Emergency,Home or Self Care,2019,NEO070,SECONDARY MALIGNANCIES,LYM001,LYMPH NODE BIOPSY,026,OTHER NERVOUS SYSTEM & RELATED PROCEDURES,01,DISEASES AND DISORDERS OF THE NERVOUS SYSTEM,3,Major,Major,Surgical,Medicaid,Medicaid,,,,true,107855.35,43646.31
New York City,Kings,7001035,001318,Wyckoff Heights Medical Center,30 to 49,112,M,Black/African American,Not Span/Hispanic,5,Emergency,Home or Self Care,2019,NVS012,TRANSIENT CEREBRAL ISCHEMIA,LYM001,LYMPH NODE BIOPSY,026,OTHER NERVOUS SYSTEM & RELATED PROCEDURES,01,DISEASES AND DISORDERS OF THE NERVOUS SYSTEM,1,Minor,Minor,Surgical,Blue Cross/Blue Shield,,,,,true,60210.43,22338.42
Capital/Adirond,Albany,0101000,000001,Albany Medical Center Hospital,50 to 69,122,M,White,Not Span/Hispanic,4,Emergency,Home w/ Home Health Services,2019,NVS009,EPILEPSY; CONVULSIONS,MST028,"SUBCUTANEOUS TISSUE AND FASCIA PROCEDURES, NEC",026,OTHER NERVOUS SYSTEM & RELATED PROCEDURES,01,DISEASES AND DISORDERS OF THE NERVOUS SYSTEM,2,Moderate,Moderate,Surgical,Medicare,,,,,true,77930.7,43689.84
Capital/Adirond,Albany,0101000,000001,Albany Medical Center Hospital,18 to 29,128,M,White,Not Span/Hispanic,5,Elective,Home or Self Care,2019,NVS017,NERVE AND NERVE ROOT DISORDERS,MST019,"MUSCLE, TENDON, BURSA, AND LIGAMENT EXCISION",026,OTHER NERVOUS SYSTEM & RELATED PROCEDURES,01,DISEASES AND DISORDERS OF THE NERVOUS SYSTEM,2,Moderate,Minor,Surgical,Blue Cross/Blue Shield,,,,,false,34846.96,13300.76
New York City,Kings,7001002,001286,Brookdale Hospital Medical Center,30 to 49,112,M,Black/African American,Not Span/Hispanic,2,Trauma,Home or Self Care,2019,INJ008,"TRAUMATIC BRAIN INJURY (TBI); CONCUSSION, INITIAL ENCOUNTER",MST030,"MUSCULOSKELETAL PROCEDURES, NEC",026,OTHER NERVOUS SYSTEM & RELATED PROCEDURES,01,DISEASES AND DISORDERS OF THE NERVOUS SYSTEM,1,Minor,Minor,Surgical,Miscellaneous/Other,Self-Pay,,,,true,20301.27,10321.61
New York City,Bronx,7000002,001165,Jacobi Medical Center,50 to 69,104,M,Black/African American,Not Span/Hispanic,1,Emergency,Home or Self Care,2019,INJ016,"INJURY TO BLOOD VESSELS, INITIAL ENCOUNTER",MST022,"TENDON, MUSCLE, BURSA, AND LIGAMENT REPAIR (EXCLUDING PERINEAL)",026,OTHER NERVOUS SYSTEM & RELATED PROCEDURES,01,DISEASES AND DISORDERS OF THE NERVOUS SYSTEM,2,Moderate,Moderate,Surgical,Self-Pay,,,,,true,15944.04,9433.29
Capital/Adirond,Albany,0101000,000001,Albany Medical Center Hospital,0 to 17,123,M,Other Race,Spanish/Hispanic,1,Elective,Home w/ Home Health Services,2019,NVS017,NERVE AND NERVE ROOT DISORDERS,PNS002,CERVICOTHORACIC NERVE DECOMPRESSION,026,OTHER NERVOUS SYSTEM & RELATED PROCEDURES,01,DISEASES AND DISORDERS OF THE NERVOUS SYSTEM,1,Minor,Minor,Surgical,"Managed Care, Unspecified",,,,,false,24452.69,10571.53
New York City,Bronx,7000001,001178,BronxCare Hospital Center,18 to 29,112,F,Other Race,Spanish/Hispanic,11,Emergency,Facility w/ Custodial/Supportive Care,2019,END003,DIABETES MELLITUS WITH COMPLICATION,MST020,SUBCUTANEOUS TISSUE AND FASCIA EXCISION,026,OTHER NERVOUS SYSTEM & RELATED PROCEDURES,01,DISEASES AND DISORDERS OF THE NERVOUS SYSTEM,3,Major,Major,Surgical,Medicare,Medicaid,,,,true,31157.13,44340.12
New York City,Bronx,7000002,001165,Jacobi Medical Center,70 or Older,104,F,White,Not Span/Hispanic,4,Emergency,Home w/ Home Health Services,2019,INJ008,"TRAUMATIC BRAIN INJURY (TBI); CONCUSSION, INITIAL ENCOUNTER",MST022,"TENDON, MUSCLE, BURSA, AND LIGAMENT REPAIR (EXCLUDING PERINEAL)",026,OTHER NERVOUS SYSTEM & RELATED PROCEDURES,01,DISEASES AND DISORDERS OF THE NERVOUS SYSTEM,2,Moderate,Minor,Surgical,Medicare,Medicare,Private Health Insurance,,,true,27989.32,16559.88
New York City,Manhattan,7002054,001458,New York-Presbyterian Hospital - New York Weill Cornell Center,30 to 49,100,F,White,Not Span/Hispanic,9,Emergency,Home or Self Care,2019,NVS017,NERVE AND NERVE ROOT DISORDERS,MST019,"MUSCLE, TENDON, BURSA, AND LIGAMENT EXCISION",026,OTHER NERVOUS SYSTEM & RELATED PROCEDURES,01,DISEASES AND DISORDERS OF THE NERVOUS SYSTEM,4,Extreme,Extreme,Surgical,"Managed Care, Unspecified",Medicaid,Self-Pay,,,true,204220.35,65606.44
New York City,Manhattan,7002054,001464,New York-Presbyterian Hospital - Columbia Presbyterian Center,30 to 49,105,M,White,Not Span/Hispanic,3,Urgent,Home or Self Care,2019,NVS017,NERVE AND NERVE ROOT DISORDERS,PNS003,PERIPHERAL NERVE DECOMPRESSION (EXCLUDING LUMBOSACRAL AND CERVICOTHORACIC),026,OTHER NERVOUS SYSTEM & RELATED PROCEDURES,01,DISEASES AND DISORDERS OF THE NERVOUS SYSTEM,2,Moderate,Minor,Surgical,Blue Cross/Blue Shield,Self-Pay,,,,false,93033.63,37639.11
Hudson Valley,Rockland,4329000,000779,Good Samaritan Hospital of Suffern,18 to 29,OOS,M,White,Not Span/Hispanic,1,Elective,Home or Self Care,2019,NVS017,NERVE AND NERVE ROOT DISORDERS,MST018,BONE EXCISION,026,OTHER NERVOUS SYSTEM & RELATED PROCEDURES,01,DISEASES AND DISORDERS OF THE NERVOUS SYSTEM,2,Moderate,Minor,Surgical,Private Health Insurance,,,,,false,87085.95,12102.44
New York City,Kings,7001021,001306,New York - Presbyterian Brooklyn Methodist Hospital,30 to 49,112,M,Multi-racial,Not Span/Hispanic,6,Emergency,Home w/ Home Health Services,2019,NVS015,POLYNEUROPATHIES,MST023,TOE AND MID FOOT AMPUTATION,026,OTHER NERVOUS SYSTEM & RELATED PROCEDURES,01,DISEASES AND DISORDERS OF THE NERVOUS SYSTEM,3,Major,Minor,Surgical,"Managed Care, Unspecified",Medicaid,Self-Pay,,,true,50769.96,17791.05
New York City,Kings,7001021,001306,New York - Presbyterian Brooklyn Methodist Hospital,70 or Older,112,M,White,Not Span/Hispanic,12,Emergency,Inpatient Rehabilitation Facility,2019,CIR020,CEREBRAL INFARCTION,CAR026,PACEMAKER AND DEFIBRILLATOR PROCEDURES,026,OTHER NERVOUS SYSTEM & RELATED PROCEDURES,01,DISEASES AND DISORDERS OF THE NERVOUS SYSTEM,3,Major,Major,Surgical,Blue Cross/Blue Shield,Self-Pay,,,,true,316199.8,85171.07
New York City,Manhattan,7002002,001439,Mount Sinai Beth Israel,30 to 49,104,M,Black/African American,Unknown,2,Urgent,Home w/ Home Health Services,2019,NVS017,NERVE AND NERVE ROOT DISORDERS,PNS003,PERIPHERAL NERVE DECOMPRESSION (EXCLUDING LUMBOSACRAL AND CERVICOTHORACIC),026,OTHER NERVOUS SYSTEM & RELATED PROCEDURES,01,DISEASES AND DISORDERS OF THE NERVOUS SYSTEM,1,Minor,Minor,Surgical,Medicaid,Medicaid,Self-Pay,,,false,32021.5,7241.92
New York City,Manhattan,7002053,001463,NYU Langone Hospitals,30 to 49,117,M,White,Not Span/Hispanic,1,Elective,Home or Self Care,2019,NVS017,NERVE AND NERVE ROOT DISORDERS,PNS003,PERIPHERAL NERVE DECOMPRESSION (EXCLUDING LUMBOSACRAL AND CERVICOTHORACIC),026,OTHER NERVOUS SYSTEM & RELATED PROCEDURES,01,DISEASES AND DISORDERS OF THE NERVOUS SYSTEM,2,Moderate,Minor,Surgical,Private Health Insurance,,,,,false,83739.52,14568.36
New York City,Manhattan,7002054,001464,New York-Presbyterian Hospital - Columbia Presbyterian Center,50 to 69,100,M,Multi-racial,Not Span/Hispanic,1,Elective,Home or Self Care,2019,NVS004,PARKINSON`S DISEASE,MST028,"SUBCUTANEOUS TISSUE AND FASCIA PROCEDURES, NEC",026,OTHER NERVOUS SYSTEM & RELATED PROCEDURES,01,DISEASES AND DISORDERS OF THE NERVOUS SYSTEM,1,Minor,Minor,Surgical,Private Health Insurance,Self-Pay,,,,false,10927.08,2782.72
New York City,Manhattan,7002054,001464,New York-Presbyterian Hospital - Columbia Presbyterian Center,30 to 49,100,M,Other Race,Not Span/Hispanic,15,Elective,Home or Self Care,2019,SYM010,NERVOUS SYSTEM SIGNS AND SYMPTOMS,RHB002,"PHYSICAL, OCCUPATIONAL, AND RESPIRATORY THERAPY TREATMENT",026,OTHER NERVOUS SYSTEM & RELATED PROCEDURES,01,DISEASES AND DISORDERS OF THE NERVOUS SYSTEM,3,Major,Moderate,Surgical,Medicaid,Medicaid,Self-Pay,,,false,180977.57,50207.47
Central NY,Onondaga,3301008,000636,Crouse Hospital,70 or Older,130,F,White,Not Span/Hispanic,6,Emergency,Skilled Nursing Home,2019,CIR020,CEREBRAL INFARCTION,ADM006,INFUSION OF VASOPRESSOR,026,OTHER NERVOUS SYSTEM & RELATED PROCEDURES,01,DISEASES AND DISORDERS OF THE NERVOUS SYSTEM,4,Extreme,Extreme,Surgical,Medicare,Self-Pay,,,,false,40261.2,21861.22
Central NY,Onondaga,3301008,000636,Crouse Hospital,50 to 69,134,F,White,Not Span/Hispanic,1,Urgent,Home or Self Care,2019,INJ037,"COMPLICATION OF OTHER SURGICAL OR MEDICAL CARE, INJURY, INITIAL ENCOUNTER",MST028,"SUBCUTANEOUS TISSUE AND FASCIA PROCEDURES, NEC",026,OTHER NERVOUS SYSTEM & RELATED PROCEDURES,01,DISEASES AND DISORDERS OF THE NERVOUS SYSTEM,1,Minor,Minor,Surgical,Blue Cross/Blue Shield,Medicare,Medicare,,,false,52652.16,30545.22
New York City,Kings,7002053,001304,NYU Langone Hospital-Brooklyn,70 or Older,112,M,Black/African American,Not Span/Hispanic,9,Emergency,Skilled Nursing Home,2019,CIR020,CEREBRAL INFARCTION,CAR026,PACEMAKER AND DEFIBRILLATOR PROCEDURES,026,OTHER NERVOUS SYSTEM & RELATED PROCEDURES,01,DISEASES AND DISORDERS OF THE NERVOUS SYSTEM,4,Extreme,Extreme,Surgical,Medicare,,,,,false,255282.61,80022.11
Western NY,Erie,1404000,000267,Kenmore Mercy Hospital,50 to 69,142,M,White,Not Span/Hispanic,1,Emergency,Home or Self Care,2019,INJ008,"TRAUMATIC BRAIN INJURY (TBI); CONCUSSION, INITIAL ENCOUNTER",MST022,"TENDON, MUSCLE, BURSA, AND LIGAMENT REPAIR (EXCLUDING PERINEAL)",026,OTHER NERVOUS SYSTEM & RELATED PROCEDURES,01,DISEASES AND DISORDERS OF THE NERVOUS SYSTEM,2,Moderate,Minor,Surgical,Private Health Insurance,,,,,true,10999.46,3048.41
New York City,Bronx,7000014,001176,SBH Health System,70 or Older,104,M,White,Not Span/Hispanic,11,Trauma,Skilled Nursing Home,2019,INJ008,"TRAUMATIC BRAIN INJURY (TBI); CONCUSSION, INITIAL ENCOUNTER",CAR026,PACEMAKER AND DEFIBRILLATOR PROCEDURES,026,OTHER NERVOUS SYSTEM & RELATED PROCEDURES,01,DISEASES AND DISORDERS OF THE NERVOUS SYSTEM,3,Major,Major,Surgical,Medicare,Medicare,,,,true,134456.96,55280.43
New York City,Kings,7001035,001318,Wyckoff Heights Medical Center,50 to 69,112,F,Other Race,Not Span/Hispanic,6,Emergency,Home w/ Home Health Services,2019,END003,DIABETES MELLITUS WITH COMPLICATION,MST019,"MUSCLE, TENDON, BURSA, AND LIGAMENT EXCISION",026,OTHER NERVOUS SYSTEM & RELATED PROCEDURES,01,DISEASES AND DISORDERS OF THE NERVOUS SYSTEM,3,Major,Major,Surgical,Medicare,Medicaid,,,,false,28477.35,12608.92
New York City,Bronx,7000014,001176,SBH Health System,18 to 29,104,M,Black/African American,Not Span/Hispanic,2,Trauma,Home or Self Care,2019,INJ008,"TRAUMATIC BRAIN INJURY (TBI); CONCUSSION, INITIAL ENCOUNTER",MST022,"TENDON, MUSCLE, BURSA, AND LIGAMENT REPAIR (EXCLUDING PERINEAL)",026,OTHER NERVOUS SYSTEM & RELATED PROCEDURES,01,DISEASES AND DISORDERS OF THE NERVOUS SYSTEM,2,Moderate,Minor,Surgical,Medicaid,,,,,true,28120.2,6808.52
Long Island,Nassau,2952005,000552,Plainview Hospital,70 or Older,115,F,White,Not Span/Hispanic,7,Emergency,Home w/ Home Health Services,2019,NVS015,POLYNEUROPATHIES,MST023,TOE AND MID FOOT AMPUTATION,026,OTHER NERVOUS SYSTEM & RELATED PROCEDURES,01,DISEASES AND DISORDERS OF THE NERVOUS SYSTEM,3,Major,Moderate,Surgical,Medicare,Medicare,,,,true,68992.73,20088.18
New York City,Manhattan,7002032,001466,Mount Sinai West,18 to 29,112,F,White,Not Span/Hispanic,1,Urgent,Home or Self Care,2019,NVS009,EPILEPSY; CONVULSIONS,MST028,"SUBCUTANEOUS TISSUE AND FASCIA PROCEDURES, NEC",026,OTHER NERVOUS SYSTEM & RELATED PROCEDURES,01,DISEASES AND DISORDERS OF THE NERVOUS SYSTEM,1,Minor,Minor,Surgical,Medicaid,Medicaid,Self-Pay,,,false,88076.44,29196.75
New York City,Manhattan,7002032,001466,Mount Sinai West,70 or Older,OOS,M,White,Not Span/Hispanic,1,Elective,Home or Self Care,2019,NVS004,PARKINSON`S DISEASE,MST028,"SUBCUTANEOUS TISSUE AND FASCIA PROCEDURES, NEC",026,OTHER NERVOUS SYSTEM & RELATED PROCEDURES,01,DISEASES AND DISORDERS OF THE NERVOUS SYSTEM,1,Minor,Minor,Surgical,Medicare,Medicaid,Self-Pay,,,false,89349.32,29692.48
New York City,Bronx,7000014,001176,SBH Health System,70 or Older,104,M,White,Spanish/Hispanic,2,Trauma,Short-term Hospital,2019,INJ008,"TRAUMATIC BRAIN INJURY (TBI); CONCUSSION, INITIAL ENCOUNTER",MST028,"SUBCUTANEOUS TISSUE AND FASCIA PROCEDURES, NEC",026,OTHER NERVOUS SYSTEM & RELATED PROCEDURES,01,DISEASES AND DISORDERS OF THE NERVOUS SYSTEM,2,Moderate,Minor,Surgical,Medicaid,Medicaid,Medicare,,,true,21843.33,5191.68
New York City,Manhattan,7002054,003975,New York Presbyterian Hospital - Allen Hospital,30 to 49,OOS,M,White,Not Span/Hispanic,3,Emergency,Home or Self Care,2019,MAL004,NERVOUS SYSTEM CONGENITAL ANOMALIES,PNS005,PERIPHERAL NERVE DENERVATION,026,OTHER NERVOUS SYSTEM & RELATED PROCEDURES,01,DISEASES AND DISORDERS OF THE NERVOUS SYSTEM,1,Minor,Minor,Surgical,Private Health Insurance,Self-Pay,,,,false,98838.68,30678.46
New York City,Kings,7001002,001286,Brookdale Hospital Medical Center,50 to 69,112,M,Black/African American,Not Span/Hispanic,8,Emergency,Inpatient Rehabilitation Facility,2019,CIR020,CEREBRAL INFARCTION,IMG002,FLUOROSCOPIC ANGIOGRAPHY (EXCLUDING CORONARY),026,OTHER NERVOUS SYSTEM & RELATED PROCEDURES,01,DISEASES AND DISORDERS OF THE NERVOUS SYSTEM,3,Major,Moderate,Surgical,Medicaid,,,,,true,114670.59,70939.93
Long Island,Nassau,2950002,000528,Nassau University Medical Center,18 to 29,115,M,White,Spanish/Hispanic,4,Emergency,Home or Self Care,2019,INJ025,"INJURY TO NERVES, MUSCLES AND TENDONS, INITIAL ENCOUNTER",PNS004,NERVE REPAIR,026,OTHER NERVOUS SYSTEM & RELATED PROCEDURES,01,DISEASES AND DISORDERS OF THE NERVOUS SYSTEM,2,Moderate,Minor,Surgical,Medicaid,Self-Pay,,,,false,31189.92,15799.29
Western NY,Erie,1401014,000207,Buffalo General Medical Center,70 or Older,140,F,White,Not Span/Hispanic,3,Elective,Home w/ Home Health Services,2019,INJ037,"COMPLICATION OF OTHER SURGICAL OR MEDICAL CARE, INJURY, INITIAL ENCOUNTER",MST028,"SUBCUTANEOUS TISSUE AND FASCIA PROCEDURES, NEC",026,OTHER NERVOUS SYSTEM & RELATED PROCEDURES,01,DISEASES AND DISORDERS OF THE NERVOUS SYSTEM,2,Moderate,Major,Surgical,Medicare,Self-Pay,,,,false,59449.68,21776.53
New York City,Manhattan,7002012,001447,Hospital for Special Surgery,30 to 49,OOS,F,White,Not Span/Hispanic,2,Elective,Home or Self Care,2019,NVS017,NERVE AND NERVE ROOT DISORDERS,PNS003,PERIPHERAL NERVE DECOMPRESSION (EXCLUDING LUMBOSACRAL AND CERVICOTHORACIC),026,OTHER NERVOUS SYSTEM & RELATED PROCEDURES,01,DISEASES AND DISORDERS OF THE NERVOUS SYSTEM,2,Moderate,Minor,Surgical,Blue Cross/Blue Shield,,,,,false,45730,19377.58
New York City,Manhattan,7002032,001466,Mount Sinai West,18 to 29,100,F,White,Spanish/Hispanic,2,Urgent,Home or Self Care,2019,SYM014,SKIN/SUBCUTANEOUS SIGNS AND SYMPTOMS,PNS003,PERIPHERAL NERVE DECOMPRESSION (EXCLUDING LUMBOSACRAL AND CERVICOTHORACIC),026,OTHER NERVOUS SYSTEM & RELATED PROCEDURES,01,DISEASES AND DISORDERS OF THE NERVOUS SYSTEM,1,Minor,Minor,Surgical,Private Health Insurance,Self-Pay,,,,false,31365.54,8691.79
Finger Lakes,Monroe,2701005,000413,Strong Memorial Hospital,70 or Older,146,M,Black/African American,Not Span/Hispanic,44,Emergency,Hospice - Medical Facility,2019,NVS008,PARALYSIS (OTHER THAN CEREBRAL PALSY),SKB008,SKIN EXCISION AND DEBRIDEMENT,026,OTHER NERVOUS SYSTEM & RELATED PROCEDURES,01,DISEASES AND DISORDERS OF THE NERVOUS SYSTEM,4,Extreme,Extreme,Surgical,Medicare,,,,,true,99492.71,51523.11
New York City,Manhattan,7002017,001450,Lenox Hill Hospital,30 to 49,100,F,White,Not Span/Hispanic,1,Emergency,Home or Self Care,2019,INJ025,"INJURY TO NERVES, MUSCLES AND TENDONS, INITIAL ENCOUNTER",CNS011,MENINGES REPAIR,026,OTHER NERVOUS SYSTEM & RELATED PROCEDURES,01,DISEASES AND DISORDERS OF THE NERVOUS SYSTEM,1,Minor,Minor,Surgical,Private Health Insurance,,,,,true,55367.83,21388.83
New York City,Manhattan,7002017,001450,Lenox Hill Hospital,18 to 29,100,F,White,Not Span/Hispanic,1,Emergency,Home or Self Care,2019,INJ025,"INJURY TO NERVES, MUSCLES AND TENDONS, INITIAL ENCOUNTER",MST030,"MUSCULOSKELETAL PROCEDURES, NEC",026,OTHER NERVOUS SYSTEM & RELATED PROCEDURES,01,DISEASES AND DISORDERS OF THE NERVOUS SYSTEM,1,Minor,Minor,Surgical,Private Health Insurance,,,,,true,28645.73,8255.77
Western NY,Erie,1404000,000267,Kenmore Mercy Hospital,30 to 49,141,M,White,Not Span/Hispanic,17,Elective,Home w/ Home Health Services,2019,NVS013,COMA; STUPOR; AND BRAIN DAMAGE,MST020,SUBCUTANEOUS TISSUE AND FASCIA EXCISION,026,OTHER NERVOUS SYSTEM & RELATED PROCEDURES,01,DISEASES AND DISORDERS OF THE NERVOUS SYSTEM,3,Major,Major,Surgical,Medicaid,,,,,false,63799.34,23800.38