Hospital Service Area,Hospital County,Operating Certificate Number,Permanent Facility Id,Facility Name,Age Group,Zip Code - 3 digits,Gender,Race,Ethnicity,Length of Stay,Type of Admission,Patient Disposition,Discharge Year,CCS Diagnosis Code,CCS Diagnosis Description,CCS Procedure Code,CCS Procedure Description,APR DRG Code,APR DRG Description,APR MDC Code,APR MDC Description,APR Severity of Illness Code,APR Severity of Illness Description,APR Risk of Mortality,APR Medical Surgical Description,Payment Typology 1,Payment Typology 2,Payment Typology 3,Birth Weight,Abortion Edit Indicator,Emergency Department Indicator,Total Charges,Total Costs
New York City,Manhattan,7002024,001456,Mount Sinai Hospital,50 to 69,111,F,Other Race,Not Span/Hispanic,21,Elective,Home or Self Care,2020,SYM010,NERVOUS SYSTEM SIGNS AND SYMPTOMS,SKB007,SKIN GRAFT,026,OTHER NERVOUS SYSTEM & RELATED PROCEDURES,01,DISEASES AND DISORDERS OF THE NERVOUS SYSTEM,3,Major,Moderate,Surgical,Medicaid,Medicaid,Self-Pay,,,N,191409.78,42298.65
New York City,Manhattan,7002024,001456,Mount Sinai Hospital,30 to 49,113,M,Other Race,Spanish/Hispanic,1,Elective,Home or Self Care,2020,INJ037,"COMPLICATION OF OTHER SURGICAL OR MEDICAL CARE, INJURY, INITIAL ENCOUNTER",MST028,"SUBCUTANEOUS TISSUE AND FASCIA PROCEDURES, NEC",026,OTHER NERVOUS SYSTEM & RELATED PROCEDURES,01,DISEASES AND DISORDERS OF THE NERVOUS SYSTEM,1,Minor,Minor,Surgical,Miscellaneous/Other,Self-Pay,,,,N,72136.56,33359.3
New York City,Bronx,7000006,001169,Montefiore Medical Center - Henry & Lucy Moses Div,0 to 17,104,M,Black/African American,Not Span/Hispanic,1,Emergency,Home or Self Care,2020,NVS007,CEREBRAL PALSY,MST030,"MUSCULOSKELETAL PROCEDURES, NEC",026,OTHER NERVOUS SYSTEM & RELATED PROCEDURES,01,DISEASES AND DISORDERS OF THE NERVOUS SYSTEM,2,Moderate,Minor,Surgical,Medicaid,,,,,N,37759.18,8134.22
New York City,Manhattan,7002024,001456,Mount Sinai Hospital,30 to 49,113,F,Other Race,Unknown,1,Elective,Home or Self Care,2020,NVS017,NERVE AND NERVE ROOT DISORDERS,MST018,BONE EXCISION,026,OTHER NERVOUS SYSTEM & RELATED PROCEDURES,01,DISEASES AND DISORDERS OF THE NERVOUS SYSTEM,2,Moderate,Minor,Surgical,Medicaid,Medicaid,Self-Pay,,,N,33085.14,8961.49
New York City,Manhattan,7002024,001456,Mount Sinai Hospital,18 to 29,112,M,Other Race,Spanish/Hispanic,23,Elective,Short-term Hospital,2020,NVS008,PARALYSIS (OTHER THAN CEREBRAL PALSY),SKB008,SKIN EXCISION AND DEBRIDEMENT,026,OTHER NERVOUS SYSTEM & RELATED PROCEDURES,01,DISEASES AND DISORDERS OF THE NERVOUS SYSTEM,4,Extreme,Major,Surgical,Medicaid,Medicaid,Self-Pay,,,N,195947.7,40435.66
New York City,Manhattan,7002054,003975,New York Presbyterian Hospital - Allen Hospital,50 to 69,OOS,F,White,Not Span/Hispanic,3,Elective,Home w/ Home Health Services,2020,MAL004,NERVOUS SYSTEM CONGENITAL ANOMALIES,PNS005,PERIPHERAL NERVE DENERVATION,026,OTHER NERVOUS SYSTEM & RELATED PROCEDURES,01,DISEASES AND DISORDERS OF THE NERVOUS SYSTEM,1,Minor,Minor,Surgical,Private Health Insurance,Self-Pay,,,,N,100384.24,30543.32
New York City,Bronx,7000006,001169,Montefiore Medical Center - Henry & Lucy Moses Div,18 to 29,OOS,M,Black/African American,Not Span/Hispanic,2,Elective,Home or Self Care,2020,NVS018,MYOPATHIES,LYM004,THYMECTOMY,026,OTHER NERVOUS SYSTEM & RELATED PROCEDURES,01,DISEASES AND DISORDERS OF THE NERVOUS SYSTEM,2,Moderate,Minor,Surgical,Private Health Insurance,,,,,N,74494.52,14439.65
New York City,Manhattan,7002054,001464,New York-Presbyterian Hospital - Columbia Presbyterian Center,70 or Older,113,F,Other Race,Not Span/Hispanic,5,Emergency,Home w/ Home Health Services,2020,INJ037,"COMPLICATION OF OTHER SURGICAL OR MEDICAL CARE, INJURY, INITIAL ENCOUNTER",MST028,"SUBCUTANEOUS TISSUE AND FASCIA PROCEDURES, NEC",026,OTHER NERVOUS SYSTEM & RELATED PROCEDURES,01,DISEASES AND DISORDERS OF THE NERVOUS SYSTEM,3,Major,Major,Surgical,Medicare,Medicaid,Self-Pay,,,Y,243370.92,102579.53
New York City,Manhattan,7002054,001464,New York-Presbyterian Hospital - Columbia Presbyterian Center,18 to 29,100,F,Multi-racial,Multi-ethnic,1,Elective,Home or Self Care,2020,NVS009,EPILEPSY; CONVULSIONS,CNS012,CNS NEUROSTIMULATOR PROCEDURES,026,OTHER NERVOUS SYSTEM & RELATED PROCEDURES,01,DISEASES AND DISORDERS OF THE NERVOUS SYSTEM,1,Minor,Minor,Surgical,Private Health Insurance,Medicaid,Self-Pay,,,N,43244.53,14139.9
New York City,Manhattan,7002054,001464,New York-Presbyterian Hospital - Columbia Presbyterian Center,30 to 49,OOS,F,White,Not Span/Hispanic,5,Elective,Inpatient Rehabilitation Facility,2020,NVS007,CEREBRAL PALSY,MST030,"MUSCULOSKELETAL PROCEDURES, NEC",026,OTHER NERVOUS SYSTEM & RELATED PROCEDURES,01,DISEASES AND DISORDERS OF THE NERVOUS SYSTEM,1,Minor,Minor,Surgical,Blue Cross/Blue Shield,Self-Pay,,,,N,83681.5,21797.92
New York City,Manhattan,7002054,001464,New York-Presbyterian Hospital - Columbia Presbyterian Center,70 or Older,100,M,Multi-racial,Not Span/Hispanic,9,Emergency,Inpatient Rehabilitation Facility,2020,INJ008,"TRAUMATIC BRAIN INJURY (TBI); CONCUSSION, INITIAL ENCOUNTER",CAR026,PACEMAKER AND DEFIBRILLATOR PROCEDURES,026,OTHER NERVOUS SYSTEM & RELATED PROCEDURES,01,DISEASES AND DISORDERS OF THE NERVOUS SYSTEM,2,Moderate,Moderate,Surgical,Medicare,Private Health Insurance,Self-Pay,,,Y,148347.04,38070.68
New York City,Manhattan,7002054,001458,New York-Presbyterian Hospital - New York Weill Cornell Center,18 to 29,100,M,Other Race,Not Span/Hispanic,1,Emergency,Home or Self Care,2020,NVS009,EPILEPSY; CONVULSIONS,CNS012,CNS NEUROSTIMULATOR PROCEDURES,026,OTHER NERVOUS SYSTEM & RELATED PROCEDURES,01,DISEASES AND DISORDERS OF THE NERVOUS SYSTEM,2,Moderate,Minor,Surgical,Self-Pay,Self-Pay,,,,N,121819.26,59667.82
New York City,Manhattan,7002054,001458,New York-Presbyterian Hospital - New York Weill Cornell Center,50 to 69,100,M,White,Not Span/Hispanic,3,Emergency,Home w/ Home Health Services,2020,INJ008,"TRAUMATIC BRAIN INJURY (TBI); CONCUSSION, INITIAL ENCOUNTER",SKB006,SKIN LACERATION REPAIR (EXCLUDING PERINEUM),026,OTHER NERVOUS SYSTEM & RELATED PROCEDURES,01,DISEASES AND DISORDERS OF THE NERVOUS SYSTEM,2,Moderate,Moderate,Surgical,Private Health Insurance,Self-Pay,,,,Y,48801.69,10938.09
New York City,Manhattan,7002054,001458,New York-Presbyterian Hospital - New York Weill Cornell Center,70 or Older,100,F,White,Not Span/Hispanic,4,Emergency,Home or Self Care,2020,INJ008,"TRAUMATIC BRAIN INJURY (TBI); CONCUSSION, INITIAL ENCOUNTER",CAR026,PACEMAKER AND DEFIBRILLATOR PROCEDURES,026,OTHER NERVOUS SYSTEM & RELATED PROCEDURES,01,DISEASES AND DISORDERS OF THE NERVOUS SYSTEM,2,Moderate,Moderate,Surgical,Medicare,Private Health Insurance,Self-Pay,,,Y,125287.75,47669.18
New York City,Kings,7001021,001306,New York - Presbyterian Brooklyn Methodist Hospital,70 or Older,112,M,White,Not Span/Hispanic,7,Emergency,Skilled Nursing Home,2020,NVS011,NEUROCOGNITIVE DISORDERS,CAR026,PACEMAKER AND DEFIBRILLATOR PROCEDURES,026,OTHER NERVOUS SYSTEM & RELATED PROCEDURES,01,DISEASES AND DISORDERS OF THE NERVOUS SYSTEM,3,Major,Major,Surgical,Medicare,Medicare,Self-Pay,,,Y,97244.05,23936.97
New York City,Manhattan,7002054,001458,New York-Presbyterian Hospital - New York Weill Cornell Center,30 to 49,100,F,White,Not Span/Hispanic,1,Emergency,Home or Self Care,2020,NVS017,NERVE AND NERVE ROOT DISORDERS,MST018,BONE EXCISION,026,OTHER NERVOUS SYSTEM & RELATED PROCEDURES,01,DISEASES AND DISORDERS OF THE NERVOUS SYSTEM,2,Moderate,Minor,Surgical,Private Health Insurance,Self-Pay,,,,N,48672.62,18974.99
New York City,Manhattan,7002054,001458,New York-Presbyterian Hospital - New York Weill Cornell Center,50 to 69,100,M,White,Not Span/Hispanic,1,Elective,Home or Self Care,2020,MUS011,SPONDYLOPATHIES/SPONDYLOARTHROPATHY (INCLUDING INFECTIVE),PNS002,CERVICOTHORACIC NERVE DECOMPRESSION,026,OTHER NERVOUS SYSTEM & RELATED PROCEDURES,01,DISEASES AND DISORDERS OF THE NERVOUS SYSTEM,1,Minor,Minor,Surgical,Private Health Insurance,Self-Pay,,,,N,40490.9,12155.45
New York City,Manhattan,7002054,001458,New York-Presbyterian Hospital - New York Weill Cornell Center,70 or Older,100,F,White,Not Span/Hispanic,5,Emergency,Home w/ Home Health Services,2020,INJ008,"TRAUMATIC BRAIN INJURY (TBI); CONCUSSION, INITIAL ENCOUNTER",CAR026,PACEMAKER AND DEFIBRILLATOR PROCEDURES,026,OTHER NERVOUS SYSTEM & RELATED PROCEDURES,01,DISEASES AND DISORDERS OF THE NERVOUS SYSTEM,2,Moderate,Moderate,Surgical,Medicare,Blue Cross/Blue Shield,Self-Pay,,,Y,153478.77,63564.15
New York City,Manhattan,7002054,001458,New York-Presbyterian Hospital - New York Weill Cornell Center,30 to 49,113,M,Black/African American,Not Span/Hispanic,1,Emergency,Home or Self Care,2020,NVS009,EPILEPSY; CONVULSIONS,MST028,"SUBCUTANEOUS TISSUE AND FASCIA PROCEDURES, NEC",026,OTHER NERVOUS SYSTEM & RELATED PROCEDURES,01,DISEASES AND DISORDERS OF THE NERVOUS SYSTEM,2,Moderate,Minor,Surgical,Medicaid,Self-Pay,,,,N,163297.02,78788.74
New York City,Manhattan,7002054,001458,New York-Presbyterian Hospital - New York Weill Cornell Center,70 or Older,112,M,Other Race,Spanish/Hispanic,2,Elective,Home or Self Care,2020,NVS017,NERVE AND NERVE ROOT DISORDERS,CNS014,"CNS PROCEDURES, NEC",026,OTHER NERVOUS SYSTEM & RELATED PROCEDURES,01,DISEASES AND DISORDERS OF THE NERVOUS SYSTEM,1,Minor,Minor,Surgical,Medicare,Medicare,Self-Pay,,,N,90648.54,38120.59
Long Island,Nassau,2950002,000528,Nassau University Medical Center,18 to 29,117,F,White,Spanish/Hispanic,10,Trauma,Home or Self Care,2020,INJ008,"TRAUMATIC BRAIN INJURY (TBI); CONCUSSION, INITIAL ENCOUNTER",MST022,"TENDON, MUSCLE, BURSA, AND LIGAMENT REPAIR (EXCLUDING PERINEAL)",026,OTHER NERVOUS SYSTEM & RELATED PROCEDURES,01,DISEASES AND DISORDERS OF THE NERVOUS SYSTEM,2,Moderate,Minor,Surgical,Miscellaneous/Other,Medicaid,Self-Pay,,,N,119420.68,36445.31
Western NY,Erie,1401005,000210,Erie County Medical Center,50 to 69,142,M,Black/African American,Not Span/Hispanic,1,Elective,Home w/ Home Health Services,2020,MUS011,SPONDYLOPATHIES/SPONDYLOARTHROPATHY (INCLUDING INFECTIVE),PNS002,CERVICOTHORACIC NERVE DECOMPRESSION,026,OTHER NERVOUS SYSTEM & RELATED PROCEDURES,01,DISEASES AND DISORDERS OF THE NERVOUS SYSTEM,2,Moderate,Minor,Surgical,Medicaid,Medicaid,,,,N,10395.15,6848.51
Western NY,Erie,1401005,000210,Erie County Medical Center,50 to 69,143,M,White,Not Span/Hispanic,7,Emergency,Home w/ Home Health Services,2020,INJ008,"TRAUMATIC BRAIN INJURY (TBI); CONCUSSION, INITIAL ENCOUNTER",CAR026,PACEMAKER AND DEFIBRILLATOR PROCEDURES,026,OTHER NERVOUS SYSTEM & RELATED PROCEDURES,01,DISEASES AND DISORDERS OF THE NERVOUS SYSTEM,2,Moderate,Minor,Surgical,Miscellaneous/Other,Self-Pay,,,,Y,95869.17,46237.01
New York City,Manhattan,7002032,001466,Mount Sinai West,18 to 29,100,M,Other Race,Spanish/Hispanic,1,Elective,Home or Self Care,2020,NVS017,NERVE AND NERVE ROOT DISORDERS,MST018,BONE EXCISION,026,OTHER NERVOUS SYSTEM & RELATED PROCEDURES,01,DISEASES AND DISORDERS OF THE NERVOUS SYSTEM,2,Moderate,Minor,Surgical,Medicaid,Medicaid,Self-Pay,,,N,32817.2,7866.46
New York City,Manhattan,7002032,001466,Mount Sinai West,30 to 49,100,M,White,Spanish/Hispanic,15,Elective,Skilled Nursing Home,2020,END003,DIABETES MELLITUS WITH COMPLICATION,SKB008,SKIN EXCISION AND DEBRIDEMENT,026,OTHER NERVOUS SYSTEM & RELATED PROCEDURES,01,DISEASES AND DISORDERS OF THE NERVOUS SYSTEM,3,Major,Major,Surgical,Medicaid,Medicaid,Self-Pay,,,N,178326.79,39805.07
Capital/Adirond,Otsego,3824000,000746,Mary Imogene Bassett Hospital,50 to 69,138,F,White,Not Span/Hispanic,1,Elective,Home or Self Care,2020,NVS017,NERVE AND NERVE ROOT DISORDERS,PNS003,PERIPHERAL NERVE DECOMPRESSION (EXCLUDING LUMBOSACRAL AND CERVICOTHORACIC),026,OTHER NERVOUS SYSTEM & RELATED PROCEDURES,01,DISEASES AND DISORDERS OF THE NERVOUS SYSTEM,2,Moderate,Minor,Surgical,Blue Cross/Blue Shield,,,,,N,19699.09,9033.01
New York City,Manhattan,7002024,001456,Mount Sinai Hospital,50 to 69,112,M,Other Race,Not Span/Hispanic,48,Elective,Short-term Hospital,2020,NVS008,PARALYSIS (OTHER THAN CEREBRAL PALSY),RHB002,"PHYSICAL, OCCUPATIONAL, AND RESPIRATORY THERAPY TREATMENT",026,OTHER NERVOUS SYSTEM & RELATED PROCEDURES,01,DISEASES AND DISORDERS OF THE NERVOUS SYSTEM,3,Major,Moderate,Surgical,Miscellaneous/Other,Private Health Insurance,Medicaid,,,N,406824.68,86554.08
New York City,Manhattan,7002024,001456,Mount Sinai Hospital,50 to 69,104,F,Other Race,Not Span/Hispanic,1,Elective,Home or Self Care,2020,NVS017,NERVE AND NERVE ROOT DISORDERS,PNS003,PERIPHERAL NERVE DECOMPRESSION (EXCLUDING LUMBOSACRAL AND CERVICOTHORACIC),026,OTHER NERVOUS SYSTEM & RELATED PROCEDURES,01,DISEASES AND DISORDERS OF THE NERVOUS SYSTEM,2,Moderate,Minor,Surgical,Medicare,Medicare,Medicaid,,,N,34408.3,9286.39
New York City,Manhattan,7002053,001463,NYU Langone Hospitals,0 to 17,112,F,Black/African American,Not Span/Hispanic,1,Elective,Home or Self Care,2020,NVS007,CEREBRAL PALSY,MST030,"MUSCULOSKELETAL PROCEDURES, NEC",026,OTHER NERVOUS SYSTEM & RELATED PROCEDURES,01,DISEASES AND DISORDERS OF THE NERVOUS SYSTEM,4,Extreme,Moderate,Surgical,Medicaid,,,,,N,87618.94,21551.94
New York City,Bronx,7000006,001169,Montefiore Medical Center - Henry & Lucy Moses Div,50 to 69,104,M,Black/African American,Not Span/Hispanic,2,Elective,Home or Self Care,2020,NVS009,EPILEPSY; CONVULSIONS,MST028,"SUBCUTANEOUS TISSUE AND FASCIA PROCEDURES, NEC",026,OTHER NERVOUS SYSTEM & RELATED PROCEDURES,01,DISEASES AND DISORDERS OF THE NERVOUS SYSTEM,2,Moderate,Minor,Surgical,Medicare,Medicaid,,,,N,229721.75,77608.2
New York City,Manhattan,7002024,001456,Mount Sinai Hospital,50 to 69,104,F,Other Race,Spanish/Hispanic,22,Emergency,Home w/ Home Health Services,2020,NEO070,SECONDARY MALIGNANCIES,LYM001,LYMPH NODE BIOPSY,026,OTHER NERVOUS SYSTEM & RELATED PROCEDURES,01,DISEASES AND DISORDERS OF THE NERVOUS SYSTEM,3,Major,Extreme,Surgical,Medicaid,Self-Pay,,,,Y,301621.48,68818.97
New York City,Manhattan,7002024,001456,Mount Sinai Hospital,30 to 49,OOS,F,Other Race,Not Span/Hispanic,2,Elective,Home w/ Home Health Services,2020,NEO073,BENIGN NEOPLASMS,CNS007,CNS EXCISION PROCEDURES,026,OTHER NERVOUS SYSTEM & RELATED PROCEDURES,01,DISEASES AND DISORDERS OF THE NERVOUS SYSTEM,3,Major,Major,Surgical,Private Health Insurance,Self-Pay,,,,N,102719.48,28207.28
Finger Lakes,Monroe,2701005,000413,Strong Memorial Hospital,50 to 69,144,M,White,Unknown,12,Emergency,Inpatient Rehabilitation Facility,2020,CIR021,ACUTE HEMORRHAGIC CEREBROVASCULAR DISEASE,MST022,"TENDON, MUSCLE, BURSA, AND LIGAMENT REPAIR (EXCLUDING PERINEAL)",026,OTHER NERVOUS SYSTEM & RELATED PROCEDURES,01,DISEASES AND DISORDERS OF THE NERVOUS SYSTEM,3,Major,Minor,Surgical,Miscellaneous/Other,Private Health Insurance,,,,Y,96459.98,38741.31
New York City,Bronx,7000001,001178,BronxCare Hospital Center,50 to 69,104,F,Other Race,Spanish/Hispanic,20,Emergency,Home or Self Care,2020,NVS014,CNS ABSCESS,MST005,INCISION AND DRAINAGE OF SUBCUTANEOUS TISSUE AND FASCIA,026,OTHER NERVOUS SYSTEM & RELATED PROCEDURES,01,DISEASES AND DISORDERS OF THE NERVOUS SYSTEM,3,Major,Moderate,Surgical,Medicaid,Medicaid,,,,Y,64788.47,91529.99
New York City,Bronx,7000006,001169,Montefiore Medical Center - Henry & Lucy Moses Div,70 or Older,105,M,White,Not Span/Hispanic,17,Emergency,Expired,2020,NEO070,SECONDARY MALIGNANCIES,LYM001,LYMPH NODE BIOPSY,026,OTHER NERVOUS SYSTEM & RELATED PROCEDURES,01,DISEASES AND DISORDERS OF THE NERVOUS SYSTEM,4,Extreme,Extreme,Surgical,Private Health Insurance,Medicare,,,,Y,348835.21,55746.05
Capital/Adirond,Albany,0101000,000001,Albany Medical Center Hospital,70 or Older,120,M,White,Spanish/Hispanic,25,Emergency,Hospice - Medical Facility,2020,NVS009,EPILEPSY; CONVULSIONS,CAR026,PACEMAKER AND DEFIBRILLATOR PROCEDURES,026,OTHER NERVOUS SYSTEM & RELATED PROCEDURES,01,DISEASES AND DISORDERS OF THE NERVOUS SYSTEM,3,Major,Moderate,Surgical,Medicare,Medicaid,,,,Y,255568.79,73428.34
Capital/Adirond,Albany,0101000,000001,Albany Medical Center Hospital,30 to 49,122,F,White,Not Span/Hispanic,5,Elective,Home or Self Care,2020,NVS017,NERVE AND NERVE ROOT DISORDERS,PNS003,PERIPHERAL NERVE DECOMPRESSION (EXCLUDING LUMBOSACRAL AND CERVICOTHORACIC),026,OTHER NERVOUS SYSTEM & RELATED PROCEDURES,01,DISEASES AND DISORDERS OF THE NERVOUS SYSTEM,1,Minor,Minor,Surgical,Miscellaneous/Other,,,,,N,34699.53,12340.32
Capital/Adirond,Albany,0101000,000001,Albany Medical Center Hospital,30 to 49,128,M,White,Not Span/Hispanic,2,Emergency,Home or Self Care,2020,INJ025,"INJURY TO NERVES, MUSCLES AND TENDONS, INITIAL ENCOUNTER",PNS004,NERVE REPAIR,026,OTHER NERVOUS SYSTEM & RELATED PROCEDURES,01,DISEASES AND DISORDERS OF THE NERVOUS SYSTEM,1,Minor,Minor,Surgical,Miscellaneous/Other,"Managed Care, Unspecified",,,,Y,27700.08,9660.86
New York City,Manhattan,7002032,001466,Mount Sinai West,18 to 29,,M,White,Not Span/Hispanic,2,Elective,Home or Self Care,2020,NVS017,NERVE AND NERVE ROOT DISORDERS,MST030,"MUSCULOSKELETAL PROCEDURES, NEC",026,OTHER NERVOUS SYSTEM & RELATED PROCEDURES,01,DISEASES AND DISORDERS OF THE NERVOUS SYSTEM,1,Minor,Minor,Surgical,Private Health Insurance,Self-Pay,,,,N,55635.83,14222.67
New York City,Kings,7002053,001304,NYU Langone Hospital-Brooklyn,70 or Older,112,M,White,Not Span/Hispanic,30,Emergency,Skilled Nursing Home,2020,NVS011,NEUROCOGNITIVE DISORDERS,MST005,INCISION AND DRAINAGE OF SUBCUTANEOUS TISSUE AND FASCIA,026,OTHER NERVOUS SYSTEM & RELATED PROCEDURES,01,DISEASES AND DISORDERS OF THE NERVOUS SYSTEM,4,Extreme,Major,Surgical,Private Health Insurance,,,,,Y,272422.04,97810.64
New York City,Manhattan,7002053,001463,NYU Langone Hospitals,70 or Older,112,F,Black/African American,Not Span/Hispanic,3,Elective,Home or Self Care,2020,NVS017,NERVE AND NERVE ROOT DISORDERS,ENT013,ENT REPAIR,026,OTHER NERVOUS SYSTEM & RELATED PROCEDURES,01,DISEASES AND DISORDERS OF THE NERVOUS SYSTEM,1,Minor,Minor,Surgical,Blue Cross/Blue Shield,,,,,N,99535.63,19797.62
Long Island,Nassau,2908000,000511,NYU Langone Hospital-Long Island,70 or Older,114,M,Black/African American,Not Span/Hispanic,2,Emergency,Home w/ Home Health Services,2020,NVS017,NERVE AND NERVE ROOT DISORDERS,CNS014,"CNS PROCEDURES, NEC",026,OTHER NERVOUS SYSTEM & RELATED PROCEDURES,01,DISEASES AND DISORDERS OF THE NERVOUS SYSTEM,1,Minor,Moderate,Surgical,Medicaid,,,,,Y,78294.45,14751.49
Long Island,Nassau,2908000,000511,NYU Langone Hospital-Long Island,30 to 49,117,F,White,Not Span/Hispanic,1,Elective,Home or Self Care,2020,NVS017,NERVE AND NERVE ROOT DISORDERS,PNS003,PERIPHERAL NERVE DECOMPRESSION (EXCLUDING LUMBOSACRAL AND CERVICOTHORACIC),026,OTHER NERVOUS SYSTEM & RELATED PROCEDURES,01,DISEASES AND DISORDERS OF THE NERVOUS SYSTEM,1,Minor,Minor,Surgical,Miscellaneous/Other,,,,,N,70120.25,11692.23
New York City,Bronx,7000006,001169,Montefiore Medical Center - Henry & Lucy Moses Div,30 to 49,109,M,White,Not Span/Hispanic,9,Emergency,Inpatient Rehabilitation Facility,2020,CIR020,CEREBRAL INFARCTION,SKB008,SKIN EXCISION AND DEBRIDEMENT,026,OTHER NERVOUS SYSTEM & RELATED PROCEDURES,01,DISEASES AND DISORDERS OF THE NERVOUS SYSTEM,4,Extreme,Extreme,Surgical,Medicare,Medicaid,,,,N,152015.91,26304.8
Western NY,Erie,1401014,000207,Buffalo General Medical Center,50 to 69,143,M,White,Not Span/Hispanic,11,Emergency,Home or Self Care,2020,NVS020,OTHER SPECIFIED NERVOUS SYSTEM DISORDERS,MST025,ABOVE KNEE AND OTHER PROXIMAL LOWER EXTREMITY AMPUTATION,026,OTHER NERVOUS SYSTEM & RELATED PROCEDURES,01,DISEASES AND DISORDERS OF THE NERVOUS SYSTEM,3,Major,Major,Surgical,Private Health Insurance,Medicare,Self-Pay,,,Y,50341,19773.41
Western NY,Erie,1401014,000207,Buffalo General Medical Center,50 to 69,142,F,Black/African American,Not Span/Hispanic,9,Emergency,Home w/ Home Health Services,2020,CIR020,CEREBRAL INFARCTION,CAR026,PACEMAKER AND DEFIBRILLATOR PROCEDURES,026,OTHER NERVOUS SYSTEM & RELATED PROCEDURES,01,DISEASES AND DISORDERS OF THE NERVOUS SYSTEM,3,Major,Major,Surgical,Medicaid,Self-Pay,,,,Y,57324.01,21959.82
Western NY,Erie,1401014,000207,Buffalo General Medical Center,30 to 49,OOS,M,White,Not Span/Hispanic,2,Elective,Home or Self Care,2020,NVS017,NERVE AND NERVE ROOT DISORDERS,CNS014,"CNS PROCEDURES, NEC",026,OTHER NERVOUS SYSTEM & RELATED PROCEDURES,01,DISEASES AND DISORDERS OF THE NERVOUS SYSTEM,1,Minor,Minor,Surgical,Blue Cross/Blue Shield,Self-Pay,,,,N,47715.07,16620.03
New York City,Bronx,7000006,001169,Montefiore Medical Center - Henry & Lucy Moses Div,0 to 17,107,F,Black/African American,Not Span/Hispanic,2,Elective,Home w/ Home Health Services,2020,NVS007,CEREBRAL PALSY,MST030,"MUSCULOSKELETAL PROCEDURES, NEC",026,OTHER NERVOUS SYSTEM & RELATED PROCEDURES,01,DISEASES AND DISORDERS OF THE NERVOUS SYSTEM,3,Major,Minor,Surgical,Medicaid,,,,,N,51583.76,11913.86
New York City,Manhattan,7002054,001458,New York-Presbyterian Hospital - New York Weill Cornell Center,70 or Older,100,F,White,Not Span/Hispanic,4,Elective,Home or Self Care,2020,NVS009,EPILEPSY; CONVULSIONS,MAM011,ELECTROENCEPHALOGRAM (EEG),026,OTHER NERVOUS SYSTEM & RELATED PROCEDURES,01,DISEASES AND DISORDERS OF THE NERVOUS SYSTEM,3,Major,Major,Surgical,Medicare,Medicare,Self-Pay,,,N,114738.55,52064.56
New York City,Queens,7003010,001637,New York - Presbyterian/Queens,70 or Older,119,F,White,Not Span/Hispanic,8,Elective,Skilled Nursing Home,2020,END003,DIABETES MELLITUS WITH COMPLICATION,MST018,BONE EXCISION,026,OTHER NERVOUS SYSTEM & RELATED PROCEDURES,01,DISEASES AND DISORDERS OF THE NERVOUS SYSTEM,2,Moderate,Moderate,Surgical,Medicare,Private Health Insurance,Self-Pay,,,N,80096,25759.58
New York City,Manhattan,7002024,001456,Mount Sinai Hospital,50 to 69,115,M,White,Not Span/Hispanic,1,Elective,Home or Self Care,2020,NVS017,NERVE AND NERVE ROOT DISORDERS,PNS001,LUMBOSACRAL NERVE DECOMPRESSION,026,OTHER NERVOUS SYSTEM & RELATED PROCEDURES,01,DISEASES AND DISORDERS OF THE NERVOUS SYSTEM,1,Minor,Minor,Surgical,Miscellaneous/Other,Self-Pay,,,,N,28846.84,8265.14
New York City,Manhattan,7002053,001463,NYU Langone Hospitals,18 to 29,,M,White,Not Span/Hispanic,2,Elective,Home or Self Care,2020,NVS017,NERVE AND NERVE ROOT DISORDERS,PNS003,PERIPHERAL NERVE DECOMPRESSION (EXCLUDING LUMBOSACRAL AND CERVICOTHORACIC),026,OTHER NERVOUS SYSTEM & RELATED PROCEDURES,01,DISEASES AND DISORDERS OF THE NERVOUS SYSTEM,1,Minor,Minor,Surgical,Blue Cross/Blue Shield,,,,,N,130578.05,22573.9
New York City,Manhattan,7002054,001458,New York-Presbyterian Hospital - New York Weill Cornell Center,18 to 29,114,F,Other Race,Spanish/Hispanic,1,Elective,Another Type Not Listed,2020,FAC009,"IMPLANT, DEVICE OR GRAFT RELATED ENCOUNTER",MST028,"SUBCUTANEOUS TISSUE AND FASCIA PROCEDURES, NEC",026,OTHER NERVOUS SYSTEM & RELATED PROCEDURES,01,DISEASES AND DISORDERS OF THE NERVOUS SYSTEM,2,Moderate,Moderate,Surgical,Medicaid,Self-Pay,,,,N,131866.49,55315.83
New York City,Manhattan,7002024,001456,Mount Sinai Hospital,30 to 49,104,F,Other Race,Spanish/Hispanic,1,Elective,Home or Self Care,2020,INJ037,"COMPLICATION OF OTHER SURGICAL OR MEDICAL CARE, INJURY, INITIAL ENCOUNTER",MST028,"SUBCUTANEOUS TISSUE AND FASCIA PROCEDURES, NEC",026,OTHER NERVOUS SYSTEM & RELATED PROCEDURES,01,DISEASES AND DISORDERS OF THE NERVOUS SYSTEM,2,Moderate,Minor,Surgical,Miscellaneous/Other,Self-Pay,,,,N,74708.47,34422.41
New York City,Kings,7001021,001306,New York - Presbyterian Brooklyn Methodist Hospital,50 to 69,112,M,Black/African American,Not Span/Hispanic,7,Emergency,Home or Self Care,2020,CIR020,CEREBRAL INFARCTION,CAR026,PACEMAKER AND DEFIBRILLATOR PROCEDURES,026,OTHER NERVOUS SYSTEM & RELATED PROCEDURES,01,DISEASES AND DISORDERS OF THE NERVOUS SYSTEM,3,Major,Major,Surgical,Private Health Insurance,Self-Pay,,,,Y,90769.58,22386.83
New York City,Manhattan,7002054,001458,New York-Presbyterian Hospital - New York Weill Cornell Center,50 to 69,112,F,Black/African American,Not Span/Hispanic,1,Elective,Home or Self Care,2020,NVS018,MYOPATHIES,LYM004,THYMECTOMY,026,OTHER NERVOUS SYSTEM & RELATED PROCEDURES,01,DISEASES AND DISORDERS OF THE NERVOUS SYSTEM,2,Moderate,Minor,Surgical,Blue Cross/Blue Shield,Self-Pay,,,,N,66120.51,20830.19