Hospital Service Area,Hospital County,Operating Certificate Number,Permanent Facility Id,Facility Name,Age Group,Zip Code - 3 digits,Gender,Race,Ethnicity,Length of Stay,Type of Admission,Patient Disposition,Discharge Year,CCS Diagnosis Code,CCS Diagnosis Description,CCS Procedure Code,CCS Procedure Description,APR DRG Code,APR DRG Description,APR MDC Code,APR MDC Description,APR Severity of Illness Code,APR Severity of Illness Description,APR Risk of Mortality,APR Medical Surgical Description,Payment Typology 1,Payment Typology 2,Payment Typology 3,Birth Weight,Abortion Edit Indicator,Emergency Department Indicator,Total Charges,Total Costs
New York City,Manhattan,7002001,001438,Bellevue Hospital Center,30 to 49,104,M,Black/African American,Not Span/Hispanic,39,Emergency,Home or Self Care,2019,DIG020,PANCREATIC DISORDERS (EXCLUDING DIABETES),HEP010,HEPATOBILIARY AND PANCREATIC DRAINAGE,260,"MAJOR PANCREAS, LIVER & SHUNT PROCEDURES",07,DISEASES AND DISORDERS OF THE HEPATOBILIARY SYSTEM AND PANCREAS,3,Major,Minor,Surgical,Medicaid,,,,,false,193319.3,128480.01
Capital/Adirond,Albany,0101000,000001,Albany Medical Center Hospital,50 to 69,121,F,White,Not Span/Hispanic,6,Elective,Home or Self Care,2019,NEO021,GASTROINTESTINAL CANCERS - ALL OTHER TYPES,HEP005,PANCREATECTOMY,260,"MAJOR PANCREAS, LIVER & SHUNT PROCEDURES",07,DISEASES AND DISORDERS OF THE HEPATOBILIARY SYSTEM AND PANCREAS,3,Major,Moderate,Surgical,"Managed Care, Unspecified",,,,,false,61382.62,22602.37
Capital/Adirond,Albany,0101004,000005,St. Peter's Hospital,50 to 69,121,M,Other Race,Not Span/Hispanic,4,Elective,Home w/ Home Health Services,2019,NEO070,SECONDARY MALIGNANCIES,HEP004,HEPATOBILIARY RESECTION AND ABLATION,260,"MAJOR PANCREAS, LIVER & SHUNT PROCEDURES",07,DISEASES AND DISORDERS OF THE HEPATOBILIARY SYSTEM AND PANCREAS,3,Major,Moderate,Surgical,Medicaid,Medicaid,,,,false,47171.5,18774.1
New York City,Manhattan,7002054,001458,New York-Presbyterian Hospital - New York Weill Cornell Center,70 or Older,100,M,Other Race,Not Span/Hispanic,7,Elective,Home w/ Home Health Services,2019,NEO017,GASTROINTESTINAL CANCERS - LIVER,HEP004,HEPATOBILIARY RESECTION AND ABLATION,260,"MAJOR PANCREAS, LIVER & SHUNT PROCEDURES",07,DISEASES AND DISORDERS OF THE HEPATOBILIARY SYSTEM AND PANCREAS,3,Major,Major,Surgical,Medicare,Medicare,Self-Pay,,,false,168092.61,49903.6
New York City,Bronx,7000006,001169,Montefiore Medical Center - Henry & Lucy Moses Div,50 to 69,OOS,F,White,Not Span/Hispanic,8,Elective,Home or Self Care,2019,NEO051,ENDOCRINE SYSTEM CANCERS - PANCREAS,HEP005,PANCREATECTOMY,260,"MAJOR PANCREAS, LIVER & SHUNT PROCEDURES",07,DISEASES AND DISORDERS OF THE HEPATOBILIARY SYSTEM AND PANCREAS,2,Moderate,Minor,Surgical,Blue Cross/Blue Shield,,,,,false,238506.34,45288.4
New York City,Manhattan,7002024,001456,Mount Sinai Hospital,30 to 49,112,F,Other Race,Not Span/Hispanic,4,Elective,Home or Self Care,2019,NEO017,GASTROINTESTINAL CANCERS - LIVER,HEP004,HEPATOBILIARY RESECTION AND ABLATION,260,"MAJOR PANCREAS, LIVER & SHUNT PROCEDURES",07,DISEASES AND DISORDERS OF THE HEPATOBILIARY SYSTEM AND PANCREAS,2,Moderate,Minor,Surgical,Private Health Insurance,Medicaid,Self-Pay,,,false,71367.18,23244.56
New York City,Manhattan,7002054,001458,New York-Presbyterian Hospital - New York Weill Cornell Center,70 or Older,OOS,M,Other Race,Not Span/Hispanic,6,Elective,Home w/ Home Health Services,2019,NEO017,GASTROINTESTINAL CANCERS - LIVER,HEP004,HEPATOBILIARY RESECTION AND ABLATION,260,"MAJOR PANCREAS, LIVER & SHUNT PROCEDURES",07,DISEASES AND DISORDERS OF THE HEPATOBILIARY SYSTEM AND PANCREAS,2,Moderate,Moderate,Surgical,Medicare,Private Health Insurance,Self-Pay,,,false,142331.68,35344.31
New York City,Manhattan,7002024,001456,Mount Sinai Hospital,50 to 69,117,F,Black/African American,Not Span/Hispanic,2,Elective,Home or Self Care,2019,NEO017,GASTROINTESTINAL CANCERS - LIVER,HEP004,HEPATOBILIARY RESECTION AND ABLATION,260,"MAJOR PANCREAS, LIVER & SHUNT PROCEDURES",07,DISEASES AND DISORDERS OF THE HEPATOBILIARY SYSTEM AND PANCREAS,2,Moderate,Moderate,Surgical,Medicaid,Medicaid,Self-Pay,,,false,72719.48,27283.43
Finger Lakes,Monroe,2701003,000411,Rochester General Hospital,50 to 69,136,M,White,Not Span/Hispanic,7,Elective,Home w/ Home Health Services,2019,NEO051,ENDOCRINE SYSTEM CANCERS - PANCREAS,GIS025,OTHER GI SYSTEM DEVICE PROCEDURES,260,"MAJOR PANCREAS, LIVER & SHUNT PROCEDURES",07,DISEASES AND DISORDERS OF THE HEPATOBILIARY SYSTEM AND PANCREAS,1,Minor,Minor,Surgical,Private Health Insurance,,,,,false,59231.11,25128.97
New York City,Manhattan,7002053,001463,NYU Langone Hospitals,50 to 69,125,F,White,Not Span/Hispanic,3,Elective,Home or Self Care,2019,DIG019,OTHER SPECIFIED AND UNSPECIFIED LIVER DISEASE,HEP004,HEPATOBILIARY RESECTION AND ABLATION,260,"MAJOR PANCREAS, LIVER & SHUNT PROCEDURES",07,DISEASES AND DISORDERS OF THE HEPATOBILIARY SYSTEM AND PANCREAS,1,Minor,Minor,Surgical,Medicaid,,,,,false,139531.21,27090.65
Hudson Valley,Dutchess,1302001,000181,Vassar Brothers Medical Center,50 to 69,125,F,White,Not Span/Hispanic,7,Elective,Home or Self Care,2019,NEO021,GASTROINTESTINAL CANCERS - ALL OTHER TYPES,HEP005,PANCREATECTOMY,260,"MAJOR PANCREAS, LIVER & SHUNT PROCEDURES",07,DISEASES AND DISORDERS OF THE HEPATOBILIARY SYSTEM AND PANCREAS,2,Moderate,Minor,Surgical,"Managed Care, Unspecified",,,,,false,77697.13,39302.25
Capital/Adirond,Albany,0101004,000005,St. Peter's Hospital,50 to 69,121,F,White,Not Span/Hispanic,7,Elective,Home or Self Care,2019,NEO051,ENDOCRINE SYSTEM CANCERS - PANCREAS,GIS005,EXPLORATION OF PERITONEAL CAVITY,260,"MAJOR PANCREAS, LIVER & SHUNT PROCEDURES",07,DISEASES AND DISORDERS OF THE HEPATOBILIARY SYSTEM AND PANCREAS,2,Moderate,Minor,Surgical,Medicare,Private Health Insurance,,,,false,73724.87,30645.97
Finger Lakes,Monroe,2701003,000411,Rochester General Hospital,50 to 69,145,M,White,Not Span/Hispanic,7,Elective,Home w/ Home Health Services,2019,NEO073,BENIGN NEOPLASMS,HEP005,PANCREATECTOMY,260,"MAJOR PANCREAS, LIVER & SHUNT PROCEDURES",07,DISEASES AND DISORDERS OF THE HEPATOBILIARY SYSTEM AND PANCREAS,2,Moderate,Moderate,Surgical,Medicare,,,,,false,33173.97,15506.75
Capital/Adirond,Albany,0101004,000005,St. Peter's Hospital,50 to 69,120,F,White,Not Span/Hispanic,2,Elective,Home or Self Care,2019,NEO070,SECONDARY MALIGNANCIES,HEP004,HEPATOBILIARY RESECTION AND ABLATION,260,"MAJOR PANCREAS, LIVER & SHUNT PROCEDURES",07,DISEASES AND DISORDERS OF THE HEPATOBILIARY SYSTEM AND PANCREAS,1,Minor,Moderate,Surgical,Private Health Insurance,,,,,false,37903.1,14492.91
New York City,Manhattan,7002024,001456,Mount Sinai Hospital,50 to 69,112,F,White,Not Span/Hispanic,6,Elective,Home or Self Care,2019,NEO018,GASTROINTESTINAL CANCERS - BILE DUCT,HEP004,HEPATOBILIARY RESECTION AND ABLATION,260,"MAJOR PANCREAS, LIVER & SHUNT PROCEDURES",07,DISEASES AND DISORDERS OF THE HEPATOBILIARY SYSTEM AND PANCREAS,2,Moderate,Minor,Surgical,Blue Cross/Blue Shield,Self-Pay,,,,false,100673.86,34717.85
Long Island,Suffolk,5151001,000245,Stony Brook University Hospital,70 or Older,119,F,White,Not Span/Hispanic,22,Urgent,Home w/ Home Health Services,2019,NEO019,GASTROINTESTINAL CANCERS - GALLBLADDER,HEP004,HEPATOBILIARY RESECTION AND ABLATION,260,"MAJOR PANCREAS, LIVER & SHUNT PROCEDURES",07,DISEASES AND DISORDERS OF THE HEPATOBILIARY SYSTEM AND PANCREAS,3,Major,Major,Surgical,Medicare,Private Health Insurance,,,,false,249068.05,83317.58
New York City,Manhattan,7002054,001464,New York-Presbyterian Hospital - Columbia Presbyterian Center,18 to 29,128,F,White,Not Span/Hispanic,7,Elective,Home or Self Care,2019,FAC025,OTHER SPECIFIED STATUS,HEP004,HEPATOBILIARY RESECTION AND ABLATION,260,"MAJOR PANCREAS, LIVER & SHUNT PROCEDURES",07,DISEASES AND DISORDERS OF THE HEPATOBILIARY SYSTEM AND PANCREAS,2,Moderate,Moderate,Surgical,Miscellaneous/Other,Self-Pay,,,,false,184328.16,58341.32
New York City,Manhattan,7002054,001464,New York-Presbyterian Hospital - Columbia Presbyterian Center,70 or Older,OOS,F,White,Not Span/Hispanic,3,Elective,Home or Self Care,2019,NEO051,ENDOCRINE SYSTEM CANCERS - PANCREAS,HEP005,PANCREATECTOMY,260,"MAJOR PANCREAS, LIVER & SHUNT PROCEDURES",07,DISEASES AND DISORDERS OF THE HEPATOBILIARY SYSTEM AND PANCREAS,1,Minor,Minor,Surgical,Medicare,Medicare,Self-Pay,,,false,83547.15,22062.68
New York City,Manhattan,7002054,001464,New York-Presbyterian Hospital - Columbia Presbyterian Center,50 to 69,103,F,Other Race,Not Span/Hispanic,6,Elective,Home or Self Care,2019,NEO073,BENIGN NEOPLASMS,HEP005,PANCREATECTOMY,260,"MAJOR PANCREAS, LIVER & SHUNT PROCEDURES",07,DISEASES AND DISORDERS OF THE HEPATOBILIARY SYSTEM AND PANCREAS,2,Moderate,Minor,Surgical,Medicaid,Medicaid,Self-Pay,,,false,88503.51,17330.6
Hudson Valley,Westchester,5957001,001139,Westchester Medical Center,50 to 69,109,M,White,Not Span/Hispanic,4,Elective,Home or Self Care,2019,MAL002,DIGESTIVE CONGENITAL ANOMALIES,HEP004,HEPATOBILIARY RESECTION AND ABLATION,260,"MAJOR PANCREAS, LIVER & SHUNT PROCEDURES",07,DISEASES AND DISORDERS OF THE HEPATOBILIARY SYSTEM AND PANCREAS,1,Minor,Minor,Surgical,Private Health Insurance,,,,,false,125524.52,25542.43
New York City,Bronx,7000006,003058,Montefiore Med Center - Jack D Weiler Hosp of A Einstein College Div,50 to 69,108,F,Other Race,Unknown,10,Elective,Home or Self Care,2019,NEO051,ENDOCRINE SYSTEM CANCERS - PANCREAS,HEP005,PANCREATECTOMY,260,"MAJOR PANCREAS, LIVER & SHUNT PROCEDURES",07,DISEASES AND DISORDERS OF THE HEPATOBILIARY SYSTEM AND PANCREAS,2,Moderate,Minor,Surgical,Medicaid,,,,,false,154327.65,29677.71
Capital/Adirond,Albany,0101004,000005,St. Peter's Hospital,18 to 29,121,M,Black/African American,Not Span/Hispanic,7,Emergency,Home or Self Care,2019,DIG020,PANCREATIC DISORDERS (EXCLUDING DIABETES),HEP002,PANCREATICOBILIARY BIOPSY,260,"MAJOR PANCREAS, LIVER & SHUNT PROCEDURES",07,DISEASES AND DISORDERS OF THE HEPATOBILIARY SYSTEM AND PANCREAS,2,Moderate,Minor,Surgical,Blue Cross/Blue Shield,,,,,true,77306.95,32321.14
New York City,Manhattan,7002054,001464,New York-Presbyterian Hospital - Columbia Presbyterian Center,70 or Older,110,F,White,Not Span/Hispanic,27,Elective,Inpatient Rehabilitation Facility,2019,NEO051,ENDOCRINE SYSTEM CANCERS - PANCREAS,HEP005,PANCREATECTOMY,260,"MAJOR PANCREAS, LIVER & SHUNT PROCEDURES",07,DISEASES AND DISORDERS OF THE HEPATOBILIARY SYSTEM AND PANCREAS,3,Major,Major,Surgical,Medicare,Blue Cross/Blue Shield,Self-Pay,,,false,545816.24,185054.89
New York City,Manhattan,7002054,001464,New York-Presbyterian Hospital - Columbia Presbyterian Center,70 or Older,104,F,Black/African American,Not Span/Hispanic,5,Elective,Home or Self Care,2019,NEO051,ENDOCRINE SYSTEM CANCERS - PANCREAS,HEP005,PANCREATECTOMY,260,"MAJOR PANCREAS, LIVER & SHUNT PROCEDURES",07,DISEASES AND DISORDERS OF THE HEPATOBILIARY SYSTEM AND PANCREAS,2,Moderate,Minor,Surgical,Private Health Insurance,Medicare,Self-Pay,,,false,105002.76,27339.84
New York City,Queens,7003004,001638,Long Island Jewish Forest Hills,70 or Older,112,F,Other Race,Spanish/Hispanic,61,Emergency,Skilled Nursing Home,2019,NEO021,GASTROINTESTINAL CANCERS - ALL OTHER TYPES,HEP005,PANCREATECTOMY,260,"MAJOR PANCREAS, LIVER & SHUNT PROCEDURES",07,DISEASES AND DISORDERS OF THE HEPATOBILIARY SYSTEM AND PANCREAS,4,Extreme,Extreme,Surgical,Medicare,Medicaid,,,,true,885811.48,169956.62
New York City,Manhattan,7002024,001456,Mount Sinai Hospital,30 to 49,OOS,M,White,Not Span/Hispanic,5,Elective,Home or Self Care,2019,FAC025,OTHER SPECIFIED STATUS,HEP004,HEPATOBILIARY RESECTION AND ABLATION,260,"MAJOR PANCREAS, LIVER & SHUNT PROCEDURES",07,DISEASES AND DISORDERS OF THE HEPATOBILIARY SYSTEM AND PANCREAS,3,Major,Moderate,Surgical,Self-Pay,,,,,false,141227.12,38300.28
New York City,Kings,7002053,001304,NYU Langone Hospital-Brooklyn,70 or Older,112,M,White,Not Span/Hispanic,11,Emergency,Home w/ Home Health Services,2019,NEO051,ENDOCRINE SYSTEM CANCERS - PANCREAS,HEP005,PANCREATECTOMY,260,"MAJOR PANCREAS, LIVER & SHUNT PROCEDURES",07,DISEASES AND DISORDERS OF THE HEPATOBILIARY SYSTEM AND PANCREAS,3,Major,Major,Surgical,Medicare,Medicaid,,,,true,226038.23,65741.55
New York City,Manhattan,7002020,001453,Memorial Hospital for Cancer and Allied Diseases,70 or Older,OOS,M,White,Not Span/Hispanic,6,Elective,Home or Self Care,2019,NEO021,GASTROINTESTINAL CANCERS - ALL OTHER TYPES,HEP005,PANCREATECTOMY,260,"MAJOR PANCREAS, LIVER & SHUNT PROCEDURES",07,DISEASES AND DISORDERS OF THE HEPATOBILIARY SYSTEM AND PANCREAS,2,Moderate,Moderate,Surgical,Medicare,,,,,false,85777.45,35015.21
New York City,Manhattan,7002054,001464,New York-Presbyterian Hospital - Columbia Presbyterian Center,70 or Older,100,M,White,Not Span/Hispanic,4,Elective,Home w/ Home Health Services,2019,NEO051,ENDOCRINE SYSTEM CANCERS - PANCREAS,HEP005,PANCREATECTOMY,260,"MAJOR PANCREAS, LIVER & SHUNT PROCEDURES",07,DISEASES AND DISORDERS OF THE HEPATOBILIARY SYSTEM AND PANCREAS,1,Minor,Minor,Surgical,Medicare,Blue Cross/Blue Shield,Self-Pay,,,false,111262.38,42616.33
New York City,Manhattan,7002001,001438,Bellevue Hospital Center,30 to 49,104,F,Other Race,Spanish/Hispanic,6,Elective,Home or Self Care,2019,NEO070,SECONDARY MALIGNANCIES,HEP004,HEPATOBILIARY RESECTION AND ABLATION,260,"MAJOR PANCREAS, LIVER & SHUNT PROCEDURES",07,DISEASES AND DISORDERS OF THE HEPATOBILIARY SYSTEM AND PANCREAS,4,Extreme,Extreme,Surgical,Medicaid,Medicaid,,,,false,44373.11,29490.37
Long Island,Suffolk,5154001,000925,Good Samaritan Hospital Medical Center,70 or Older,117,F,White,Not Span/Hispanic,13,Emergency,Expired,2019,NEO019,GASTROINTESTINAL CANCERS - GALLBLADDER,HEP004,HEPATOBILIARY RESECTION AND ABLATION,260,"MAJOR PANCREAS, LIVER & SHUNT PROCEDURES",07,DISEASES AND DISORDERS OF THE HEPATOBILIARY SYSTEM AND PANCREAS,4,Extreme,Extreme,Surgical,Medicare,Medicaid,,,,true,270182.84,57990.13
Hudson Valley,Westchester,5932000,001129,Phelps Hospital,70 or Older,105,M,White,Not Span/Hispanic,2,Elective,Home or Self Care,2019,NEO051,ENDOCRINE SYSTEM CANCERS - PANCREAS,HEP005,PANCREATECTOMY,260,"MAJOR PANCREAS, LIVER & SHUNT PROCEDURES",07,DISEASES AND DISORDERS OF THE HEPATOBILIARY SYSTEM AND PANCREAS,3,Major,Major,Surgical,Medicare,Private Health Insurance,,,,false,64024.5,14133.58
Capital/Adirond,Albany,0101004,000005,St. Peter's Hospital,50 to 69,120,F,White,Not Span/Hispanic,3,Elective,Home or Self Care,2019,NEO070,SECONDARY MALIGNANCIES,GIS022,GI SYSTEM LYSIS OF ADHESIONS,260,"MAJOR PANCREAS, LIVER & SHUNT PROCEDURES",07,DISEASES AND DISORDERS OF THE HEPATOBILIARY SYSTEM AND PANCREAS,2,Moderate,Moderate,Surgical,Private Health Insurance,,,,,false,53860.1,20604.87
New York City,Richmond,7004003,001740,Staten Island University Hosp-North,30 to 49,103,F,Other Race,Spanish/Hispanic,5,Elective,Home or Self Care,2019,NEO073,BENIGN NEOPLASMS,HEP005,PANCREATECTOMY,260,"MAJOR PANCREAS, LIVER & SHUNT PROCEDURES",07,DISEASES AND DISORDERS OF THE HEPATOBILIARY SYSTEM AND PANCREAS,3,Major,Moderate,Surgical,Medicare,Medicaid,,,,false,105456.28,30047.97
Finger Lakes,Monroe,2701005,000413,Strong Memorial Hospital,70 or Older,144,M,White,Not Span/Hispanic,4,Elective,Home or Self Care,2019,DIG017,BILIARY TRACT DISEASE,HEP004,HEPATOBILIARY RESECTION AND ABLATION,260,"MAJOR PANCREAS, LIVER & SHUNT PROCEDURES",07,DISEASES AND DISORDERS OF THE HEPATOBILIARY SYSTEM AND PANCREAS,2,Moderate,Minor,Surgical,Federal/State/Local/VA,,,,,false,61975.27,32964.53
Finger Lakes,Monroe,2701005,000413,Strong Memorial Hospital,50 to 69,146,F,White,Not Span/Hispanic,8,Elective,Home or Self Care,2019,NEO019,GASTROINTESTINAL CANCERS - GALLBLADDER,HEP006,CHOLECYSTECTOMY,260,"MAJOR PANCREAS, LIVER & SHUNT PROCEDURES",07,DISEASES AND DISORDERS OF THE HEPATOBILIARY SYSTEM AND PANCREAS,1,Minor,Minor,Surgical,Blue Cross/Blue Shield,,,,,false,51603.63,26974.88
Capital/Adirond,Albany,0101004,000005,St. Peter's Hospital,50 to 69,133,M,White,Not Span/Hispanic,6,Elective,Home or Self Care,2019,NEO051,ENDOCRINE SYSTEM CANCERS - PANCREAS,HEP005,PANCREATECTOMY,260,"MAJOR PANCREAS, LIVER & SHUNT PROCEDURES",07,DISEASES AND DISORDERS OF THE HEPATOBILIARY SYSTEM AND PANCREAS,2,Moderate,Minor,Surgical,Blue Cross/Blue Shield,,,,,false,92214.9,35253.13
New York City,Kings,7001021,001306,New York - Presbyterian Brooklyn Methodist Hospital,50 to 69,112,F,Black/African American,Not Span/Hispanic,26,Emergency,Home w/ Home Health Services,2019,NEO017,GASTROINTESTINAL CANCERS - LIVER,HEP005,PANCREATECTOMY,260,"MAJOR PANCREAS, LIVER & SHUNT PROCEDURES",07,DISEASES AND DISORDERS OF THE HEPATOBILIARY SYSTEM AND PANCREAS,3,Major,Major,Surgical,Medicare,Self-Pay,,,,false,274467.7,93443.26
New York City,Bronx,7000006,003058,Montefiore Med Center - Jack D Weiler Hosp of A Einstein College Div,50 to 69,104,F,Black/African American,Not Span/Hispanic,27,Elective,Skilled Nursing Home,2019,NEO051,ENDOCRINE SYSTEM CANCERS - PANCREAS,HEP005,PANCREATECTOMY,260,"MAJOR PANCREAS, LIVER & SHUNT PROCEDURES",07,DISEASES AND DISORDERS OF THE HEPATOBILIARY SYSTEM AND PANCREAS,3,Major,Moderate,Surgical,Medicare,,,,,false,439875.42,86309.33
New York City,Manhattan,7002001,001438,Bellevue Hospital Center,50 to 69,104,M,White,Not Span/Hispanic,34,Emergency,Skilled Nursing Home,2019,NEO017,GASTROINTESTINAL CANCERS - LIVER,HEP004,HEPATOBILIARY RESECTION AND ABLATION,260,"MAJOR PANCREAS, LIVER & SHUNT PROCEDURES",07,DISEASES AND DISORDERS OF THE HEPATOBILIARY SYSTEM AND PANCREAS,4,Extreme,Extreme,Surgical,Private Health Insurance,Medicaid,,,,true,245091.99,162888.14
Hudson Valley,Westchester,5957001,001139,Westchester Medical Center,30 to 49,106,M,Other Race,Unknown,6,Elective,Home or Self Care,2019,END016,OTHER SPECIFIED AND UNSPECIFIED NUTRITIONAL AND METABOLIC DISORDERS,HEP004,HEPATOBILIARY RESECTION AND ABLATION,260,"MAJOR PANCREAS, LIVER & SHUNT PROCEDURES",07,DISEASES AND DISORDERS OF THE HEPATOBILIARY SYSTEM AND PANCREAS,2,Moderate,Minor,Surgical,Medicaid,,,,,false,189177.66,37678.68
New York City,Kings,7001021,001306,New York - Presbyterian Brooklyn Methodist Hospital,30 to 49,112,M,Black/African American,Not Span/Hispanic,14,Emergency,Home w/ Home Health Services,2019,NEO051,ENDOCRINE SYSTEM CANCERS - PANCREAS,HEP005,PANCREATECTOMY,260,"MAJOR PANCREAS, LIVER & SHUNT PROCEDURES",07,DISEASES AND DISORDERS OF THE HEPATOBILIARY SYSTEM AND PANCREAS,2,Moderate,Minor,Surgical,"Managed Care, Unspecified",Medicaid,Self-Pay,,,true,167979.19,55055.69
Southern Tier,Broome,0303001,000058,United Health Services Hospitals Inc. - Wilson Medical Center,50 to 69,134,F,White,Not Span/Hispanic,9,Elective,Home or Self Care,2019,NEO051,ENDOCRINE SYSTEM CANCERS - PANCREAS,HEP005,PANCREATECTOMY,260,"MAJOR PANCREAS, LIVER & SHUNT PROCEDURES",07,DISEASES AND DISORDERS OF THE HEPATOBILIARY SYSTEM AND PANCREAS,3,Major,Moderate,Surgical,Medicaid,Medicaid,,,,false,50966.8,26670.26
New York City,Manhattan,7002032,001466,Mount Sinai West,70 or Older,111,M,Other Race,Not Span/Hispanic,5,Urgent,Home w/ Home Health Services,2019,DIG016,PERITONITIS AND INTRA-ABDOMINAL ABSCESS,HEP004,HEPATOBILIARY RESECTION AND ABLATION,260,"MAJOR PANCREAS, LIVER & SHUNT PROCEDURES",07,DISEASES AND DISORDERS OF THE HEPATOBILIARY SYSTEM AND PANCREAS,2,Moderate,Moderate,Surgical,Medicare,Medicare,Medicaid,,,false,83312.31,22471.4
Finger Lakes,Monroe,2701003,000411,Rochester General Hospital,50 to 69,146,M,White,Not Span/Hispanic,9,Elective,Home or Self Care,2019,NEO073,BENIGN NEOPLASMS,HEP005,PANCREATECTOMY,260,"MAJOR PANCREAS, LIVER & SHUNT PROCEDURES",07,DISEASES AND DISORDERS OF THE HEPATOBILIARY SYSTEM AND PANCREAS,2,Moderate,Minor,Surgical,Medicare,,,,,false,36504.11,16219.03
Capital/Adirond,Albany,0101004,000005,St. Peter's Hospital,70 or Older,121,M,White,Not Span/Hispanic,3,Elective,Home or Self Care,2019,NEO018,GASTROINTESTINAL CANCERS - BILE DUCT,HEP004,HEPATOBILIARY RESECTION AND ABLATION,260,"MAJOR PANCREAS, LIVER & SHUNT PROCEDURES",07,DISEASES AND DISORDERS OF THE HEPATOBILIARY SYSTEM AND PANCREAS,2,Moderate,Moderate,Surgical,Medicare,Private Health Insurance,,,,false,71486.05,24589.28
New York City,Manhattan,7002054,001464,New York-Presbyterian Hospital - Columbia Presbyterian Center,30 to 49,116,M,Other Race,Not Span/Hispanic,6,Elective,Home or Self Care,2019,FAC025,OTHER SPECIFIED STATUS,HEP004,HEPATOBILIARY RESECTION AND ABLATION,260,"MAJOR PANCREAS, LIVER & SHUNT PROCEDURES",07,DISEASES AND DISORDERS OF THE HEPATOBILIARY SYSTEM AND PANCREAS,2,Moderate,Minor,Surgical,Miscellaneous/Other,Self-Pay,,,,false,186759.18,78095.98
New York City,Manhattan,7002054,001464,New York-Presbyterian Hospital - Columbia Presbyterian Center,50 to 69,105,M,White,Not Span/Hispanic,3,Elective,Home or Self Care,2019,NEO073,BENIGN NEOPLASMS,HEP005,PANCREATECTOMY,260,"MAJOR PANCREAS, LIVER & SHUNT PROCEDURES",07,DISEASES AND DISORDERS OF THE HEPATOBILIARY SYSTEM AND PANCREAS,2,Moderate,Moderate,Surgical,Medicare,Medicare,Self-Pay,,,false,74010.27,18103.95
New York City,Manhattan,7002054,001464,New York-Presbyterian Hospital - Columbia Presbyterian Center,30 to 49,OOS,M,White,Not Span/Hispanic,6,Elective,Home or Self Care,2019,NEO051,ENDOCRINE SYSTEM CANCERS - PANCREAS,HEP005,PANCREATECTOMY,260,"MAJOR PANCREAS, LIVER & SHUNT PROCEDURES",07,DISEASES AND DISORDERS OF THE HEPATOBILIARY SYSTEM AND PANCREAS,2,Moderate,Minor,Surgical,Private Health Insurance,Self-Pay,,,,false,128419.99,34591.68
New York City,Manhattan,7002054,001458,New York-Presbyterian Hospital - New York Weill Cornell Center,70 or Older,100,M,White,Not Span/Hispanic,11,Elective,Inpatient Rehabilitation Facility,2019,NEO051,ENDOCRINE SYSTEM CANCERS - PANCREAS,HEP005,PANCREATECTOMY,260,"MAJOR PANCREAS, LIVER & SHUNT PROCEDURES",07,DISEASES AND DISORDERS OF THE HEPATOBILIARY SYSTEM AND PANCREAS,3,Major,Moderate,Surgical,Medicare,Medicaid,Self-Pay,,,false,198078.63,51305.42
New York City,Manhattan,7002024,001456,Mount Sinai Hospital,50 to 69,104,F,Black/African American,Not Span/Hispanic,5,Elective,Home or Self Care,2019,NEO073,BENIGN NEOPLASMS,HEP004,HEPATOBILIARY RESECTION AND ABLATION,260,"MAJOR PANCREAS, LIVER & SHUNT PROCEDURES",07,DISEASES AND DISORDERS OF THE HEPATOBILIARY SYSTEM AND PANCREAS,1,Minor,Minor,Surgical,Medicare,Medicare,Self-Pay,,,false,92793.85,30874.13
Finger Lakes,Monroe,2701005,000413,Strong Memorial Hospital,30 to 49,,F,Other Race,Unknown,7,Elective,Home or Self Care,2019,FAC025,OTHER SPECIFIED STATUS,HEP004,HEPATOBILIARY RESECTION AND ABLATION,260,"MAJOR PANCREAS, LIVER & SHUNT PROCEDURES",07,DISEASES AND DISORDERS OF THE HEPATOBILIARY SYSTEM AND PANCREAS,2,Moderate,Moderate,Surgical,Private Health Insurance,,,,,false,98786.49,47797.93
Central NY,Onondaga,3301007,000635,University Hospital SUNY Health Science Center,50 to 69,130,M,White,Not Span/Hispanic,6,Elective,Home or Self Care,2019,NEO070,SECONDARY MALIGNANCIES,HEP004,HEPATOBILIARY RESECTION AND ABLATION,260,"MAJOR PANCREAS, LIVER & SHUNT PROCEDURES",07,DISEASES AND DISORDERS OF THE HEPATOBILIARY SYSTEM AND PANCREAS,2,Moderate,Moderate,Surgical,Medicaid,,,,,false,162557.87,50130.62
New York City,Manhattan,7002054,001464,New York-Presbyterian Hospital - Columbia Presbyterian Center,50 to 69,115,M,White,Not Span/Hispanic,6,Elective,Home or Self Care,2019,NEO051,ENDOCRINE SYSTEM CANCERS - PANCREAS,HEP005,PANCREATECTOMY,260,"MAJOR PANCREAS, LIVER & SHUNT PROCEDURES",07,DISEASES AND DISORDERS OF THE HEPATOBILIARY SYSTEM AND PANCREAS,1,Minor,Minor,Surgical,Medicare,Private Health Insurance,Self-Pay,,,false,147651.87,49108.02
New York City,Manhattan,7002054,001464,New York-Presbyterian Hospital - Columbia Presbyterian Center,18 to 29,,M,Other Race,Not Span/Hispanic,38,Urgent,Home or Self Care,2019,NEO017,GASTROINTESTINAL CANCERS - LIVER,HEP013,"HEPATOBILIARY AND PANCREATIC PROCEDURES, NEC",260,"MAJOR PANCREAS, LIVER & SHUNT PROCEDURES",07,DISEASES AND DISORDERS OF THE HEPATOBILIARY SYSTEM AND PANCREAS,3,Major,Moderate,Surgical,Private Health Insurance,Self-Pay,,,,false,687795.67,192108.28