Hospital Service Area,Hospital County,Operating Certificate Number,Permanent Facility Id,Facility Name,Age Group,Zip Code - 3 digits,Gender,Race,Ethnicity,Length of Stay,Type of Admission,Patient Disposition,Discharge Year,CCS Diagnosis Code,CCS Diagnosis Description,CCS Procedure Code,CCS Procedure Description,APR DRG Code,APR DRG Description,APR MDC Code,APR MDC Description,APR Severity of Illness Code,APR Severity of Illness Description,APR Risk of Mortality,APR Medical Surgical Description,Payment Typology 1,Payment Typology 2,Payment Typology 3,Birth Weight,Abortion Edit Indicator,Emergency Department Indicator,Total Charges,Total Costs
New York City,Manhattan,7002001,001438,Bellevue Hospital Center,30 to 49,104,M,Black/African American,Not Span/Hispanic,39,Emergency,Home or Self Care,2019,DIG020,PANCREATIC DISORDERS (EXCLUDING DIABETES),HEP010,HEPATOBILIARY AND PANCREATIC DRAINAGE,260,"MAJOR PANCREAS, LIVER & SHUNT PROCEDURES",07,DISEASES AND DISORDERS OF THE HEPATOBILIARY SYSTEM AND PANCREAS,3,Major,Minor,Surgical,Medicaid,,,,,false,193319.3,128480.01
New York City,Manhattan,7002001,001438,Bellevue Hospital Center,30 to 49,104,F,Other Race,Spanish/Hispanic,6,Elective,Home or Self Care,2019,NEO070,SECONDARY MALIGNANCIES,HEP004,HEPATOBILIARY RESECTION AND ABLATION,260,"MAJOR PANCREAS, LIVER & SHUNT PROCEDURES",07,DISEASES AND DISORDERS OF THE HEPATOBILIARY SYSTEM AND PANCREAS,4,Extreme,Extreme,Surgical,Medicaid,Medicaid,,,,false,44373.11,29490.37
New York City,Manhattan,7002001,001438,Bellevue Hospital Center,50 to 69,104,M,White,Not Span/Hispanic,34,Emergency,Skilled Nursing Home,2019,NEO017,GASTROINTESTINAL CANCERS - LIVER,HEP004,HEPATOBILIARY RESECTION AND ABLATION,260,"MAJOR PANCREAS, LIVER & SHUNT PROCEDURES",07,DISEASES AND DISORDERS OF THE HEPATOBILIARY SYSTEM AND PANCREAS,4,Extreme,Extreme,Surgical,Private Health Insurance,Medicaid,,,,true,245091.99,162888.14
New York City,Manhattan,7002001,001438,Bellevue Hospital Center,30 to 49,113,F,Other Race,Spanish/Hispanic,5,Emergency,Home or Self Care,2019,NEO070,SECONDARY MALIGNANCIES,HEP004,HEPATOBILIARY RESECTION AND ABLATION,260,"MAJOR PANCREAS, LIVER & SHUNT PROCEDURES",07,DISEASES AND DISORDERS OF THE HEPATOBILIARY SYSTEM AND PANCREAS,2,Moderate,Moderate,Surgical,Medicaid,,,,,false,35923.35,23874.66
New York City,Manhattan,7002001,001438,Bellevue Hospital Center,50 to 69,112,M,Other Race,Spanish/Hispanic,18,Emergency,Home or Self Care,2019,NEO018,GASTROINTESTINAL CANCERS - BILE DUCT,HEP005,PANCREATECTOMY,260,"MAJOR PANCREAS, LIVER & SHUNT PROCEDURES",07,DISEASES AND DISORDERS OF THE HEPATOBILIARY SYSTEM AND PANCREAS,4,Extreme,Extreme,Surgical,Private Health Insurance,,,,,true,121440.67,80709.47
New York City,Manhattan,7002001,001438,Bellevue Hospital Center,50 to 69,104,F,Other Race,Spanish/Hispanic,6,Elective,Home or Self Care,2019,NEO051,ENDOCRINE SYSTEM CANCERS - PANCREAS,HEP005,PANCREATECTOMY,260,"MAJOR PANCREAS, LIVER & SHUNT PROCEDURES",07,DISEASES AND DISORDERS OF THE HEPATOBILIARY SYSTEM AND PANCREAS,1,Minor,Minor,Surgical,Private Health Insurance,,,,,false,44753.63,29743.26
New York City,Manhattan,7002001,001438,Bellevue Hospital Center,50 to 69,114,F,Other Race,Spanish/Hispanic,4,Elective,Home or Self Care,2019,NEO073,BENIGN NEOPLASMS,HEP005,PANCREATECTOMY,260,"MAJOR PANCREAS, LIVER & SHUNT PROCEDURES",07,DISEASES AND DISORDERS OF THE HEPATOBILIARY SYSTEM AND PANCREAS,2,Moderate,Minor,Surgical,Self-Pay,,,,,false,65986.38,43854.55
New York City,Manhattan,7002001,001438,Bellevue Hospital Center,70 or Older,111,F,Other Race,Spanish/Hispanic,14,Elective,Expired,2019,NEO018,GASTROINTESTINAL CANCERS - BILE DUCT,HEP004,HEPATOBILIARY RESECTION AND ABLATION,260,"MAJOR PANCREAS, LIVER & SHUNT PROCEDURES",07,DISEASES AND DISORDERS OF THE HEPATOBILIARY SYSTEM AND PANCREAS,4,Extreme,Extreme,Surgical,Medicare,,,,,false,252666.58,167922.21
New York City,Manhattan,7002001,001438,Bellevue Hospital Center,50 to 69,100,M,Black/African American,Unknown,7,Elective,Home or Self Care,2019,NEO017,GASTROINTESTINAL CANCERS - LIVER,HEP004,HEPATOBILIARY RESECTION AND ABLATION,260,"MAJOR PANCREAS, LIVER & SHUNT PROCEDURES",07,DISEASES AND DISORDERS OF THE HEPATOBILIARY SYSTEM AND PANCREAS,3,Major,Moderate,Surgical,Medicaid,,,,,false,99599.34,66193.72
New York City,Manhattan,7002001,001438,Bellevue Hospital Center,30 to 49,111,M,Other Race,Spanish/Hispanic,9,Elective,Home w/ Home Health Services,2019,NEO021,GASTROINTESTINAL CANCERS - ALL OTHER TYPES,HEP005,PANCREATECTOMY,260,"MAJOR PANCREAS, LIVER & SHUNT PROCEDURES",07,DISEASES AND DISORDERS OF THE HEPATOBILIARY SYSTEM AND PANCREAS,3,Major,Major,Surgical,Private Health Insurance,,,,,false,149929.76,99643.32
New York City,Manhattan,7002001,001438,Bellevue Hospital Center,18 to 29,112,F,Other Race,Spanish/Hispanic,3,Elective,Home or Self Care,2019,NEO073,BENIGN NEOPLASMS,HEP005,PANCREATECTOMY,260,"MAJOR PANCREAS, LIVER & SHUNT PROCEDURES",07,DISEASES AND DISORDERS OF THE HEPATOBILIARY SYSTEM AND PANCREAS,3,Major,Minor,Surgical,Private Health Insurance,Medicaid,,,,false,53938.89,35847.79
New York City,Manhattan,7002001,001438,Bellevue Hospital Center,30 to 49,113,F,Other Race,Spanish/Hispanic,5,Elective,Home or Self Care,2019,NEO051,ENDOCRINE SYSTEM CANCERS - PANCREAS,HEP005,PANCREATECTOMY,260,"MAJOR PANCREAS, LIVER & SHUNT PROCEDURES",07,DISEASES AND DISORDERS OF THE HEPATOBILIARY SYSTEM AND PANCREAS,2,Moderate,Minor,Surgical,Medicaid,,,,,false,72396.65,48114.81
New York City,Manhattan,7002001,001438,Bellevue Hospital Center,30 to 49,100,F,Other Race,Not Span/Hispanic,7,Emergency,Home or Self Care,2019,DIG020,PANCREATIC DISORDERS (EXCLUDING DIABETES),HEP006,CHOLECYSTECTOMY,260,"MAJOR PANCREAS, LIVER & SHUNT PROCEDURES",07,DISEASES AND DISORDERS OF THE HEPATOBILIARY SYSTEM AND PANCREAS,3,Major,Minor,Surgical,Private Health Insurance,,,,,true,97465.1,64775.31
New York City,Manhattan,7002001,001438,Bellevue Hospital Center,30 to 49,114,F,Other Race,Spanish/Hispanic,17,Emergency,Home or Self Care,2019,DIG020,PANCREATIC DISORDERS (EXCLUDING DIABETES),HEP010,HEPATOBILIARY AND PANCREATIC DRAINAGE,260,"MAJOR PANCREAS, LIVER & SHUNT PROCEDURES",07,DISEASES AND DISORDERS OF THE HEPATOBILIARY SYSTEM AND PANCREAS,2,Moderate,Minor,Surgical,Medicaid,,,,,true,150671.78,100136.46
New York City,Manhattan,7002001,001438,Bellevue Hospital Center,50 to 69,112,M,Other Race,Not Span/Hispanic,12,Elective,Home or Self Care,2019,NEO017,GASTROINTESTINAL CANCERS - LIVER,HEP004,HEPATOBILIARY RESECTION AND ABLATION,260,"MAJOR PANCREAS, LIVER & SHUNT PROCEDURES",07,DISEASES AND DISORDERS OF THE HEPATOBILIARY SYSTEM AND PANCREAS,3,Major,Minor,Surgical,Self-Pay,,,,,false,149669.84,99470.58
New York City,Manhattan,7002001,001438,Bellevue Hospital Center,18 to 29,104,M,Other Race,Spanish/Hispanic,10,Emergency,Home w/ Home Health Services,2019,INJ010,"INTERNAL ORGAN INJURY, INITIAL ENCOUNTER",HEP013,"HEPATOBILIARY AND PANCREATIC PROCEDURES, NEC",260,"MAJOR PANCREAS, LIVER & SHUNT PROCEDURES",07,DISEASES AND DISORDERS OF THE HEPATOBILIARY SYSTEM AND PANCREAS,3,Major,Moderate,Surgical,Private Health Insurance,,,,,true,103234.14,68609.41
New York City,Manhattan,7002001,001438,Bellevue Hospital Center,30 to 49,OOS,M,Multi-racial,Not Span/Hispanic,69,Urgent,Home or Self Care,2019,DIG020,PANCREATIC DISORDERS (EXCLUDING DIABETES),GNR009,"RETROPERITONEAL PROCEDURES, NEC",260,"MAJOR PANCREAS, LIVER & SHUNT PROCEDURES",07,DISEASES AND DISORDERS OF THE HEPATOBILIARY SYSTEM AND PANCREAS,4,Extreme,Extreme,Surgical,Medicaid,,,,,false,442165.65,293863.29
New York City,Manhattan,7002001,001438,Bellevue Hospital Center,50 to 69,113,M,Other Race,Unknown,72,Emergency,Court/Law Enforcement,2019,NEO051,ENDOCRINE SYSTEM CANCERS - PANCREAS,HEP005,PANCREATECTOMY,260,"MAJOR PANCREAS, LIVER & SHUNT PROCEDURES",07,DISEASES AND DISORDERS OF THE HEPATOBILIARY SYSTEM AND PANCREAS,4,Extreme,Extreme,Surgical,Medicaid,,,,,true,599277.04,398279.52
New York City,Manhattan,7002001,001438,Bellevue Hospital Center,50 to 69,113,M,Other Race,Not Span/Hispanic,10,Elective,Home or Self Care,2019,NEO018,GASTROINTESTINAL CANCERS - BILE DUCT,HEP004,HEPATOBILIARY RESECTION AND ABLATION,260,"MAJOR PANCREAS, LIVER & SHUNT PROCEDURES",07,DISEASES AND DISORDERS OF THE HEPATOBILIARY SYSTEM AND PANCREAS,3,Major,Moderate,Surgical,Medicaid,,,,,false,166253.95,110492.38
New York City,Manhattan,7002001,001438,Bellevue Hospital Center,18 to 29,113,F,Other Race,Unknown,8,Elective,Home or Self Care,2019,NEO073,BENIGN NEOPLASMS,HEP005,PANCREATECTOMY,260,"MAJOR PANCREAS, LIVER & SHUNT PROCEDURES",07,DISEASES AND DISORDERS OF THE HEPATOBILIARY SYSTEM AND PANCREAS,3,Major,Minor,Surgical,Medicaid,,,,,false,106710.7,70919.93
New York City,Manhattan,7002001,001438,Bellevue Hospital Center,30 to 49,113,F,Other Race,Spanish/Hispanic,11,Elective,Home or Self Care,2019,NEO070,SECONDARY MALIGNANCIES,HEP004,HEPATOBILIARY RESECTION AND ABLATION,260,"MAJOR PANCREAS, LIVER & SHUNT PROCEDURES",07,DISEASES AND DISORDERS OF THE HEPATOBILIARY SYSTEM AND PANCREAS,4,Extreme,Extreme,Surgical,Self-Pay,,,,,false,183686.61,122078.12
New York City,Manhattan,7002001,001438,Bellevue Hospital Center,50 to 69,100,F,Other Race,Spanish/Hispanic,6,Elective,Home or Self Care,2019,NEO070,SECONDARY MALIGNANCIES,HEP004,HEPATOBILIARY RESECTION AND ABLATION,260,"MAJOR PANCREAS, LIVER & SHUNT PROCEDURES",07,DISEASES AND DISORDERS OF THE HEPATOBILIARY SYSTEM AND PANCREAS,3,Major,Major,Surgical,Medicaid,,,,,false,118048.87,78455.28
New York City,Manhattan,7002001,001438,Bellevue Hospital Center,30 to 49,100,M,Other Race,Not Span/Hispanic,3,Elective,Home or Self Care,2019,NEO017,GASTROINTESTINAL CANCERS - LIVER,HEP004,HEPATOBILIARY RESECTION AND ABLATION,260,"MAJOR PANCREAS, LIVER & SHUNT PROCEDURES",07,DISEASES AND DISORDERS OF THE HEPATOBILIARY SYSTEM AND PANCREAS,2,Moderate,Minor,Surgical,Medicaid,,,,,false,42948.69,28543.7
