Hospital Service Area,Hospital County,Operating Certificate Number,Permanent Facility Id,Facility Name,Age Group,Zip Code - 3 digits,Gender,Race,Ethnicity,Length of Stay,Type of Admission,Patient Disposition,Discharge Year,CCS Diagnosis Code,CCS Diagnosis Description,CCS Procedure Code,CCS Procedure Description,APR DRG Code,APR DRG Description,APR MDC Code,APR MDC Description,APR Severity of Illness Code,APR Severity of Illness Description,APR Risk of Mortality,APR Medical Surgical Description,Payment Typology 1,Payment Typology 2,Payment Typology 3,Birth Weight,Abortion Edit Indicator,Emergency Department Indicator,Total Charges,Total Costs
New York City,Manhattan,7002053,001463,NYU Langone Hospitals,50 to 69,104,F,Other Race,Not Span/Hispanic,6,Elective,Home or Self Care,2020,NEO018,GASTROINTESTINAL CANCERS - BILE DUCT,HEP004,HEPATOBILIARY RESECTION AND ABLATION,260,"MAJOR PANCREAS, LIVER & SHUNT PROCEDURES",07,DISEASES AND DISORDERS OF THE HEPATOBILIARY SYSTEM AND PANCREAS,2,Moderate,Moderate,Surgical,Blue Cross/Blue Shield,,,,,N,248817.29,45626.14
New York City,Manhattan,7002053,001463,NYU Langone Hospitals,50 to 69,100,M,White,Not Span/Hispanic,7,Elective,Home w/ Home Health Services,2020,NEO017,GASTROINTESTINAL CANCERS - LIVER,HEP004,HEPATOBILIARY RESECTION AND ABLATION,260,"MAJOR PANCREAS, LIVER & SHUNT PROCEDURES",07,DISEASES AND DISORDERS OF THE HEPATOBILIARY SYSTEM AND PANCREAS,3,Major,Moderate,Surgical,Private Health Insurance,Private Health Insurance,,,,N,306268.31,54809.8
New York City,Manhattan,7002053,001463,NYU Langone Hospitals,70 or Older,100,F,White,Not Span/Hispanic,6,Elective,Home or Self Care,2020,NEO017,GASTROINTESTINAL CANCERS - LIVER,HEP004,HEPATOBILIARY RESECTION AND ABLATION,260,"MAJOR PANCREAS, LIVER & SHUNT PROCEDURES",07,DISEASES AND DISORDERS OF THE HEPATOBILIARY SYSTEM AND PANCREAS,2,Moderate,Minor,Surgical,Medicare,Medicare,,,,N,312239.21,52793.5
New York City,Manhattan,7002053,001463,NYU Langone Hospitals,30 to 49,OOS,F,White,Not Span/Hispanic,9,Elective,Home or Self Care,2020,NEO017,GASTROINTESTINAL CANCERS - LIVER,HEP004,HEPATOBILIARY RESECTION AND ABLATION,260,"MAJOR PANCREAS, LIVER & SHUNT PROCEDURES",07,DISEASES AND DISORDERS OF THE HEPATOBILIARY SYSTEM AND PANCREAS,2,Moderate,Moderate,Surgical,Private Health Insurance,,,,,N,248370.85,51526.59
New York City,Manhattan,7002053,001463,NYU Langone Hospitals,50 to 69,103,M,White,Not Span/Hispanic,7,Elective,Home w/ Home Health Services,2020,NEO051,ENDOCRINE SYSTEM CANCERS - PANCREAS,HEP005,PANCREATECTOMY,260,"MAJOR PANCREAS, LIVER & SHUNT PROCEDURES",07,DISEASES AND DISORDERS OF THE HEPATOBILIARY SYSTEM AND PANCREAS,2,Moderate,Minor,Surgical,Private Health Insurance,,,,,N,264359.72,48124.7
New York City,Manhattan,7002053,001463,NYU Langone Hospitals,50 to 69,100,M,Black/African American,Not Span/Hispanic,7,Elective,Home w/ Home Health Services,2020,NEO051,ENDOCRINE SYSTEM CANCERS - PANCREAS,HEP005,PANCREATECTOMY,260,"MAJOR PANCREAS, LIVER & SHUNT PROCEDURES",07,DISEASES AND DISORDERS OF THE HEPATOBILIARY SYSTEM AND PANCREAS,1,Minor,Minor,Surgical,Private Health Insurance,Blue Cross/Blue Shield,,,,N,213986.31,41610.16
New York City,Manhattan,7002053,001463,NYU Langone Hospitals,50 to 69,OOS,F,Other Race,Spanish/Hispanic,7,Elective,Home or Self Care,2020,NEO018,GASTROINTESTINAL CANCERS - BILE DUCT,HEP004,HEPATOBILIARY RESECTION AND ABLATION,260,"MAJOR PANCREAS, LIVER & SHUNT PROCEDURES",07,DISEASES AND DISORDERS OF THE HEPATOBILIARY SYSTEM AND PANCREAS,4,Extreme,Extreme,Surgical,Medicaid,,,,,N,254128.06,46309.4
New York City,Manhattan,7002053,001463,NYU Langone Hospitals,50 to 69,103,F,White,Not Span/Hispanic,4,Elective,Home or Self Care,2020,NEO019,GASTROINTESTINAL CANCERS - GALLBLADDER,HEP004,HEPATOBILIARY RESECTION AND ABLATION,260,"MAJOR PANCREAS, LIVER & SHUNT PROCEDURES",07,DISEASES AND DISORDERS OF THE HEPATOBILIARY SYSTEM AND PANCREAS,3,Major,Major,Surgical,Blue Cross/Blue Shield,,,,,N,126511.84,24399.34
New York City,Manhattan,7002053,001463,NYU Langone Hospitals,70 or Older,116,F,White,Not Span/Hispanic,5,Elective,Skilled Nursing Home,2020,NEO073,BENIGN NEOPLASMS,HEP005,PANCREATECTOMY,260,"MAJOR PANCREAS, LIVER & SHUNT PROCEDURES",07,DISEASES AND DISORDERS OF THE HEPATOBILIARY SYSTEM AND PANCREAS,3,Major,Moderate,Surgical,Medicare,Medicaid,,,,N,139480.87,27938.93
New York City,Manhattan,7002053,001463,NYU Langone Hospitals,70 or Older,100,M,White,Not Span/Hispanic,4,Elective,Home w/ Home Health Services,2020,NEO051,ENDOCRINE SYSTEM CANCERS - PANCREAS,HEP005,PANCREATECTOMY,260,"MAJOR PANCREAS, LIVER & SHUNT PROCEDURES",07,DISEASES AND DISORDERS OF THE HEPATOBILIARY SYSTEM AND PANCREAS,2,Moderate,Minor,Surgical,Private Health Insurance,Medicaid,,,,N,190305.65,32549.23
New York City,Manhattan,7002053,001463,NYU Langone Hospitals,50 to 69,131,M,White,Not Span/Hispanic,8,Elective,Home or Self Care,2020,NEO073,BENIGN NEOPLASMS,HEP005,PANCREATECTOMY,260,"MAJOR PANCREAS, LIVER & SHUNT PROCEDURES",07,DISEASES AND DISORDERS OF THE HEPATOBILIARY SYSTEM AND PANCREAS,3,Major,Extreme,Surgical,Blue Cross/Blue Shield,,,,,N,288887.88,54878.59
New York City,Manhattan,7002053,001463,NYU Langone Hospitals,30 to 49,112,M,White,Not Span/Hispanic,8,Elective,Home w/ Home Health Services,2020,NEO017,GASTROINTESTINAL CANCERS - LIVER,HEP004,HEPATOBILIARY RESECTION AND ABLATION,260,"MAJOR PANCREAS, LIVER & SHUNT PROCEDURES",07,DISEASES AND DISORDERS OF THE HEPATOBILIARY SYSTEM AND PANCREAS,1,Minor,Moderate,Surgical,Private Health Insurance,,,,,N,415806.65,72787.94
New York City,Manhattan,7002053,001463,NYU Langone Hospitals,70 or Older,112,F,White,Not Span/Hispanic,6,Elective,Home w/ Home Health Services,2020,NEO051,ENDOCRINE SYSTEM CANCERS - PANCREAS,HEP005,PANCREATECTOMY,260,"MAJOR PANCREAS, LIVER & SHUNT PROCEDURES",07,DISEASES AND DISORDERS OF THE HEPATOBILIARY SYSTEM AND PANCREAS,2,Moderate,Moderate,Surgical,Medicare,Blue Cross/Blue Shield,,,,N,226426.03,43074.89
New York City,Manhattan,7002053,001463,NYU Langone Hospitals,70 or Older,112,F,White,Not Span/Hispanic,6,Elective,Home w/ Home Health Services,2020,NEO051,ENDOCRINE SYSTEM CANCERS - PANCREAS,HEP005,PANCREATECTOMY,260,"MAJOR PANCREAS, LIVER & SHUNT PROCEDURES",07,DISEASES AND DISORDERS OF THE HEPATOBILIARY SYSTEM AND PANCREAS,2,Moderate,Minor,Surgical,Medicare,Medicare,,,,N,247356.14,45613.45
New York City,Manhattan,7002053,001463,NYU Langone Hospitals,50 to 69,100,F,White,Not Span/Hispanic,5,Elective,Home or Self Care,2020,NEO070,SECONDARY MALIGNANCIES,HEP004,HEPATOBILIARY RESECTION AND ABLATION,260,"MAJOR PANCREAS, LIVER & SHUNT PROCEDURES",07,DISEASES AND DISORDERS OF THE HEPATOBILIARY SYSTEM AND PANCREAS,2,Moderate,Minor,Surgical,Medicaid,,,,,N,241348.64,42979.62
New York City,Manhattan,7002053,001463,NYU Langone Hospitals,30 to 49,115,F,White,Not Span/Hispanic,7,Elective,Home or Self Care,2020,NEO073,BENIGN NEOPLASMS,HEP004,HEPATOBILIARY RESECTION AND ABLATION,260,"MAJOR PANCREAS, LIVER & SHUNT PROCEDURES",07,DISEASES AND DISORDERS OF THE HEPATOBILIARY SYSTEM AND PANCREAS,2,Moderate,Moderate,Surgical,Private Health Insurance,,,,,N,314270.43,57750.33
New York City,Manhattan,7002053,001463,NYU Langone Hospitals,30 to 49,112,F,White,Not Span/Hispanic,5,Elective,Home or Self Care,2020,NEO073,BENIGN NEOPLASMS,HEP005,PANCREATECTOMY,260,"MAJOR PANCREAS, LIVER & SHUNT PROCEDURES",07,DISEASES AND DISORDERS OF THE HEPATOBILIARY SYSTEM AND PANCREAS,1,Minor,Minor,Surgical,Blue Cross/Blue Shield,,,,,N,240760.6,42912.56
New York City,Manhattan,7002053,001463,NYU Langone Hospitals,50 to 69,114,M,Other Race,Spanish/Hispanic,7,Elective,Home w/ Home Health Services,2020,NEO018,GASTROINTESTINAL CANCERS - BILE DUCT,HEP005,PANCREATECTOMY,260,"MAJOR PANCREAS, LIVER & SHUNT PROCEDURES",07,DISEASES AND DISORDERS OF THE HEPATOBILIARY SYSTEM AND PANCREAS,3,Major,Moderate,Surgical,Medicaid,,,,,N,203753.06,42310.21
New York City,Manhattan,7002053,001463,NYU Langone Hospitals,50 to 69,117,M,White,Not Span/Hispanic,11,Emergency,Home or Self Care,2020,NEO051,ENDOCRINE SYSTEM CANCERS - PANCREAS,HEP005,PANCREATECTOMY,260,"MAJOR PANCREAS, LIVER & SHUNT PROCEDURES",07,DISEASES AND DISORDERS OF THE HEPATOBILIARY SYSTEM AND PANCREAS,3,Major,Moderate,Surgical,Blue Cross/Blue Shield,,,,,N,360427.93,73071.01
New York City,Manhattan,7002053,001463,NYU Langone Hospitals,70 or Older,OOS,F,White,Not Span/Hispanic,5,Elective,Home w/ Home Health Services,2020,NEO018,GASTROINTESTINAL CANCERS - BILE DUCT,HEP004,HEPATOBILIARY RESECTION AND ABLATION,260,"MAJOR PANCREAS, LIVER & SHUNT PROCEDURES",07,DISEASES AND DISORDERS OF THE HEPATOBILIARY SYSTEM AND PANCREAS,2,Moderate,Moderate,Surgical,Medicare,Medicare,,,,N,263074.08,48758.89
New York City,Manhattan,7002053,001463,NYU Langone Hospitals,70 or Older,103,F,White,Not Span/Hispanic,6,Elective,Home w/ Home Health Services,2020,NEO051,ENDOCRINE SYSTEM CANCERS - PANCREAS,GIS005,EXPLORATION OF PERITONEAL CAVITY,260,"MAJOR PANCREAS, LIVER & SHUNT PROCEDURES",07,DISEASES AND DISORDERS OF THE HEPATOBILIARY SYSTEM AND PANCREAS,3,Major,Major,Surgical,Medicare,,,,,N,197409.88,37639.39
New York City,Manhattan,7002053,001463,NYU Langone Hospitals,70 or Older,112,M,White,Not Span/Hispanic,4,Emergency,Home or Self Care,2020,DIG017,BILIARY TRACT DISEASE,HEP007,BILIARY AND PANCREATIC CALCULUS REMOVAL,260,"MAJOR PANCREAS, LIVER & SHUNT PROCEDURES",07,DISEASES AND DISORDERS OF THE HEPATOBILIARY SYSTEM AND PANCREAS,2,Moderate,Moderate,Surgical,Medicare,,,,,Y,181562.58,30970.04
New York City,Manhattan,7002053,001463,NYU Langone Hospitals,70 or Older,OOS,M,Other Race,Not Span/Hispanic,5,Elective,Home or Self Care,2020,NEO017,GASTROINTESTINAL CANCERS - LIVER,HEP004,HEPATOBILIARY RESECTION AND ABLATION,260,"MAJOR PANCREAS, LIVER & SHUNT PROCEDURES",07,DISEASES AND DISORDERS OF THE HEPATOBILIARY SYSTEM AND PANCREAS,1,Minor,Minor,Surgical,Medicare,,,,,N,195234.96,35921.35
New York City,Manhattan,7002053,001463,NYU Langone Hospitals,30 to 49,OOS,F,White,Not Span/Hispanic,6,Elective,Home or Self Care,2020,FAC025,OTHER SPECIFIED STATUS,HEP004,HEPATOBILIARY RESECTION AND ABLATION,260,"MAJOR PANCREAS, LIVER & SHUNT PROCEDURES",07,DISEASES AND DISORDERS OF THE HEPATOBILIARY SYSTEM AND PANCREAS,2,Moderate,Minor,Surgical,Self-Pay,,,,,N,487199.3,80639.76
New York City,Manhattan,7002053,001463,NYU Langone Hospitals,50 to 69,113,F,White,Not Span/Hispanic,5,Elective,Home w/ Home Health Services,2020,NEO070,SECONDARY MALIGNANCIES,HEP006,CHOLECYSTECTOMY,260,"MAJOR PANCREAS, LIVER & SHUNT PROCEDURES",07,DISEASES AND DISORDERS OF THE HEPATOBILIARY SYSTEM AND PANCREAS,2,Moderate,Minor,Surgical,Blue Cross/Blue Shield,,,,,N,229529.07,41234.03
New York City,Manhattan,7002053,001463,NYU Langone Hospitals,70 or Older,112,M,Other Race,Spanish/Hispanic,31,Elective,Skilled Nursing Home,2020,NEO019,GASTROINTESTINAL CANCERS - GALLBLADDER,HEP004,HEPATOBILIARY RESECTION AND ABLATION,260,"MAJOR PANCREAS, LIVER & SHUNT PROCEDURES",07,DISEASES AND DISORDERS OF THE HEPATOBILIARY SYSTEM AND PANCREAS,4,Extreme,Extreme,Surgical,Medicare,,,,,N,772884.09,187034.22
New York City,Manhattan,7002053,001463,NYU Langone Hospitals,70 or Older,113,M,White,Not Span/Hispanic,8,Elective,Home w/ Home Health Services,2020,NEO070,SECONDARY MALIGNANCIES,HEP004,HEPATOBILIARY RESECTION AND ABLATION,260,"MAJOR PANCREAS, LIVER & SHUNT PROCEDURES",07,DISEASES AND DISORDERS OF THE HEPATOBILIARY SYSTEM AND PANCREAS,3,Major,Moderate,Surgical,Medicare,,,,,N,291636.13,53621.72
New York City,Manhattan,7002053,001463,NYU Langone Hospitals,70 or Older,OOS,F,White,Not Span/Hispanic,6,Elective,Home w/ Home Health Services,2020,NEO051,ENDOCRINE SYSTEM CANCERS - PANCREAS,HEP005,PANCREATECTOMY,260,"MAJOR PANCREAS, LIVER & SHUNT PROCEDURES",07,DISEASES AND DISORDERS OF THE HEPATOBILIARY SYSTEM AND PANCREAS,2,Moderate,Minor,Surgical,Medicare,,,,,N,210901.5,39980.88
New York City,Manhattan,7002053,001463,NYU Langone Hospitals,50 to 69,112,F,Black/African American,Not Span/Hispanic,2,Elective,Home or Self Care,2020,NEO017,GASTROINTESTINAL CANCERS - LIVER,HEP004,HEPATOBILIARY RESECTION AND ABLATION,260,"MAJOR PANCREAS, LIVER & SHUNT PROCEDURES",07,DISEASES AND DISORDERS OF THE HEPATOBILIARY SYSTEM AND PANCREAS,2,Moderate,Minor,Surgical,Private Health Insurance,,,,,N,119342.12,20117.54
New York City,Manhattan,7002053,001463,NYU Langone Hospitals,70 or Older,100,F,Other Race,Not Span/Hispanic,10,Elective,Home w/ Home Health Services,2020,NEO070,SECONDARY MALIGNANCIES,HEP004,HEPATOBILIARY RESECTION AND ABLATION,260,"MAJOR PANCREAS, LIVER & SHUNT PROCEDURES",07,DISEASES AND DISORDERS OF THE HEPATOBILIARY SYSTEM AND PANCREAS,3,Major,Major,Surgical,Private Health Insurance,,,,,N,484172.41,90695.65
New York City,Manhattan,7002053,001463,NYU Langone Hospitals,30 to 49,103,M,White,Not Span/Hispanic,7,Elective,Home or Self Care,2020,NEO051,ENDOCRINE SYSTEM CANCERS - PANCREAS,HEP005,PANCREATECTOMY,260,"MAJOR PANCREAS, LIVER & SHUNT PROCEDURES",07,DISEASES AND DISORDERS OF THE HEPATOBILIARY SYSTEM AND PANCREAS,3,Major,Moderate,Surgical,Blue Cross/Blue Shield,Private Health Insurance,,,,N,325932.07,58157.87
New York City,Manhattan,7002053,001463,NYU Langone Hospitals,50 to 69,112,M,Other Race,Not Span/Hispanic,8,Elective,Home w/ Home Health Services,2020,NEO051,ENDOCRINE SYSTEM CANCERS - PANCREAS,HEP005,PANCREATECTOMY,260,"MAJOR PANCREAS, LIVER & SHUNT PROCEDURES",07,DISEASES AND DISORDERS OF THE HEPATOBILIARY SYSTEM AND PANCREAS,3,Major,Major,Surgical,Blue Cross/Blue Shield,,,,,N,270758.99,52501.15
New York City,Manhattan,7002053,001463,NYU Langone Hospitals,70 or Older,117,M,White,Not Span/Hispanic,5,Elective,Home or Self Care,2020,NEO070,SECONDARY MALIGNANCIES,HEP004,HEPATOBILIARY RESECTION AND ABLATION,260,"MAJOR PANCREAS, LIVER & SHUNT PROCEDURES",07,DISEASES AND DISORDERS OF THE HEPATOBILIARY SYSTEM AND PANCREAS,1,Minor,Moderate,Surgical,Medicare,Medicare,,,,N,236327.82,41805.62
New York City,Manhattan,7002053,001463,NYU Langone Hospitals,50 to 69,112,F,White,Not Span/Hispanic,7,Elective,Home w/ Home Health Services,2020,NEO051,ENDOCRINE SYSTEM CANCERS - PANCREAS,HEP005,PANCREATECTOMY,260,"MAJOR PANCREAS, LIVER & SHUNT PROCEDURES",07,DISEASES AND DISORDERS OF THE HEPATOBILIARY SYSTEM AND PANCREAS,2,Moderate,Moderate,Surgical,Private Health Insurance,Medicare,,,,N,220287.06,43348.98
New York City,Manhattan,7002053,001463,NYU Langone Hospitals,70 or Older,100,M,White,Not Span/Hispanic,12,Elective,Home or Self Care,2020,NEO051,ENDOCRINE SYSTEM CANCERS - PANCREAS,GIS022,GI SYSTEM LYSIS OF ADHESIONS,260,"MAJOR PANCREAS, LIVER & SHUNT PROCEDURES",07,DISEASES AND DISORDERS OF THE HEPATOBILIARY SYSTEM AND PANCREAS,2,Moderate,Moderate,Surgical,Medicare,Medicare,,,,N,378751.59,74604.9
New York City,Manhattan,7002053,001463,NYU Langone Hospitals,50 to 69,112,M,Other Race,Unknown,4,Elective,Home w/ Home Health Services,2020,NEO017,GASTROINTESTINAL CANCERS - LIVER,HEP004,HEPATOBILIARY RESECTION AND ABLATION,260,"MAJOR PANCREAS, LIVER & SHUNT PROCEDURES",07,DISEASES AND DISORDERS OF THE HEPATOBILIARY SYSTEM AND PANCREAS,2,Moderate,Moderate,Surgical,Medicaid,,,,,N,264134.2,43411.01
New York City,Manhattan,7002053,001463,NYU Langone Hospitals,50 to 69,125,M,Other Race,Not Span/Hispanic,6,Elective,Home or Self Care,2020,NEO051,ENDOCRINE SYSTEM CANCERS - PANCREAS,HEP005,PANCREATECTOMY,260,"MAJOR PANCREAS, LIVER & SHUNT PROCEDURES",07,DISEASES AND DISORDERS OF THE HEPATOBILIARY SYSTEM AND PANCREAS,2,Moderate,Moderate,Surgical,Medicare,Blue Cross/Blue Shield,,,,N,215807.73,40904.02
New York City,Manhattan,7002053,001463,NYU Langone Hospitals,70 or Older,117,M,Other Race,Not Span/Hispanic,10,Elective,Home w/ Home Health Services,2020,NEO017,GASTROINTESTINAL CANCERS - LIVER,HEP004,HEPATOBILIARY RESECTION AND ABLATION,260,"MAJOR PANCREAS, LIVER & SHUNT PROCEDURES",07,DISEASES AND DISORDERS OF THE HEPATOBILIARY SYSTEM AND PANCREAS,4,Extreme,Major,Surgical,Medicare,Medicare,,,,N,342803.76,64927.31
New York City,Manhattan,7002053,001463,NYU Langone Hospitals,50 to 69,113,F,White,Not Span/Hispanic,5,Elective,Home w/ Home Health Services,2020,NEO051,ENDOCRINE SYSTEM CANCERS - PANCREAS,HEP005,PANCREATECTOMY,260,"MAJOR PANCREAS, LIVER & SHUNT PROCEDURES",07,DISEASES AND DISORDERS OF THE HEPATOBILIARY SYSTEM AND PANCREAS,2,Moderate,Moderate,Surgical,Medicare,Medicaid,,,,N,148491.64,29871.6
New York City,Manhattan,7002053,001463,NYU Langone Hospitals,70 or Older,113,F,White,Not Span/Hispanic,5,Elective,Home w/ Home Health Services,2020,NEO070,SECONDARY MALIGNANCIES,HEP004,HEPATOBILIARY RESECTION AND ABLATION,260,"MAJOR PANCREAS, LIVER & SHUNT PROCEDURES",07,DISEASES AND DISORDERS OF THE HEPATOBILIARY SYSTEM AND PANCREAS,2,Moderate,Moderate,Surgical,Medicare,Medicaid,,,,N,181888.79,34890.53
New York City,Manhattan,7002053,001463,NYU Langone Hospitals,50 to 69,112,F,Multi-racial,Not Span/Hispanic,2,Elective,Home or Self Care,2020,DIG019,OTHER SPECIFIED AND UNSPECIFIED LIVER DISEASE,HEP004,HEPATOBILIARY RESECTION AND ABLATION,260,"MAJOR PANCREAS, LIVER & SHUNT PROCEDURES",07,DISEASES AND DISORDERS OF THE HEPATOBILIARY SYSTEM AND PANCREAS,2,Moderate,Minor,Surgical,Private Health Insurance,,,,,N,167684.33,28688.46
New York City,Manhattan,7002053,001463,NYU Langone Hospitals,70 or Older,100,F,White,Not Span/Hispanic,6,Elective,Home w/ Home Health Services,2020,NEO051,ENDOCRINE SYSTEM CANCERS - PANCREAS,HEP005,PANCREATECTOMY,260,"MAJOR PANCREAS, LIVER & SHUNT PROCEDURES",07,DISEASES AND DISORDERS OF THE HEPATOBILIARY SYSTEM AND PANCREAS,1,Minor,Moderate,Surgical,Medicare,Medicare,,,,N,223844.3,47384.15
New York City,Manhattan,7002053,001463,NYU Langone Hospitals,70 or Older,,F,White,Spanish/Hispanic,8,Elective,Home or Self Care,2020,NEO051,ENDOCRINE SYSTEM CANCERS - PANCREAS,HEP005,PANCREATECTOMY,260,"MAJOR PANCREAS, LIVER & SHUNT PROCEDURES",07,DISEASES AND DISORDERS OF THE HEPATOBILIARY SYSTEM AND PANCREAS,3,Major,Moderate,Surgical,Medicare,,,,,N,316864.46,68464.94
New York City,Manhattan,7002053,001463,NYU Langone Hospitals,30 to 49,117,M,Other Race,Not Span/Hispanic,7,Elective,Home or Self Care,2020,DIG020,PANCREATIC DISORDERS (EXCLUDING DIABETES),HEP005,PANCREATECTOMY,260,"MAJOR PANCREAS, LIVER & SHUNT PROCEDURES",07,DISEASES AND DISORDERS OF THE HEPATOBILIARY SYSTEM AND PANCREAS,3,Major,Moderate,Surgical,Medicaid,,,,,N,285163.55,60019.94
New York City,Manhattan,7002053,001463,NYU Langone Hospitals,50 to 69,105,M,White,Not Span/Hispanic,5,Elective,Home or Self Care,2020,NEO051,ENDOCRINE SYSTEM CANCERS - PANCREAS,HEP005,PANCREATECTOMY,260,"MAJOR PANCREAS, LIVER & SHUNT PROCEDURES",07,DISEASES AND DISORDERS OF THE HEPATOBILIARY SYSTEM AND PANCREAS,2,Moderate,Moderate,Surgical,Private Health Insurance,,,,,N,220005.11,43754.18
New York City,Manhattan,7002053,001463,NYU Langone Hospitals,50 to 69,119,F,White,Not Span/Hispanic,38,Emergency,Inpatient Rehabilitation Facility,2020,INJ036,"COMPLICATION OF TRANSPLANTED ORGANS OR TISSUE, INITIAL ENCOUNTER",HEP005,PANCREATECTOMY,260,"MAJOR PANCREAS, LIVER & SHUNT PROCEDURES",07,DISEASES AND DISORDERS OF THE HEPATOBILIARY SYSTEM AND PANCREAS,4,Extreme,Extreme,Surgical,Medicare,Private Health Insurance,,,,Y,1107024.34,266083.97
New York City,Manhattan,7002053,001463,NYU Langone Hospitals,50 to 69,,M,Other Race,Not Span/Hispanic,9,Elective,Home w/ Home Health Services,2020,NEO051,ENDOCRINE SYSTEM CANCERS - PANCREAS,HEP005,PANCREATECTOMY,260,"MAJOR PANCREAS, LIVER & SHUNT PROCEDURES",07,DISEASES AND DISORDERS OF THE HEPATOBILIARY SYSTEM AND PANCREAS,3,Major,Moderate,Surgical,Blue Cross/Blue Shield,Blue Cross/Blue Shield,,,,N,334732.54,70272.07
New York City,Manhattan,7002053,001463,NYU Langone Hospitals,30 to 49,100,F,Other Race,Not Span/Hispanic,6,Elective,Home w/ Home Health Services,2020,NEO051,ENDOCRINE SYSTEM CANCERS - PANCREAS,HEP005,PANCREATECTOMY,260,"MAJOR PANCREAS, LIVER & SHUNT PROCEDURES",07,DISEASES AND DISORDERS OF THE HEPATOBILIARY SYSTEM AND PANCREAS,2,Moderate,Minor,Surgical,Private Health Insurance,,,,,N,202561.75,42997.94
New York City,Manhattan,7002053,001463,NYU Langone Hospitals,30 to 49,100,F,Other Race,Spanish/Hispanic,7,Elective,Home or Self Care,2020,NEO017,GASTROINTESTINAL CANCERS - LIVER,HEP004,HEPATOBILIARY RESECTION AND ABLATION,260,"MAJOR PANCREAS, LIVER & SHUNT PROCEDURES",07,DISEASES AND DISORDERS OF THE HEPATOBILIARY SYSTEM AND PANCREAS,3,Major,Minor,Surgical,Medicaid,,,,,N,295698.24,60761.08
New York City,Manhattan,7002053,001463,NYU Langone Hospitals,50 to 69,112,M,White,Not Span/Hispanic,14,Elective,Home or Self Care,2020,NEO070,SECONDARY MALIGNANCIES,HEP004,HEPATOBILIARY RESECTION AND ABLATION,260,"MAJOR PANCREAS, LIVER & SHUNT PROCEDURES",07,DISEASES AND DISORDERS OF THE HEPATOBILIARY SYSTEM AND PANCREAS,3,Major,Major,Surgical,Medicaid,,,,,N,443397.43,102034.96
New York City,Manhattan,7002053,001463,NYU Langone Hospitals,70 or Older,112,M,White,Not Span/Hispanic,5,Elective,Home or Self Care,2020,NEO018,GASTROINTESTINAL CANCERS - BILE DUCT,HEP004,HEPATOBILIARY RESECTION AND ABLATION,260,"MAJOR PANCREAS, LIVER & SHUNT PROCEDURES",07,DISEASES AND DISORDERS OF THE HEPATOBILIARY SYSTEM AND PANCREAS,2,Moderate,Minor,Surgical,Medicare,Medicare,,,,N,288388.54,54667.02
New York City,Manhattan,7002053,001463,NYU Langone Hospitals,70 or Older,111,F,White,Not Span/Hispanic,12,Elective,Home w/ Home Health Services,2020,NEO017,GASTROINTESTINAL CANCERS - LIVER,HEP004,HEPATOBILIARY RESECTION AND ABLATION,260,"MAJOR PANCREAS, LIVER & SHUNT PROCEDURES",07,DISEASES AND DISORDERS OF THE HEPATOBILIARY SYSTEM AND PANCREAS,3,Major,Minor,Surgical,Medicare,Blue Cross/Blue Shield,,,,N,392990.42,89546.29
New York City,Manhattan,7002053,001463,NYU Langone Hospitals,50 to 69,126,F,White,Not Span/Hispanic,5,Elective,Home or Self Care,2020,NEO017,GASTROINTESTINAL CANCERS - LIVER,HEP004,HEPATOBILIARY RESECTION AND ABLATION,260,"MAJOR PANCREAS, LIVER & SHUNT PROCEDURES",07,DISEASES AND DISORDERS OF THE HEPATOBILIARY SYSTEM AND PANCREAS,2,Moderate,Minor,Surgical,Private Health Insurance,,,,,N,347048.43,61092
New York City,Manhattan,7002053,001463,NYU Langone Hospitals,70 or Older,100,F,White,Not Span/Hispanic,4,Elective,Home or Self Care,2020,NEO018,GASTROINTESTINAL CANCERS - BILE DUCT,HEP004,HEPATOBILIARY RESECTION AND ABLATION,260,"MAJOR PANCREAS, LIVER & SHUNT PROCEDURES",07,DISEASES AND DISORDERS OF THE HEPATOBILIARY SYSTEM AND PANCREAS,2,Moderate,Minor,Surgical,Medicare,Private Health Insurance,,,,N,150949.35,32371.88
New York City,Manhattan,7002053,001463,NYU Langone Hospitals,70 or Older,111,F,White,Not Span/Hispanic,18,Elective,Home w/ Home Health Services,2020,NEO051,ENDOCRINE SYSTEM CANCERS - PANCREAS,HEP005,PANCREATECTOMY,260,"MAJOR PANCREAS, LIVER & SHUNT PROCEDURES",07,DISEASES AND DISORDERS OF THE HEPATOBILIARY SYSTEM AND PANCREAS,3,Major,Moderate,Surgical,Medicare,Medicaid,,,,N,626647.33,140525.32
New York City,Manhattan,7002053,001463,NYU Langone Hospitals,70 or Older,104,M,White,Not Span/Hispanic,1,Elective,Home w/ Home Health Services,2020,DIG016,PERITONITIS AND INTRA-ABDOMINAL ABSCESS,HEP004,HEPATOBILIARY RESECTION AND ABLATION,260,"MAJOR PANCREAS, LIVER & SHUNT PROCEDURES",07,DISEASES AND DISORDERS OF THE HEPATOBILIARY SYSTEM AND PANCREAS,1,Minor,Minor,Surgical,Private Health Insurance,Private Health Insurance,,,,N,110848.88,18060.31
New York City,Manhattan,7002053,001463,NYU Langone Hospitals,70 or Older,111,F,White,Not Span/Hispanic,7,Elective,Home or Self Care,2020,NEO051,ENDOCRINE SYSTEM CANCERS - PANCREAS,HEP005,PANCREATECTOMY,260,"MAJOR PANCREAS, LIVER & SHUNT PROCEDURES",07,DISEASES AND DISORDERS OF THE HEPATOBILIARY SYSTEM AND PANCREAS,2,Moderate,Moderate,Surgical,Medicare,Medicare,,,,N,300476.14,60929.42