Hospital Service Area,Hospital County,Operating Certificate Number,Permanent Facility Id,Facility Name,Age Group,Zip Code - 3 digits,Gender,Race,Ethnicity,Length of Stay,Type of Admission,Patient Disposition,Discharge Year,CCS Diagnosis Code,CCS Diagnosis Description,CCS Procedure Code,CCS Procedure Description,APR DRG Code,APR DRG Description,APR MDC Code,APR MDC Description,APR Severity of Illness Code,APR Severity of Illness Description,APR Risk of Mortality,APR Medical Surgical Description,Payment Typology 1,Payment Typology 2,Payment Typology 3,Birth Weight,Abortion Edit Indicator,Emergency Department Indicator,Total Charges,Total Costs
Long Island,Nassau,2908000,000511,NYU Langone Hospital-Long Island,50 to 69,117,M,White,Not Span/Hispanic,5,Elective,Home w/ Home Health Services,2020,NEO051,ENDOCRINE SYSTEM CANCERS - PANCREAS,HEP005,PANCREATECTOMY,260,"MAJOR PANCREAS, LIVER & SHUNT PROCEDURES",07,DISEASES AND DISORDERS OF THE HEPATOBILIARY SYSTEM AND PANCREAS,2,Moderate,Moderate,Surgical,Private Health Insurance,,,,,N,161381.81,30875.71
Long Island,Nassau,2908000,000511,NYU Langone Hospital-Long Island,50 to 69,110,F,White,Not Span/Hispanic,13,Emergency,Home w/ Home Health Services,2020,NEO051,ENDOCRINE SYSTEM CANCERS - PANCREAS,HEP005,PANCREATECTOMY,260,"MAJOR PANCREAS, LIVER & SHUNT PROCEDURES",07,DISEASES AND DISORDERS OF THE HEPATOBILIARY SYSTEM AND PANCREAS,3,Major,Moderate,Surgical,Private Health Insurance,,,,,Y,342158.71,72963.71
Long Island,Nassau,2908000,000511,NYU Langone Hospital-Long Island,70 or Older,117,F,White,Not Span/Hispanic,4,Elective,Skilled Nursing Home,2020,NEO051,ENDOCRINE SYSTEM CANCERS - PANCREAS,HEP005,PANCREATECTOMY,260,"MAJOR PANCREAS, LIVER & SHUNT PROCEDURES",07,DISEASES AND DISORDERS OF THE HEPATOBILIARY SYSTEM AND PANCREAS,3,Major,Major,Surgical,Medicare,Medicare,,,,N,126538.18,23906.63
Long Island,Nassau,2908000,000511,NYU Langone Hospital-Long Island,70 or Older,115,M,White,Not Span/Hispanic,3,Elective,Home w/ Home Health Services,2020,NEO070,SECONDARY MALIGNANCIES,HEP004,HEPATOBILIARY RESECTION AND ABLATION,260,"MAJOR PANCREAS, LIVER & SHUNT PROCEDURES",07,DISEASES AND DISORDERS OF THE HEPATOBILIARY SYSTEM AND PANCREAS,1,Minor,Moderate,Surgical,Medicare,Blue Cross/Blue Shield,,,,N,126588.23,22607.01
Long Island,Nassau,2908000,000511,NYU Langone Hospital-Long Island,70 or Older,117,F,White,Not Span/Hispanic,7,Elective,Skilled Nursing Home,2020,NEO051,ENDOCRINE SYSTEM CANCERS - PANCREAS,HEP005,PANCREATECTOMY,260,"MAJOR PANCREAS, LIVER & SHUNT PROCEDURES",07,DISEASES AND DISORDERS OF THE HEPATOBILIARY SYSTEM AND PANCREAS,3,Major,Major,Surgical,Medicare,Medicare,,,,N,194913.35,40168.01
Long Island,Nassau,2908000,000511,NYU Langone Hospital-Long Island,30 to 49,115,F,White,Not Span/Hispanic,18,Emergency,Home w/ Home Health Services,2020,DIG020,PANCREATIC DISORDERS (EXCLUDING DIABETES),HEP013,"HEPATOBILIARY AND PANCREATIC PROCEDURES, NEC",260,"MAJOR PANCREAS, LIVER & SHUNT PROCEDURES",07,DISEASES AND DISORDERS OF THE HEPATOBILIARY SYSTEM AND PANCREAS,2,Moderate,Moderate,Surgical,Private Health Insurance,,,,,Y,325298.79,83021.74
Long Island,Nassau,2908000,000511,NYU Langone Hospital-Long Island,50 to 69,115,M,White,Spanish/Hispanic,5,Elective,Home w/ Home Health Services,2020,NEO051,ENDOCRINE SYSTEM CANCERS - PANCREAS,HEP005,PANCREATECTOMY,260,"MAJOR PANCREAS, LIVER & SHUNT PROCEDURES",07,DISEASES AND DISORDERS OF THE HEPATOBILIARY SYSTEM AND PANCREAS,3,Major,Moderate,Surgical,Private Health Insurance,,,,,N,151558.92,29240.48
Long Island,Nassau,2908000,000511,NYU Langone Hospital-Long Island,70 or Older,119,M,White,Not Span/Hispanic,6,Elective,Home w/ Home Health Services,2020,NEO051,ENDOCRINE SYSTEM CANCERS - PANCREAS,HEP005,PANCREATECTOMY,260,"MAJOR PANCREAS, LIVER & SHUNT PROCEDURES",07,DISEASES AND DISORDERS OF THE HEPATOBILIARY SYSTEM AND PANCREAS,2,Moderate,Minor,Surgical,Medicare,,,,,N,194596.84,41578.1
Long Island,Nassau,2908000,000511,NYU Langone Hospital-Long Island,50 to 69,115,M,White,Not Span/Hispanic,3,Elective,Home or Self Care,2020,NEO017,GASTROINTESTINAL CANCERS - LIVER,HEP004,HEPATOBILIARY RESECTION AND ABLATION,260,"MAJOR PANCREAS, LIVER & SHUNT PROCEDURES",07,DISEASES AND DISORDERS OF THE HEPATOBILIARY SYSTEM AND PANCREAS,3,Major,Minor,Surgical,Medicaid,,,,,N,114946.89,21454.48
Long Island,Nassau,2908000,000511,NYU Langone Hospital-Long Island,50 to 69,115,F,White,Spanish/Hispanic,5,Elective,Home w/ Home Health Services,2020,NEO073,BENIGN NEOPLASMS,HEP005,PANCREATECTOMY,260,"MAJOR PANCREAS, LIVER & SHUNT PROCEDURES",07,DISEASES AND DISORDERS OF THE HEPATOBILIARY SYSTEM AND PANCREAS,2,Moderate,Minor,Surgical,Medicare,Private Health Insurance,,,,N,308749.26,50075.84
Long Island,Nassau,2908000,000511,NYU Langone Hospital-Long Island,70 or Older,117,M,White,Not Span/Hispanic,1,Elective,Home or Self Care,2020,NEO051,ENDOCRINE SYSTEM CANCERS - PANCREAS,HEP005,PANCREATECTOMY,260,"MAJOR PANCREAS, LIVER & SHUNT PROCEDURES",07,DISEASES AND DISORDERS OF THE HEPATOBILIARY SYSTEM AND PANCREAS,2,Moderate,Moderate,Surgical,Private Health Insurance,,,,,N,78691.06,12635.64
Long Island,Nassau,2908000,000511,NYU Langone Hospital-Long Island,30 to 49,115,F,White,Not Span/Hispanic,4,Elective,Home w/ Home Health Services,2020,NEO051,ENDOCRINE SYSTEM CANCERS - PANCREAS,HEP005,PANCREATECTOMY,260,"MAJOR PANCREAS, LIVER & SHUNT PROCEDURES",07,DISEASES AND DISORDERS OF THE HEPATOBILIARY SYSTEM AND PANCREAS,3,Major,Minor,Surgical,Private Health Insurance,,,,,N,136490.8,26087.35
Long Island,Nassau,2908000,000511,NYU Langone Hospital-Long Island,70 or Older,117,F,White,Not Span/Hispanic,7,Elective,Home w/ Home Health Services,2020,NEO073,BENIGN NEOPLASMS,HEP005,PANCREATECTOMY,260,"MAJOR PANCREAS, LIVER & SHUNT PROCEDURES",07,DISEASES AND DISORDERS OF THE HEPATOBILIARY SYSTEM AND PANCREAS,2,Moderate,Minor,Surgical,Medicare,Medicare,,,,N,177913.48,36497.64
Long Island,Nassau,2908000,000511,NYU Langone Hospital-Long Island,50 to 69,115,F,White,Not Span/Hispanic,4,Elective,Home w/ Home Health Services,2020,NEO051,ENDOCRINE SYSTEM CANCERS - PANCREAS,HEP005,PANCREATECTOMY,260,"MAJOR PANCREAS, LIVER & SHUNT PROCEDURES",07,DISEASES AND DISORDERS OF THE HEPATOBILIARY SYSTEM AND PANCREAS,3,Major,Minor,Surgical,Blue Cross/Blue Shield,,,,,N,172045.45,31041.6
Long Island,Nassau,2908000,000511,NYU Langone Hospital-Long Island,30 to 49,118,F,White,Not Span/Hispanic,1,Elective,Home or Self Care,2020,NEO070,SECONDARY MALIGNANCIES,HEP004,HEPATOBILIARY RESECTION AND ABLATION,260,"MAJOR PANCREAS, LIVER & SHUNT PROCEDURES",07,DISEASES AND DISORDERS OF THE HEPATOBILIARY SYSTEM AND PANCREAS,2,Moderate,Minor,Surgical,Medicaid,,,,,N,83305.94,12934.58
Long Island,Nassau,2908000,000511,NYU Langone Hospital-Long Island,50 to 69,119,F,White,Not Span/Hispanic,3,Elective,Home or Self Care,2020,NEO073,BENIGN NEOPLASMS,HEP005,PANCREATECTOMY,260,"MAJOR PANCREAS, LIVER & SHUNT PROCEDURES",07,DISEASES AND DISORDERS OF THE HEPATOBILIARY SYSTEM AND PANCREAS,1,Minor,Minor,Surgical,Private Health Insurance,,,,,N,150442.78,29025.92
Long Island,Nassau,2908000,000511,NYU Langone Hospital-Long Island,70 or Older,117,F,White,Not Span/Hispanic,3,Elective,Home w/ Home Health Services,2020,NEO019,GASTROINTESTINAL CANCERS - GALLBLADDER,HEP004,HEPATOBILIARY RESECTION AND ABLATION,260,"MAJOR PANCREAS, LIVER & SHUNT PROCEDURES",07,DISEASES AND DISORDERS OF THE HEPATOBILIARY SYSTEM AND PANCREAS,2,Moderate,Moderate,Surgical,Medicare,,,,,N,99343.95,19203.6
Long Island,Nassau,2908000,000511,NYU Langone Hospital-Long Island,70 or Older,115,M,White,Not Span/Hispanic,1,Elective,Home or Self Care,2020,NEO018,GASTROINTESTINAL CANCERS - BILE DUCT,HEP004,HEPATOBILIARY RESECTION AND ABLATION,260,"MAJOR PANCREAS, LIVER & SHUNT PROCEDURES",07,DISEASES AND DISORDERS OF THE HEPATOBILIARY SYSTEM AND PANCREAS,2,Moderate,Moderate,Surgical,Medicare,Blue Cross/Blue Shield,,,,N,114442.64,17631.71
Long Island,Nassau,2908000,000511,NYU Langone Hospital-Long Island,50 to 69,110,M,White,Not Span/Hispanic,5,Elective,Home w/ Home Health Services,2020,NEO051,ENDOCRINE SYSTEM CANCERS - PANCREAS,HEP005,PANCREATECTOMY,260,"MAJOR PANCREAS, LIVER & SHUNT PROCEDURES",07,DISEASES AND DISORDERS OF THE HEPATOBILIARY SYSTEM AND PANCREAS,3,Major,Moderate,Surgical,Medicare,Blue Cross/Blue Shield,Blue Cross/Blue Shield,,,N,163623.99,37346.3
Long Island,Nassau,2908000,000511,NYU Langone Hospital-Long Island,70 or Older,117,M,White,Not Span/Hispanic,3,Elective,Home w/ Home Health Services,2020,DIG020,PANCREATIC DISORDERS (EXCLUDING DIABETES),HEP005,PANCREATECTOMY,260,"MAJOR PANCREAS, LIVER & SHUNT PROCEDURES",07,DISEASES AND DISORDERS OF THE HEPATOBILIARY SYSTEM AND PANCREAS,1,Minor,Minor,Surgical,Medicare,Blue Cross/Blue Shield,,,,N,227700.4,39992.52
Long Island,Nassau,2908000,000511,NYU Langone Hospital-Long Island,70 or Older,115,M,White,Not Span/Hispanic,4,Elective,Home w/ Home Health Services,2020,NEO019,GASTROINTESTINAL CANCERS - GALLBLADDER,HEP004,HEPATOBILIARY RESECTION AND ABLATION,260,"MAJOR PANCREAS, LIVER & SHUNT PROCEDURES",07,DISEASES AND DISORDERS OF THE HEPATOBILIARY SYSTEM AND PANCREAS,2,Moderate,Moderate,Surgical,Medicare,Blue Cross/Blue Shield,,,,N,138358.06,29720.33
Long Island,Nassau,2908000,000511,NYU Langone Hospital-Long Island,50 to 69,114,M,Other Race,Not Span/Hispanic,5,Elective,Home w/ Home Health Services,2020,NEO051,ENDOCRINE SYSTEM CANCERS - PANCREAS,HEP005,PANCREATECTOMY,260,"MAJOR PANCREAS, LIVER & SHUNT PROCEDURES",07,DISEASES AND DISORDERS OF THE HEPATOBILIARY SYSTEM AND PANCREAS,3,Major,Minor,Surgical,Private Health Insurance,,,,,N,242575.8,53483.33
Long Island,Nassau,2908000,000511,NYU Langone Hospital-Long Island,50 to 69,117,M,White,Not Span/Hispanic,2,Elective,Home or Self Care,2020,DIG020,PANCREATIC DISORDERS (EXCLUDING DIABETES),HEP005,PANCREATECTOMY,260,"MAJOR PANCREAS, LIVER & SHUNT PROCEDURES",07,DISEASES AND DISORDERS OF THE HEPATOBILIARY SYSTEM AND PANCREAS,3,Major,Minor,Surgical,Medicaid,,,,,N,103794.22,18998.68
Long Island,Nassau,2908000,000511,NYU Langone Hospital-Long Island,50 to 69,118,M,White,Not Span/Hispanic,10,Elective,Home w/ Home Health Services,2020,NEO021,GASTROINTESTINAL CANCERS - ALL OTHER TYPES,HEP005,PANCREATECTOMY,260,"MAJOR PANCREAS, LIVER & SHUNT PROCEDURES",07,DISEASES AND DISORDERS OF THE HEPATOBILIARY SYSTEM AND PANCREAS,3,Major,Major,Surgical,Blue Cross/Blue Shield,,,,,N,250549.17,63425.42
Long Island,Nassau,2908000,000511,NYU Langone Hospital-Long Island,70 or Older,117,M,White,Not Span/Hispanic,4,Elective,Home w/ Home Health Services,2020,NEO051,ENDOCRINE SYSTEM CANCERS - PANCREAS,HEP005,PANCREATECTOMY,260,"MAJOR PANCREAS, LIVER & SHUNT PROCEDURES",07,DISEASES AND DISORDERS OF THE HEPATOBILIARY SYSTEM AND PANCREAS,3,Major,Moderate,Surgical,Medicare,Blue Cross/Blue Shield,,,,N,154408.97,32456.94
Long Island,Nassau,2908000,000511,NYU Langone Hospital-Long Island,50 to 69,115,M,White,Not Span/Hispanic,1,Elective,Home or Self Care,2020,NEO051,ENDOCRINE SYSTEM CANCERS - PANCREAS,HEP005,PANCREATECTOMY,260,"MAJOR PANCREAS, LIVER & SHUNT PROCEDURES",07,DISEASES AND DISORDERS OF THE HEPATOBILIARY SYSTEM AND PANCREAS,2,Moderate,Moderate,Surgical,Medicare,,,,,N,145201.64,22904.66
Long Island,Nassau,2908000,000511,NYU Langone Hospital-Long Island,70 or Older,110,F,White,Not Span/Hispanic,5,Elective,Home w/ Home Health Services,2020,NEO051,ENDOCRINE SYSTEM CANCERS - PANCREAS,HEP005,PANCREATECTOMY,260,"MAJOR PANCREAS, LIVER & SHUNT PROCEDURES",07,DISEASES AND DISORDERS OF THE HEPATOBILIARY SYSTEM AND PANCREAS,4,Extreme,Major,Surgical,Medicare,Private Health Insurance,,,,N,196485.57,41146.78
Long Island,Nassau,2908000,000511,NYU Langone Hospital-Long Island,70 or Older,115,M,White,Not Span/Hispanic,5,Elective,Home w/ Home Health Services,2020,NEO073,BENIGN NEOPLASMS,HEP005,PANCREATECTOMY,260,"MAJOR PANCREAS, LIVER & SHUNT PROCEDURES",07,DISEASES AND DISORDERS OF THE HEPATOBILIARY SYSTEM AND PANCREAS,4,Extreme,Major,Surgical,Medicare,Blue Cross/Blue Shield,,,,N,243729.21,48915.03
Long Island,Nassau,2908000,000511,NYU Langone Hospital-Long Island,30 to 49,110,F,Black/African American,Not Span/Hispanic,2,Elective,Home or Self Care,2020,NEO051,ENDOCRINE SYSTEM CANCERS - PANCREAS,HEP005,PANCREATECTOMY,260,"MAJOR PANCREAS, LIVER & SHUNT PROCEDURES",07,DISEASES AND DISORDERS OF THE HEPATOBILIARY SYSTEM AND PANCREAS,1,Minor,Minor,Surgical,Medicaid,,,,,N,96527.76,18811.87
Long Island,Nassau,2908000,000511,NYU Langone Hospital-Long Island,30 to 49,115,M,Black/African American,Not Span/Hispanic,17,Trauma,Home w/ Home Health Services,2020,INJ010,"INTERNAL ORGAN INJURY, INITIAL ENCOUNTER",HEP013,"HEPATOBILIARY AND PANCREATIC PROCEDURES, NEC",260,"MAJOR PANCREAS, LIVER & SHUNT PROCEDURES",07,DISEASES AND DISORDERS OF THE HEPATOBILIARY SYSTEM AND PANCREAS,4,Extreme,Extreme,Surgical,Medicaid,,,,,Y,580697.04,128125.27
Long Island,Nassau,2908000,000511,NYU Langone Hospital-Long Island,70 or Older,115,M,White,Not Span/Hispanic,2,Elective,Home or Self Care,2020,DIG020,PANCREATIC DISORDERS (EXCLUDING DIABETES),HEP005,PANCREATECTOMY,260,"MAJOR PANCREAS, LIVER & SHUNT PROCEDURES",07,DISEASES AND DISORDERS OF THE HEPATOBILIARY SYSTEM AND PANCREAS,1,Minor,Minor,Surgical,Medicare,Medicare,,,,N,130171.7,23180.63
Long Island,Nassau,2908000,000511,NYU Langone Hospital-Long Island,70 or Older,114,F,Other Race,Not Span/Hispanic,2,Emergency,Home or Self Care,2020,NEO019,GASTROINTESTINAL CANCERS - GALLBLADDER,HEP004,HEPATOBILIARY RESECTION AND ABLATION,260,"MAJOR PANCREAS, LIVER & SHUNT PROCEDURES",07,DISEASES AND DISORDERS OF THE HEPATOBILIARY SYSTEM AND PANCREAS,2,Moderate,Moderate,Surgical,Medicare,Medicaid,,,,Y,172752.13,29689.62
Long Island,Nassau,2908000,000511,NYU Langone Hospital-Long Island,70 or Older,115,F,White,Not Span/Hispanic,3,Elective,Home w/ Home Health Services,2020,NEO019,GASTROINTESTINAL CANCERS - GALLBLADDER,HEP004,HEPATOBILIARY RESECTION AND ABLATION,260,"MAJOR PANCREAS, LIVER & SHUNT PROCEDURES",07,DISEASES AND DISORDERS OF THE HEPATOBILIARY SYSTEM AND PANCREAS,2,Moderate,Moderate,Surgical,Medicare,Medicare,,,,N,110924.91,24117.42
Long Island,Nassau,2908000,000511,NYU Langone Hospital-Long Island,70 or Older,110,F,White,Not Span/Hispanic,16,Elective,Home w/ Home Health Services,2020,NEO051,ENDOCRINE SYSTEM CANCERS - PANCREAS,HEP005,PANCREATECTOMY,260,"MAJOR PANCREAS, LIVER & SHUNT PROCEDURES",07,DISEASES AND DISORDERS OF THE HEPATOBILIARY SYSTEM AND PANCREAS,3,Major,Moderate,Surgical,Medicare,,,,,N,407021.1,96876.53
Long Island,Nassau,2908000,000511,NYU Langone Hospital-Long Island,70 or Older,113,F,White,Not Span/Hispanic,11,Elective,Skilled Nursing Home,2020,NEO021,GASTROINTESTINAL CANCERS - ALL OTHER TYPES,HEP005,PANCREATECTOMY,260,"MAJOR PANCREAS, LIVER & SHUNT PROCEDURES",07,DISEASES AND DISORDERS OF THE HEPATOBILIARY SYSTEM AND PANCREAS,3,Major,Major,Surgical,Medicare,Medicare,,,,N,374018.4,92811.38
Long Island,Nassau,2908000,000511,NYU Langone Hospital-Long Island,70 or Older,115,F,White,Not Span/Hispanic,6,Elective,Home w/ Home Health Services,2020,NEO051,ENDOCRINE SYSTEM CANCERS - PANCREAS,HEP005,PANCREATECTOMY,260,"MAJOR PANCREAS, LIVER & SHUNT PROCEDURES",07,DISEASES AND DISORDERS OF THE HEPATOBILIARY SYSTEM AND PANCREAS,2,Moderate,Moderate,Surgical,Medicare,Blue Cross/Blue Shield,,,,N,172409,41178.27
Long Island,Nassau,2908000,000511,NYU Langone Hospital-Long Island,70 or Older,110,F,White,Not Span/Hispanic,11,Emergency,Home w/ Home Health Services,2020,NEO018,GASTROINTESTINAL CANCERS - BILE DUCT,HEP004,HEPATOBILIARY RESECTION AND ABLATION,260,"MAJOR PANCREAS, LIVER & SHUNT PROCEDURES",07,DISEASES AND DISORDERS OF THE HEPATOBILIARY SYSTEM AND PANCREAS,3,Major,Moderate,Surgical,Medicare,Blue Cross/Blue Shield,,,,Y,390140.18,84235.93
Long Island,Nassau,2908000,000511,NYU Langone Hospital-Long Island,70 or Older,117,M,White,Not Span/Hispanic,12,Elective,Home w/ Home Health Services,2020,NEO021,GASTROINTESTINAL CANCERS - ALL OTHER TYPES,HEP005,PANCREATECTOMY,260,"MAJOR PANCREAS, LIVER & SHUNT PROCEDURES",07,DISEASES AND DISORDERS OF THE HEPATOBILIARY SYSTEM AND PANCREAS,3,Major,Major,Surgical,Medicare,Blue Cross/Blue Shield,,,,N,452737.37,92435.6
Long Island,Nassau,2908000,000511,NYU Langone Hospital-Long Island,70 or Older,117,F,White,Not Span/Hispanic,13,Emergency,Home or Self Care,2020,NEO051,ENDOCRINE SYSTEM CANCERS - PANCREAS,HEP005,PANCREATECTOMY,260,"MAJOR PANCREAS, LIVER & SHUNT PROCEDURES",07,DISEASES AND DISORDERS OF THE HEPATOBILIARY SYSTEM AND PANCREAS,3,Major,Moderate,Surgical,Medicare,Medicare,,,,Y,488481.6,107510.7
Long Island,Nassau,2908000,000511,NYU Langone Hospital-Long Island,70 or Older,117,F,White,Not Span/Hispanic,3,Elective,Home or Self Care,2020,NEO073,BENIGN NEOPLASMS,HEP005,PANCREATECTOMY,260,"MAJOR PANCREAS, LIVER & SHUNT PROCEDURES",07,DISEASES AND DISORDERS OF THE HEPATOBILIARY SYSTEM AND PANCREAS,2,Moderate,Moderate,Surgical,Medicare,Medicare,,,,N,186188.66,34052.87
Long Island,Nassau,2908000,000511,NYU Langone Hospital-Long Island,50 to 69,118,F,White,Not Span/Hispanic,5,Elective,Home w/ Home Health Services,2020,NEO051,ENDOCRINE SYSTEM CANCERS - PANCREAS,HEP005,PANCREATECTOMY,260,"MAJOR PANCREAS, LIVER & SHUNT PROCEDURES",07,DISEASES AND DISORDERS OF THE HEPATOBILIARY SYSTEM AND PANCREAS,3,Major,Extreme,Surgical,Medicare,Blue Cross/Blue Shield,,,,N,242821.87,53584.46
Long Island,Nassau,2908000,000511,NYU Langone Hospital-Long Island,70 or Older,117,M,White,Not Span/Hispanic,3,Elective,Home or Self Care,2020,NEO051,ENDOCRINE SYSTEM CANCERS - PANCREAS,HEP005,PANCREATECTOMY,260,"MAJOR PANCREAS, LIVER & SHUNT PROCEDURES",07,DISEASES AND DISORDERS OF THE HEPATOBILIARY SYSTEM AND PANCREAS,2,Moderate,Major,Surgical,Medicare,,,,,N,190525.68,32896.54
Long Island,Nassau,2908000,000511,NYU Langone Hospital-Long Island,70 or Older,119,F,White,Not Span/Hispanic,4,Elective,Home w/ Home Health Services,2020,NEO051,ENDOCRINE SYSTEM CANCERS - PANCREAS,HEP005,PANCREATECTOMY,260,"MAJOR PANCREAS, LIVER & SHUNT PROCEDURES",07,DISEASES AND DISORDERS OF THE HEPATOBILIARY SYSTEM AND PANCREAS,3,Major,Moderate,Surgical,Medicare,,,,,N,190104.01,36758.84
Long Island,Nassau,2908000,000511,NYU Langone Hospital-Long Island,70 or Older,115,M,White,Not Span/Hispanic,3,Elective,Skilled Nursing Home,2020,NEO051,ENDOCRINE SYSTEM CANCERS - PANCREAS,HEP005,PANCREATECTOMY,260,"MAJOR PANCREAS, LIVER & SHUNT PROCEDURES",07,DISEASES AND DISORDERS OF THE HEPATOBILIARY SYSTEM AND PANCREAS,2,Moderate,Major,Surgical,Medicare,Blue Cross/Blue Shield,,,,N,319731.74,53837.45
Long Island,Nassau,2908000,000511,NYU Langone Hospital-Long Island,30 to 49,117,M,White,Not Span/Hispanic,5,Elective,Home or Self Care,2020,NEO051,ENDOCRINE SYSTEM CANCERS - PANCREAS,HEP005,PANCREATECTOMY,260,"MAJOR PANCREAS, LIVER & SHUNT PROCEDURES",07,DISEASES AND DISORDERS OF THE HEPATOBILIARY SYSTEM AND PANCREAS,3,Major,Moderate,Surgical,Private Health Insurance,,,,,N,199903.35,53676.66
Long Island,Nassau,2908000,000511,NYU Langone Hospital-Long Island,70 or Older,115,M,White,Not Span/Hispanic,16,Elective,Expired,2020,DIG017,BILIARY TRACT DISEASE,HEP005,PANCREATECTOMY,260,"MAJOR PANCREAS, LIVER & SHUNT PROCEDURES",07,DISEASES AND DISORDERS OF THE HEPATOBILIARY SYSTEM AND PANCREAS,4,Extreme,Extreme,Surgical,Medicare,Medicare,,,,N,659280.36,131489
Long Island,Nassau,2908000,000511,NYU Langone Hospital-Long Island,50 to 69,110,M,White,Spanish/Hispanic,4,Elective,Home w/ Home Health Services,2020,NEO073,BENIGN NEOPLASMS,HEP005,PANCREATECTOMY,260,"MAJOR PANCREAS, LIVER & SHUNT PROCEDURES",07,DISEASES AND DISORDERS OF THE HEPATOBILIARY SYSTEM AND PANCREAS,3,Major,Moderate,Surgical,Blue Cross/Blue Shield,Medicare,,,,N,210236.53,39854.06
Long Island,Nassau,2908000,000511,NYU Langone Hospital-Long Island,70 or Older,117,M,Other Race,Not Span/Hispanic,6,Elective,Home w/ Home Health Services,2020,NEO018,GASTROINTESTINAL CANCERS - BILE DUCT,HEP004,HEPATOBILIARY RESECTION AND ABLATION,260,"MAJOR PANCREAS, LIVER & SHUNT PROCEDURES",07,DISEASES AND DISORDERS OF THE HEPATOBILIARY SYSTEM AND PANCREAS,3,Major,Moderate,Surgical,Medicare,,,,,N,206493.35,45467.54
Long Island,Nassau,2908000,000511,NYU Langone Hospital-Long Island,50 to 69,115,M,White,Not Span/Hispanic,36,Elective,Skilled Nursing Home,2020,NEO021,GASTROINTESTINAL CANCERS - ALL OTHER TYPES,HEP005,PANCREATECTOMY,260,"MAJOR PANCREAS, LIVER & SHUNT PROCEDURES",07,DISEASES AND DISORDERS OF THE HEPATOBILIARY SYSTEM AND PANCREAS,4,Extreme,Major,Surgical,Blue Cross/Blue Shield,,,,,N,1038427.56,224370.13
Long Island,Nassau,2908000,000511,NYU Langone Hospital-Long Island,50 to 69,OOS,M,White,Not Span/Hispanic,4,Elective,Home or Self Care,2020,NEO070,SECONDARY MALIGNANCIES,HEP004,HEPATOBILIARY RESECTION AND ABLATION,260,"MAJOR PANCREAS, LIVER & SHUNT PROCEDURES",07,DISEASES AND DISORDERS OF THE HEPATOBILIARY SYSTEM AND PANCREAS,2,Moderate,Moderate,Surgical,Blue Cross/Blue Shield,,,,,N,147065.33,31838.53
Long Island,Nassau,2908000,000511,NYU Langone Hospital-Long Island,30 to 49,117,F,White,Not Span/Hispanic,2,Elective,Home or Self Care,2020,NEO073,BENIGN NEOPLASMS,HEP004,HEPATOBILIARY RESECTION AND ABLATION,260,"MAJOR PANCREAS, LIVER & SHUNT PROCEDURES",07,DISEASES AND DISORDERS OF THE HEPATOBILIARY SYSTEM AND PANCREAS,1,Minor,Minor,Surgical,Private Health Insurance,,,,,N,111807.07,20811.85
Long Island,Nassau,2908000,000511,NYU Langone Hospital-Long Island,50 to 69,115,M,White,Not Span/Hispanic,5,Emergency,Home or Self Care,2020,DIG017,BILIARY TRACT DISEASE,HEP004,HEPATOBILIARY RESECTION AND ABLATION,260,"MAJOR PANCREAS, LIVER & SHUNT PROCEDURES",07,DISEASES AND DISORDERS OF THE HEPATOBILIARY SYSTEM AND PANCREAS,3,Major,Moderate,Surgical,Medicare,Medicaid,,,,Y,159280.37,38306.68
Long Island,Nassau,2908000,000511,NYU Langone Hospital-Long Island,70 or Older,115,M,White,Not Span/Hispanic,3,Elective,Home w/ Home Health Services,2020,NEO017,GASTROINTESTINAL CANCERS - LIVER,HEP004,HEPATOBILIARY RESECTION AND ABLATION,260,"MAJOR PANCREAS, LIVER & SHUNT PROCEDURES",07,DISEASES AND DISORDERS OF THE HEPATOBILIARY SYSTEM AND PANCREAS,2,Moderate,Moderate,Surgical,Medicare,Blue Cross/Blue Shield,,,,N,130679.36,24844.2
Long Island,Nassau,2908000,000511,NYU Langone Hospital-Long Island,50 to 69,117,M,White,Not Span/Hispanic,4,Elective,Home or Self Care,2020,NEO051,ENDOCRINE SYSTEM CANCERS - PANCREAS,HEP005,PANCREATECTOMY,260,"MAJOR PANCREAS, LIVER & SHUNT PROCEDURES",07,DISEASES AND DISORDERS OF THE HEPATOBILIARY SYSTEM AND PANCREAS,3,Major,Moderate,Surgical,Private Health Insurance,,,,,N,150089.73,31284.13
Long Island,Nassau,2908000,000511,NYU Langone Hospital-Long Island,50 to 69,115,M,White,Not Span/Hispanic,2,Elective,Home w/ Home Health Services,2020,NEO051,ENDOCRINE SYSTEM CANCERS - PANCREAS,HEP005,PANCREATECTOMY,260,"MAJOR PANCREAS, LIVER & SHUNT PROCEDURES",07,DISEASES AND DISORDERS OF THE HEPATOBILIARY SYSTEM AND PANCREAS,2,Moderate,Moderate,Surgical,Medicare,Blue Cross/Blue Shield,,,,N,191314.67,31402.18
Long Island,Nassau,2908000,000511,NYU Langone Hospital-Long Island,0 to 17,115,M,Black/African American,Not Span/Hispanic,5,Elective,Home or Self Care,2020,NEO017,GASTROINTESTINAL CANCERS - LIVER,HEP004,HEPATOBILIARY RESECTION AND ABLATION,260,"MAJOR PANCREAS, LIVER & SHUNT PROCEDURES",07,DISEASES AND DISORDERS OF THE HEPATOBILIARY SYSTEM AND PANCREAS,3,Major,Moderate,Surgical,Medicare,,,,,N,209050.35,35600.94
Long Island,Nassau,2908000,000511,NYU Langone Hospital-Long Island,70 or Older,115,F,White,Not Span/Hispanic,5,Elective,Skilled Nursing Home,2020,NEO051,ENDOCRINE SYSTEM CANCERS - PANCREAS,HEP004,HEPATOBILIARY RESECTION AND ABLATION,260,"MAJOR PANCREAS, LIVER & SHUNT PROCEDURES",07,DISEASES AND DISORDERS OF THE HEPATOBILIARY SYSTEM AND PANCREAS,3,Major,Moderate,Surgical,Medicare,Medicare,,,,N,195757.06,40474.44