Hospital Service Area,Hospital County,Operating Certificate Number,Permanent Facility Id,Facility Name,Age Group,Zip Code - 3 digits,Gender,Race,Ethnicity,Length of Stay,Type of Admission,Patient Disposition,Discharge Year,CCS Diagnosis Code,CCS Diagnosis Description,CCS Procedure Code,CCS Procedure Description,APR DRG Code,APR DRG Description,APR MDC Code,APR MDC Description,APR Severity of Illness Code,APR Severity of Illness Description,APR Risk of Mortality,APR Medical Surgical Description,Payment Typology 1,Payment Typology 2,Payment Typology 3,Birth Weight,Abortion Edit Indicator,Emergency Department Indicator,Total Charges,Total Costs
New York City,Bronx,7000006,001169,Montefiore Medical Center - Henry & Lucy Moses Div,50 to 69,125,M,Other Race,Not Span/Hispanic,30,Emergency,Home or Self Care,2017,018,Cancer of other GI organs; peritoneum,098,OT NON-OR GI THER PRCS,261,Major biliary tract procedures,07,Diseases and Disorders of the Hepatobiliary System and Pancreas,3,Major,Major,Surgical,Medicaid,,,,N,N,598054.22,147565.05
New York City,Bronx,7000006,001169,Montefiore Medical Center - Henry & Lucy Moses Div,70 or Older,104,F,Other Race,Spanish/Hispanic,11,Emergency,Home or Self Care,2017,149,Biliary tract disease,098,OT NON-OR GI THER PRCS,261,Major biliary tract procedures,07,Diseases and Disorders of the Hepatobiliary System and Pancreas,3,Major,Major,Surgical,Medicare,Medicaid,,,N,Y,182929.97,41555.30
New York City,Bronx,7000006,001169,Montefiore Medical Center - Henry & Lucy Moses Div,70 or Older,104,F,Other Race,Not Span/Hispanic,3,Emergency,Home or Self Care,2017,149,Biliary tract disease,098,OT NON-OR GI THER PRCS,261,Major biliary tract procedures,07,Diseases and Disorders of the Hepatobiliary System and Pancreas,3,Major,Moderate,Surgical,Medicare,Medicaid,,,N,Y,52709.63,9759.57
New York City,Manhattan,7002054,001437,New York-Presbyterian/Lower Manhattan Hospital,30 to 49,OOS,F,White,Not Span/Hispanic,2,Emergency,Home or Self Care,2017,149,Biliary tract disease,098,OT NON-OR GI THER PRCS,261,Major biliary tract procedures,07,Diseases and Disorders of the Hepatobiliary System and Pancreas,1,Minor,Minor,Surgical,Self-Pay,,,,N,Y,28290.93,7703.17
New York City,Manhattan,7002002,001439,Mount Sinai Beth Israel,50 to 69,100,M,White,Not Span/Hispanic,13,Emergency,Skilled Nursing Home,2017,149,Biliary tract disease,099,OT OR GI THER PRCS,261,Major biliary tract procedures,07,Diseases and Disorders of the Hepatobiliary System and Pancreas,3,Major,Minor,Surgical,Medicare,Self-Pay,,,N,Y,114710.36,36114.95
New York City,Manhattan,7002024,001456,Mount Sinai Hospital,70 or Older,113,M,Other Race,Not Span/Hispanic,11,Emergency,Home or Self Care,2017,016,Cancer of liver and intrahepatic bile duct,097,OTHER GI DX PRCS,261,Major biliary tract procedures,07,Diseases and Disorders of the Hepatobiliary System and Pancreas,3,Major,Moderate,Surgical,Medicaid,Medicaid,Self-Pay,,N,Y,128393.71,52744.73
New York City,Manhattan,7002054,001464,New York Presbyterian Hospital - Columbia Presbyterian Center,70 or Older,,M,White,Not Span/Hispanic,58,Urgent,Expired,2017,237,Complication of device; implant or graft,099,OT OR GI THER PRCS,261,Major biliary tract procedures,07,Diseases and Disorders of the Hepatobiliary System and Pancreas,4,Extreme,Extreme,Surgical,Medicare,Medicare,Self-Pay,,N,N,1084901.92,430354.17
New York City,Manhattan,7002054,001464,New York Presbyterian Hospital - Columbia Presbyterian Center,30 to 49,OOS,F,Other Race,Not Span/Hispanic,4,Elective,Home or Self Care,2017,149,Biliary tract disease,090,EXCISION; LYS PERI ADHS,261,Major biliary tract procedures,07,Diseases and Disorders of the Hepatobiliary System and Pancreas,2,Moderate,Minor,Surgical,Blue Cross/Blue Shield,Self-Pay,,,N,N,50643.01,11888.46
New York City,Manhattan,7002054,001464,New York Presbyterian Hospital - Columbia Presbyterian Center,50 to 69,107,M,Other Race,Not Span/Hispanic,34,Urgent,Inpatient Rehabilitation Facility,2017,149,Biliary tract disease,099,OT OR GI THER PRCS,261,Major biliary tract procedures,07,Diseases and Disorders of the Hepatobiliary System and Pancreas,3,Major,Moderate,Surgical,Medicare,Private Health Insurance,Self-Pay,,N,N,413252.47,131491.15
New York City,Manhattan,7002032,001469,Mount Sinai St. Luke's,18 to 29,100,F,Black/African American,Spanish/Hispanic,11,Elective,Home or Self Care,2017,149,Biliary tract disease,098,OT NON-OR GI THER PRCS,261,Major biliary tract procedures,07,Diseases and Disorders of the Hepatobiliary System and Pancreas,2,Moderate,Minor,Surgical,Medicaid,Medicaid,Self-Pay,,N,N,84094.47,23249.48
New York City,Manhattan,7002032,001469,Mount Sinai St. Luke's,70 or Older,100,F,Black/African American,Not Span/Hispanic,9,Emergency,Expired,2017,018,Cancer of other GI organs; peritoneum,098,OT NON-OR GI THER PRCS,261,Major biliary tract procedures,07,Diseases and Disorders of the Hepatobiliary System and Pancreas,3,Major,Extreme,Surgical,Medicare,Medicare,Self-Pay,,N,Y,170783.08,54179.48
New York City,Queens,7003010,001637,New York - Presbyterian/Queens,30 to 49,113,F,Other Race,Not Span/Hispanic,4,Emergency,Home or Self Care,2017,152,Pancreatic disorders (not diabetes),226,OT DX RADIO & RELATED,261,Major biliary tract procedures,07,Diseases and Disorders of the Hepatobiliary System and Pancreas,2,Moderate,Minor,Surgical,Medicaid,Medicaid,Self-Pay,,N,Y,44888.63,17628.79
New York City,Kings,7002002,001324,Mount Sinai Brooklyn,70 or Older,112,M,White,Not Span/Hispanic,17,Urgent,Skilled Nursing Home,2017,149,Biliary tract disease,084,CHOLECYSTECTOMY/EXPLOR,261,Major biliary tract procedures,07,Diseases and Disorders of the Hepatobiliary System and Pancreas,2,Moderate,Major,Surgical,Medicare,Private Health Insurance,Self-Pay,,N,N,158980.66,34257.67
New York City,Manhattan,7002024,001456,Mount Sinai Hospital,50 to 69,104,M,Black/African American,Not Span/Hispanic,12,Urgent,Home w/ Home Health Services,2017,018,Cancer of other GI organs; peritoneum,098,OT NON-OR GI THER PRCS,261,Major biliary tract procedures,07,Diseases and Disorders of the Hepatobiliary System and Pancreas,3,Major,Major,Surgical,Medicare,Medicare,Self-Pay,,N,N,92129.82,31526.41
New York City,Manhattan,7002024,001456,Mount Sinai Hospital,70 or Older,100,M,Other Race,Not Span/Hispanic,10,Emergency,Expired,2017,149,Biliary tract disease,216,RESP INTUB/MECH VENTIL,261,Major biliary tract procedures,07,Diseases and Disorders of the Hepatobiliary System and Pancreas,4,Extreme,Extreme,Surgical,Medicare,Blue Cross/Blue Shield,Self-Pay,,N,Y,134102.40,45627.34
New York City,Manhattan,7002032,001469,Mount Sinai St. Luke's,70 or Older,100,F,White,Not Span/Hispanic,15,Emergency,Home w/ Home Health Services,2017,149,Biliary tract disease,098,OT NON-OR GI THER PRCS,261,Major biliary tract procedures,07,Diseases and Disorders of the Hepatobiliary System and Pancreas,2,Moderate,Minor,Surgical,Medicare,Medicare,Self-Pay,,N,Y,142074.12,42456.60
New York City,Manhattan,7002032,001469,Mount Sinai St. Luke's,70 or Older,100,M,Black/African American,Spanish/Hispanic,6,Emergency,Home w/ Home Health Services,2017,149,Biliary tract disease,231,OTHER THERAPEUTIC PRCS,261,Major biliary tract procedures,07,Diseases and Disorders of the Hepatobiliary System and Pancreas,3,Major,Moderate,Surgical,Medicare,Medicare,Medicaid,,N,Y,66180.83,17975.01
New York City,Manhattan,7002032,001469,Mount Sinai St. Luke's,70 or Older,100,M,Black/African American,Not Span/Hispanic,6,Emergency,Home w/ Home Health Services,2017,149,Biliary tract disease,098,OT NON-OR GI THER PRCS,261,Major biliary tract procedures,07,Diseases and Disorders of the Hepatobiliary System and Pancreas,2,Moderate,Moderate,Surgical,Medicare,Medicare,Self-Pay,,N,Y,60681.35,17542.91
Long Island,Suffolk,5123000,000885,Brookhaven Memorial Hospital Medical Center Inc,70 or Older,OOS,M,White,Not Span/Hispanic,8,Emergency,Home or Self Care,2017,149,Biliary tract disease,098,OT NON-OR GI THER PRCS,261,Major biliary tract procedures,07,Diseases and Disorders of the Hepatobiliary System and Pancreas,2,Moderate,Moderate,Surgical,Medicare,Medicare,Blue Cross/Blue Shield,,N,Y,110761.24,19501.86
Long Island,Suffolk,5123000,000885,Brookhaven Memorial Hospital Medical Center Inc,70 or Older,119,M,White,Not Span/Hispanic,7,Emergency,Skilled Nursing Home,2017,149,Biliary tract disease,098,OT NON-OR GI THER PRCS,261,Major biliary tract procedures,07,Diseases and Disorders of the Hepatobiliary System and Pancreas,3,Major,Major,Surgical,Medicare,Medicare,,,N,Y,62177.12,9624.48
Long Island,Suffolk,5127000,000891,Eastern Long Island Hospital,70 or Older,119,F,White,Not Span/Hispanic,3,Emergency,Skilled Nursing Home,2017,149,Biliary tract disease,084,CHOLECYSTECTOMY/EXPLOR,261,Major biliary tract procedures,07,Diseases and Disorders of the Hepatobiliary System and Pancreas,2,Moderate,Moderate,Surgical,Medicare,,,,N,Y,27967.50,7442.24
Western NY,Erie,1401014,000207,Buffalo General Medical Center,70 or Older,140,M,White,Spanish/Hispanic,4,Emergency,Home w/ Home Health Services,2017,149,Biliary tract disease,098,OT NON-OR GI THER PRCS,261,Major biliary tract procedures,07,Diseases and Disorders of the Hepatobiliary System and Pancreas,2,Moderate,Minor,Surgical,Medicare,Self-Pay,,,N,Y,19653.47,9246.18
Western NY,Erie,1401014,000207,Buffalo General Medical Center,50 to 69,140,M,White,Not Span/Hispanic,7,Emergency,Home w/ Home Health Services,2017,149,Biliary tract disease,098,OT NON-OR GI THER PRCS,261,Major biliary tract procedures,07,Diseases and Disorders of the Hepatobiliary System and Pancreas,1,Minor,Minor,Surgical,Blue Cross/Blue Shield,Self-Pay,,,N,Y,21792.11,11307.94
Western NY,Erie,1401014,000208,Women And Children's Hospital Of Buffalo,0 to 17,147,M,White,Not Span/Hispanic,3,Elective,Home or Self Care,2017,149,Biliary tract disease,084,CHOLECYSTECTOMY/EXPLOR,261,Major biliary tract procedures,07,Diseases and Disorders of the Hepatobiliary System and Pancreas,2,Moderate,Minor,Surgical,Blue Cross/Blue Shield,Self-Pay,,,N,N,75521.47,26748.63
Western NY,Erie,1401005,000210,Erie County Medical Center,50 to 69,141,F,White,Not Span/Hispanic,8,Emergency,Home or Self Care,2017,042,Secondary malignancies,098,OT NON-OR GI THER PRCS,261,Major biliary tract procedures,07,Diseases and Disorders of the Hepatobiliary System and Pancreas,3,Major,Major,Surgical,Medicaid,,,,N,Y,22759.73,12572.43
Western NY,Erie,1401014,003067,Millard Fillmore Suburban Hospital,70 or Older,140,M,White,Not Span/Hispanic,3,Emergency,Home w/ Home Health Services,2017,149,Biliary tract disease,098,OT NON-OR GI THER PRCS,261,Major biliary tract procedures,07,Diseases and Disorders of the Hepatobiliary System and Pancreas,2,Moderate,Moderate,Surgical,Medicare,Self-Pay,,,N,Y,18270.96,7083.96
Western NY,Erie,1401014,003067,Millard Fillmore Suburban Hospital,50 to 69,142,F,Black/African American,Not Span/Hispanic,4,Emergency,Skilled Nursing Home,2017,149,Biliary tract disease,098,OT NON-OR GI THER PRCS,261,Major biliary tract procedures,07,Diseases and Disorders of the Hepatobiliary System and Pancreas,2,Moderate,Moderate,Surgical,Medicare,Medicaid,Self-Pay,,N,Y,14229.47,7173.08
Western NY,Erie,1401014,003067,Millard Fillmore Suburban Hospital,70 or Older,142,F,White,Not Span/Hispanic,3,Emergency,Home w/ Home Health Services,2017,149,Biliary tract disease,098,OT NON-OR GI THER PRCS,261,Major biliary tract procedures,07,Diseases and Disorders of the Hepatobiliary System and Pancreas,2,Moderate,Moderate,Surgical,Medicare,Self-Pay,,,N,Y,25220.85,12126.00
Capital/Adirond,Albany,0101003,000004,Albany Memorial Hospital,50 to 69,122,F,Black/African American,Not Span/Hispanic,6,Emergency,Home or Self Care,2017,149,Biliary tract disease,098,OT NON-OR GI THER PRCS,261,Major biliary tract procedures,07,Diseases and Disorders of the Hepatobiliary System and Pancreas,2,Moderate,Moderate,Surgical,Medicaid,Self-Pay,Self-Pay,,N,Y,29176.56,10565.37
Hudson Valley,Orange,3523000,000699,Orange Regional Medical Center,30 to 49,109,M,Other Race,Spanish/Hispanic,5,Emergency,Home or Self Care,2017,152,Pancreatic disorders (not diabetes),098,OT NON-OR GI THER PRCS,261,Major biliary tract procedures,07,Diseases and Disorders of the Hepatobiliary System and Pancreas,3,Major,Moderate,Surgical,Medicare,Medicaid,,,N,Y,37410.28,10595.89
New York City,Bronx,7000006,001169,Montefiore Medical Center - Henry & Lucy Moses Div,50 to 69,109,F,Other Race,Not Span/Hispanic,20,Emergency,Skilled Nursing Home,2017,149,Biliary tract disease,098,OT NON-OR GI THER PRCS,261,Major biliary tract procedures,07,Diseases and Disorders of the Hepatobiliary System and Pancreas,3,Major,Major,Surgical,Federal/State/Local/VA,Medicaid,,,N,N,207703.18,44303.86
New York City,Bronx,7000006,001169,Montefiore Medical Center - Henry & Lucy Moses Div,18 to 29,104,F,Other Race,Spanish/Hispanic,4,Emergency,Home or Self Care,2017,149,Biliary tract disease,084,CHOLECYSTECTOMY/EXPLOR,261,Major biliary tract procedures,07,Diseases and Disorders of the Hepatobiliary System and Pancreas,1,Minor,Minor,Surgical,Medicaid,,,,N,Y,73103.38,18256.30
New York City,Bronx,7000006,001169,Montefiore Medical Center - Henry & Lucy Moses Div,50 to 69,125,F,White,Not Span/Hispanic,3,Emergency,Home or Self Care,2017,018,Cancer of other GI organs; peritoneum,087,LAPAROSCOPY,261,Major biliary tract procedures,07,Diseases and Disorders of the Hepatobiliary System and Pancreas,2,Moderate,Moderate,Surgical,Medicare,Private Health Insurance,,,N,N,90637.81,20117.36
New York City,Bronx,7000006,001169,Montefiore Medical Center - Henry & Lucy Moses Div,18 to 29,104,F,Other Race,Not Span/Hispanic,4,Emergency,Home or Self Care,2017,149,Biliary tract disease,084,CHOLECYSTECTOMY/EXPLOR,261,Major biliary tract procedures,07,Diseases and Disorders of the Hepatobiliary System and Pancreas,1,Minor,Minor,Surgical,Medicaid,,,,N,Y,88238.52,20685.79
New York City,Bronx,7000006,001169,Montefiore Medical Center - Henry & Lucy Moses Div,50 to 69,104,M,Other Race,Not Span/Hispanic,14,Emergency,Home or Self Care,2017,016,Cancer of liver and intrahepatic bile duct,098,OT NON-OR GI THER PRCS,261,Major biliary tract procedures,07,Diseases and Disorders of the Hepatobiliary System and Pancreas,3,Major,Major,Surgical,Medicare,Medicaid,,,N,Y,198415.11,45548.24
New York City,Bronx,7000006,001169,Montefiore Medical Center - Henry & Lucy Moses Div,0 to 17,104,M,Black/African American,Not Span/Hispanic,1,Emergency,Home or Self Care,2017,149,Biliary tract disease,098,OT NON-OR GI THER PRCS,261,Major biliary tract procedures,07,Diseases and Disorders of the Hepatobiliary System and Pancreas,3,Major,Minor,Surgical,Private Health Insurance,Medicaid,,,N,N,28815.60,10919.22
New York City,Bronx,7000006,003058,Montefiore Med Center - Jack D Weiler Hosp of A Einstein College Div,50 to 69,104,F,Other Race,Not Span/Hispanic,6,Elective,Home w/ Home Health Services,2017,149,Biliary tract disease,099,OT OR GI THER PRCS,261,Major biliary tract procedures,07,Diseases and Disorders of the Hepatobiliary System and Pancreas,2,Moderate,Minor,Surgical,Medicare,Medicaid,,,N,N,82754.25,18620.82
New York City,Bronx,7000006,003058,Montefiore Med Center - Jack D Weiler Hosp of A Einstein College Div,70 or Older,104,M,Other Race,Not Span/Hispanic,14,Emergency,Home w/ Home Health Services,2017,149,Biliary tract disease,084,CHOLECYSTECTOMY/EXPLOR,261,Major biliary tract procedures,07,Diseases and Disorders of the Hepatobiliary System and Pancreas,3,Major,Major,Surgical,Medicare,Medicaid,,,N,Y,218791.63,51033.19
New York City,Kings,7002002,001324,Mount Sinai Brooklyn,70 or Older,112,M,White,Not Span/Hispanic,4,Emergency,Home or Self Care,2017,149,Biliary tract disease,098,OT NON-OR GI THER PRCS,261,Major biliary tract procedures,07,Diseases and Disorders of the Hepatobiliary System and Pancreas,2,Moderate,Moderate,Surgical,Medicare,Medicaid,Self-Pay,,N,Y,51844.17,11864.11
New York City,Manhattan,7002024,001456,Mount Sinai Hospital,70 or Older,104,M,Other Race,Not Span/Hispanic,16,Urgent,Expired,2017,016,Cancer of liver and intrahepatic bile duct,216,RESP INTUB/MECH VENTIL,261,Major biliary tract procedures,07,Diseases and Disorders of the Hepatobiliary System and Pancreas,4,Extreme,Extreme,Surgical,Medicare,Medicare,Medicaid,,N,N,166893.22,62843.27
New York City,Richmond,7004003,001737,Staten Island University Hosp-South,70 or Older,103,F,White,Not Span/Hispanic,7,Emergency,Facility w/ Custodial/Supportive Care,2017,149,Biliary tract disease,098,OT NON-OR GI THER PRCS,261,Major biliary tract procedures,07,Diseases and Disorders of the Hepatobiliary System and Pancreas,3,Major,Major,Surgical,Medicare,Medicaid,,,N,Y,55782.53,12484.73
New York City,Richmond,7004003,001737,Staten Island University Hosp-South,70 or Older,103,F,White,Not Span/Hispanic,5,Emergency,Home or Self Care,2017,149,Biliary tract disease,098,OT NON-OR GI THER PRCS,261,Major biliary tract procedures,07,Diseases and Disorders of the Hepatobiliary System and Pancreas,1,Minor,Moderate,Surgical,Medicare,Private Health Insurance,,,N,Y,38282.72,9262.63
New York City,Richmond,7004003,001740,Staten Island University Hosp-North,70 or Older,103,F,White,Not Span/Hispanic,10,Emergency,Home w/ Home Health Services,2017,149,Biliary tract disease,098,OT NON-OR GI THER PRCS,261,Major biliary tract procedures,07,Diseases and Disorders of the Hepatobiliary System and Pancreas,4,Extreme,Extreme,Surgical,Medicare,Medicare,,,N,Y,91618.46,20970.98
New York City,Richmond,7004003,001740,Staten Island University Hosp-North,70 or Older,103,F,White,Not Span/Hispanic,7,Emergency,Skilled Nursing Home,2017,149,Biliary tract disease,098,OT NON-OR GI THER PRCS,261,Major biliary tract procedures,07,Diseases and Disorders of the Hepatobiliary System and Pancreas,3,Major,Major,Surgical,Medicare,Medicare,Medicaid,,N,Y,75110.91,16521.98
Capital/Adirond,Otsego,3824000,000746,Mary Imogene Bassett Hospital,70 or Older,121,M,White,Not Span/Hispanic,11,Urgent,Inpatient Rehabilitation Facility,2017,149,Biliary tract disease,098,OT NON-OR GI THER PRCS,261,Major biliary tract procedures,07,Diseases and Disorders of the Hepatobiliary System and Pancreas,3,Major,Major,Surgical,Medicare,Private Health Insurance,Self-Pay,,N,N,33053.21,20855.05
New York City,Bronx,7000006,001169,Montefiore Medical Center - Henry & Lucy Moses Div,50 to 69,104,F,Black/African American,Not Span/Hispanic,27,Emergency,Expired,2017,016,Cancer of liver and intrahepatic bile duct,097,OTHER GI DX PRCS,261,Major biliary tract procedures,07,Diseases and Disorders of the Hepatobiliary System and Pancreas,4,Extreme,Extreme,Surgical,Medicare,,,,N,Y,343067.19,88463.05
New York City,Kings,7002053,001304,NYU Langone Hospital-Brooklyn,70 or Older,112,M,Other Race,Not Span/Hispanic,16,Emergency,Skilled Nursing Home,2017,149,Biliary tract disease,231,OTHER THERAPEUTIC PRCS,261,Major biliary tract procedures,07,Diseases and Disorders of the Hepatobiliary System and Pancreas,3,Major,Major,Surgical,Medicare,,,,N,Y,350232.07,98059.58
New York City,Manhattan,7002053,001463,NYU Langone Hospitals,70 or Older,100,M,Other Race,Not Span/Hispanic,3,Emergency,Home w/ Home Health Services,2017,149,Biliary tract disease,098,OT NON-OR GI THER PRCS,261,Major biliary tract procedures,07,Diseases and Disorders of the Hepatobiliary System and Pancreas,2,Moderate,Moderate,Surgical,Private Health Insurance,,,,N,Y,76823.76,23062.97
Long Island,Suffolk,5157003,000943,St Catherine of Siena Hospital,30 to 49,117,M,White,Not Span/Hispanic,3,Emergency,Home or Self Care,2017,149,Biliary tract disease,098,OT NON-OR GI THER PRCS,261,Major biliary tract procedures,07,Diseases and Disorders of the Hepatobiliary System and Pancreas,2,Moderate,Minor,Surgical,Private Health Insurance,,,,N,Y,29253.00,4498.45
New York City,Bronx,7000024,001186,North Central Bronx Hospital,50 to 69,104,M,Other Race,Spanish/Hispanic,5,Emergency,Home w/ Home Health Services,2017,149,Biliary tract disease,098,OT NON-OR GI THER PRCS,261,Major biliary tract procedures,07,Diseases and Disorders of the Hepatobiliary System and Pancreas,2,Moderate,Minor,Surgical,Medicaid,,,,N,Y,38710.99,22373.29
New York City,Kings,7001020,001305,Maimonides Medical Center,30 to 49,112,M,White,Not Span/Hispanic,1,Emergency,Home or Self Care,2017,149,Biliary tract disease,099,OT OR GI THER PRCS,261,Major biliary tract procedures,07,Diseases and Disorders of the Hepatobiliary System and Pancreas,1,Minor,Minor,Surgical,Medicaid,,Self-Pay,,N,N,23830.00,8865.36
New York City,Kings,7001020,001305,Maimonides Medical Center,70 or Older,112,M,Other Race,Not Span/Hispanic,5,Emergency,Home w/ Home Health Services,2017,149,Biliary tract disease,098,OT NON-OR GI THER PRCS,261,Major biliary tract procedures,07,Diseases and Disorders of the Hepatobiliary System and Pancreas,2,Moderate,Minor,Surgical,Medicare,,Medicaid,,N,Y,67859.00,20773.14
New York City,Kings,7001020,001305,Maimonides Medical Center,70 or Older,112,F,Other Race,Not Span/Hispanic,10,Emergency,Skilled Nursing Home,2017,149,Biliary tract disease,098,OT NON-OR GI THER PRCS,261,Major biliary tract procedures,07,Diseases and Disorders of the Hepatobiliary System and Pancreas,2,Moderate,Minor,Surgical,Medicare,Medicaid,Self-Pay,,N,Y,190339.00,37078.91
New York City,Kings,7001020,001305,Maimonides Medical Center,70 or Older,112,M,White,Spanish/Hispanic,9,Emergency,Home or Self Care,2017,149,Biliary tract disease,097,OTHER GI DX PRCS,261,Major biliary tract procedures,07,Diseases and Disorders of the Hepatobiliary System and Pancreas,4,Extreme,Major,Surgical,Medicare,,Self-Pay,,N,Y,97423.00,30114.63
New York City,Kings,7001021,001306,New York - Presbyterian Brooklyn Methodist Hospital,50 to 69,112,M,Other Race,Not Span/Hispanic,7,Emergency,Home or Self Care,2017,042,Secondary malignancies,098,OT NON-OR GI THER PRCS,261,Major biliary tract procedures,07,Diseases and Disorders of the Hepatobiliary System and Pancreas,3,Major,Major,Surgical,Medicare,Medicare,Medicaid,,N,Y,83149.21,26263.30
New York City,Kings,7002002,001324,Mount Sinai Brooklyn,50 to 69,112,M,Black/African American,Not Span/Hispanic,15,Emergency,Short-term Hospital,2017,017,Cancer of pancreas,099,OT OR GI THER PRCS,261,Major biliary tract procedures,07,Diseases and Disorders of the Hepatobiliary System and Pancreas,3,Major,Major,Surgical,Medicare,Miscellaneous/Other,Self-Pay,,N,Y,123052.31,23350.03
New York City,Manhattan,7002002,001439,Mount Sinai Beth Israel,70 or Older,112,F,Black/African American,Unknown,10,Emergency,Home or Self Care,2017,018,Cancer of other GI organs; peritoneum,159,OT DX PRCS ON MUSC/SKEL,261,Major biliary tract procedures,07,Diseases and Disorders of the Hepatobiliary System and Pancreas,3,Major,Major,Surgical,Medicare,Miscellaneous/Other,Self-Pay,,N,Y,144485.47,38904.79
New York City,Manhattan,7002024,001456,Mount Sinai Hospital,50 to 69,113,F,Other Race,Not Span/Hispanic,1,Urgent,Home or Self Care,2017,149,Biliary tract disease,098,OT NON-OR GI THER PRCS,261,Major biliary tract procedures,07,Diseases and Disorders of the Hepatobiliary System and Pancreas,3,Major,Moderate,Surgical,Private Health Insurance,Medicare,Self-Pay,,N,N,15400.26,5539.77
New York City,Manhattan,7002054,001458,New York Presbyterian Hospital - New York Weill Cornell Center,50 to 69,117,M,White,Not Span/Hispanic,10,Emergency,Home w/ Home Health Services,2017,152,Pancreatic disorders (not diabetes),099,OT OR GI THER PRCS,261,Major biliary tract procedures,07,Diseases and Disorders of the Hepatobiliary System and Pancreas,2,Moderate,Minor,Surgical,Private Health Insurance,Self-Pay,,,N,N,185848.71,48492.99