Hospital Service Area,Hospital County,Operating Certificate Number,Permanent Facility Id,Facility Name,Age Group,Zip Code - 3 digits,Gender,Race,Ethnicity,Length of Stay,Type of Admission,Patient Disposition,Discharge Year,CCS Diagnosis Code,CCS Diagnosis Description,CCS Procedure Code,CCS Procedure Description,APR DRG Code,APR DRG Description,APR MDC Code,APR MDC Description,APR Severity of Illness Code,APR Severity of Illness Description,APR Risk of Mortality,APR Medical Surgical Description,Payment Typology 1,Payment Typology 2,Payment Typology 3,Birth Weight,Abortion Edit Indicator,Emergency Department Indicator,Total Charges,Total Costs
New York City,Manhattan,7002001,001438,Bellevue Hospital Center,30 to 49,104,F,Black/African American,Not Span/Hispanic,8,Emergency,Home or Self Care,2017,149,Biliary tract disease,210,OTHER RADIOISOTOPE SCAN,261,Major biliary tract procedures,07,Diseases and Disorders of the Hepatobiliary System and Pancreas,2,Moderate,Moderate,Surgical,Medicare,Medicare,Medicaid,,N,Y,49247.21,31752.04
New York City,Manhattan,7002001,001438,Bellevue Hospital Center,30 to 49,112,M,Other Race,Not Span/Hispanic,3,Emergency,Home or Self Care,2017,149,Biliary tract disease,098,OT NON-OR GI THER PRCS,261,Major biliary tract procedures,07,Diseases and Disorders of the Hepatobiliary System and Pancreas,1,Minor,Minor,Surgical,Self-Pay,,,,N,Y,20119.28,12971.87
New York City,Manhattan,7002001,001438,Bellevue Hospital Center,70 or Older,114,F,Black/African American,Not Span/Hispanic,18,Emergency,Skilled Nursing Home,2017,149,Biliary tract disease,098,OT NON-OR GI THER PRCS,261,Major biliary tract procedures,07,Diseases and Disorders of the Hepatobiliary System and Pancreas,3,Major,Major,Surgical,Medicare,,,,N,N,110998.27,71565.91
New York City,Manhattan,7002001,001438,Bellevue Hospital Center,50 to 69,112,F,Other Race,Not Span/Hispanic,3,Emergency,Home or Self Care,2017,149,Biliary tract disease,098,OT NON-OR GI THER PRCS,261,Major biliary tract procedures,07,Diseases and Disorders of the Hepatobiliary System and Pancreas,2,Moderate,Minor,Surgical,Medicare,Medicare,,,N,Y,20810.40,13417.46
New York City,Manhattan,7002001,001438,Bellevue Hospital Center,50 to 69,112,M,White,Not Span/Hispanic,13,Emergency,Home w/ Home Health Services,2017,149,Biliary tract disease,098,OT NON-OR GI THER PRCS,261,Major biliary tract procedures,07,Diseases and Disorders of the Hepatobiliary System and Pancreas,2,Moderate,Minor,Surgical,Medicare,Medicare,,,N,Y,69588.96,44867.34
New York City,Manhattan,7002001,001438,Bellevue Hospital Center,30 to 49,112,M,Other Race,Not Span/Hispanic,6,Emergency,Home or Self Care,2017,149,Biliary tract disease,098,OT NON-OR GI THER PRCS,261,Major biliary tract procedures,07,Diseases and Disorders of the Hepatobiliary System and Pancreas,2,Moderate,Minor,Surgical,Medicaid,,,,N,Y,41089.72,26492.51
New York City,Manhattan,7002001,001438,Bellevue Hospital Center,70 or Older,100,M,Other Race,Not Span/Hispanic,6,Emergency,Skilled Nursing Home,2017,149,Biliary tract disease,098,OT NON-OR GI THER PRCS,261,Major biliary tract procedures,07,Diseases and Disorders of the Hepatobiliary System and Pancreas,3,Major,Major,Surgical,Medicare,Medicare,Medicaid,,N,Y,40601.25,26177.57
New York City,Manhattan,7002001,001438,Bellevue Hospital Center,30 to 49,113,M,Other Race,Not Span/Hispanic,1,Emergency,Left Against Medical Advice,2017,149,Biliary tract disease,098,OT NON-OR GI THER PRCS,261,Major biliary tract procedures,07,Diseases and Disorders of the Hepatobiliary System and Pancreas,1,Minor,Minor,Surgical,Medicaid,Medicaid,,,N,N,6739.76,4345.45
New York City,Manhattan,7002001,001438,Bellevue Hospital Center,70 or Older,100,M,Other Race,Not Span/Hispanic,5,Emergency,Home or Self Care,2017,149,Biliary tract disease,098,OT NON-OR GI THER PRCS,261,Major biliary tract procedures,07,Diseases and Disorders of the Hepatobiliary System and Pancreas,2,Moderate,Moderate,Surgical,Medicare,Medicaid,,,N,Y,38248.97,24660.95
New York City,Manhattan,7002001,001438,Bellevue Hospital Center,50 to 69,100,M,Other Race,Not Span/Hispanic,6,Emergency,Home or Self Care,2017,149,Biliary tract disease,098,OT NON-OR GI THER PRCS,261,Major biliary tract procedures,07,Diseases and Disorders of the Hepatobiliary System and Pancreas,2,Moderate,Moderate,Surgical,Medicaid,Medicaid,,,N,Y,33893.99,21853.08
New York City,Manhattan,7002001,001438,Bellevue Hospital Center,18 to 29,104,M,Other Race,Not Span/Hispanic,5,Emergency,Home or Self Care,2017,149,Biliary tract disease,098,OT NON-OR GI THER PRCS,261,Major biliary tract procedures,07,Diseases and Disorders of the Hepatobiliary System and Pancreas,2,Moderate,Minor,Surgical,Medicaid,,,,N,N,31910.13,20573.99
New York City,Manhattan,7002001,001438,Bellevue Hospital Center,50 to 69,100,M,Black/African American,Not Span/Hispanic,28,Emergency,Home or Self Care,2017,017,Cancer of pancreas,098,OT NON-OR GI THER PRCS,261,Major biliary tract procedures,07,Diseases and Disorders of the Hepatobiliary System and Pancreas,3,Major,Major,Surgical,Blue Cross/Blue Shield,,,,N,Y,150636.19,97122.38
New York City,Manhattan,7002001,001438,Bellevue Hospital Center,50 to 69,112,M,Black/African American,Not Span/Hispanic,17,Emergency,Home or Self Care,2017,149,Biliary tract disease,084,CHOLECYSTECTOMY/EXPLOR,261,Major biliary tract procedures,07,Diseases and Disorders of the Hepatobiliary System and Pancreas,2,Moderate,Minor,Surgical,Department of Corrections,,,,N,Y,102268.16,65937.19
New York City,Manhattan,7002001,001438,Bellevue Hospital Center,70 or Older,100,M,Other Race,Not Span/Hispanic,38,Emergency,Home w/ Home Health Services,2017,149,Biliary tract disease,084,CHOLECYSTECTOMY/EXPLOR,261,Major biliary tract procedures,07,Diseases and Disorders of the Hepatobiliary System and Pancreas,3,Major,Major,Surgical,Medicare,Medicare,,,N,Y,219492.08,141517.08
