Hospital Service Area,Hospital County,Operating Certificate Number,Permanent Facility Id,Facility Name,Age Group,Zip Code - 3 digits,Gender,Race,Ethnicity,Length of Stay,Type of Admission,Patient Disposition,Discharge Year,CCS Diagnosis Code,CCS Diagnosis Description,CCS Procedure Code,CCS Procedure Description,APR DRG Code,APR DRG Description,APR MDC Code,APR MDC Description,APR Severity of Illness Code,APR Severity of Illness Description,APR Risk of Mortality,APR Medical Surgical Description,Payment Typology 1,Payment Typology 2,Payment Typology 3,Birth Weight,Abortion Edit Indicator,Emergency Department Indicator,Total Charges,Total Costs
Long Island,Nassau,2908000,000511,NYU Winthrop Hospital,50 to 69,115,M,White,Not Span/Hispanic,2,Elective,Home w/ Home Health Services,2017,149,Biliary tract disease,084,CHOLECYSTECTOMY/EXPLOR,261,Major biliary tract procedures,07,Diseases and Disorders of the Hepatobiliary System and Pancreas,2,Moderate,Minor,Surgical,Medicare,Medicare,Blue Cross/Blue Shield,,N,N,51799.50,15042.20
Long Island,Nassau,2908000,000511,NYU Winthrop Hospital,70 or Older,115,F,White,Not Span/Hispanic,7,Emergency,Home w/ Home Health Services,2017,149,Biliary tract disease,098,OT NON-OR GI THER PRCS,261,Major biliary tract procedures,07,Diseases and Disorders of the Hepatobiliary System and Pancreas,2,Moderate,Moderate,Surgical,Medicare,Medicare,Blue Cross/Blue Shield,,N,Y,95511.19,19584.97
Long Island,Nassau,2908000,000511,NYU Winthrop Hospital,70 or Older,117,F,White,Not Span/Hispanic,7,Emergency,Skilled Nursing Home,2017,149,Biliary tract disease,098,OT NON-OR GI THER PRCS,261,Major biliary tract procedures,07,Diseases and Disorders of the Hepatobiliary System and Pancreas,3,Major,Extreme,Surgical,Medicare,Medicare,Private Health Insurance,,N,Y,78835.86,16398.23
Long Island,Nassau,2908000,000511,NYU Winthrop Hospital,70 or Older,117,M,White,Not Span/Hispanic,4,Elective,Home w/ Home Health Services,2017,149,Biliary tract disease,084,CHOLECYSTECTOMY/EXPLOR,261,Major biliary tract procedures,07,Diseases and Disorders of the Hepatobiliary System and Pancreas,3,Major,Major,Surgical,Medicare,Medicare,Private Health Insurance,,N,N,138043.15,36912.80
Long Island,Nassau,2908000,000511,NYU Winthrop Hospital,50 to 69,103,F,White,Not Span/Hispanic,2,Urgent,Home or Self Care,2017,149,Biliary tract disease,099,OT OR GI THER PRCS,261,Major biliary tract procedures,07,Diseases and Disorders of the Hepatobiliary System and Pancreas,2,Moderate,Minor,Surgical,Federal/State/Local/VA,,,,N,N,24463.33,7591.43
Long Island,Nassau,2908000,000511,NYU Winthrop Hospital,50 to 69,115,M,White,Not Span/Hispanic,12,Emergency,Home w/ Home Health Services,2017,017,Cancer of pancreas,099,OT OR GI THER PRCS,261,Major biliary tract procedures,07,Diseases and Disorders of the Hepatobiliary System and Pancreas,4,Extreme,Moderate,Surgical,Blue Cross/Blue Shield,,,,N,Y,134316.41,31194.53
Long Island,Nassau,2908000,000511,NYU Winthrop Hospital,50 to 69,117,M,White,Not Span/Hispanic,4,Elective,Home or Self Care,2017,152,Pancreatic disorders (not diabetes),084,CHOLECYSTECTOMY/EXPLOR,261,Major biliary tract procedures,07,Diseases and Disorders of the Hepatobiliary System and Pancreas,3,Major,Major,Surgical,Medicaid,Medicaid,,,N,N,77505.75,22729.11
Long Island,Nassau,2908000,000511,NYU Winthrop Hospital,50 to 69,110,M,White,Not Span/Hispanic,10,Emergency,Home w/ Home Health Services,2017,017,Cancer of pancreas,099,OT OR GI THER PRCS,261,Major biliary tract procedures,07,Diseases and Disorders of the Hepatobiliary System and Pancreas,4,Extreme,Moderate,Surgical,Blue Cross/Blue Shield,Blue Cross/Blue Shield,,,N,Y,173218.48,45863.99
Long Island,Nassau,2908000,000511,NYU Winthrop Hospital,70 or Older,117,F,White,Not Span/Hispanic,8,Emergency,Home w/ Home Health Services,2017,149,Biliary tract disease,098,OT NON-OR GI THER PRCS,261,Major biliary tract procedures,07,Diseases and Disorders of the Hepatobiliary System and Pancreas,3,Major,Major,Surgical,Medicare,Medicare,Blue Cross/Blue Shield,,N,Y,109597.88,22651.81
Long Island,Nassau,2908000,000511,NYU Winthrop Hospital,50 to 69,115,F,White,Spanish/Hispanic,4,Emergency,Home w/ Home Health Services,2017,149,Biliary tract disease,098,OT NON-OR GI THER PRCS,261,Major biliary tract procedures,07,Diseases and Disorders of the Hepatobiliary System and Pancreas,1,Minor,Minor,Surgical,Medicare,Medicare,Medicaid,,N,Y,63203.50,15327.83
Long Island,Nassau,2908000,000511,NYU Winthrop Hospital,50 to 69,117,M,White,Not Span/Hispanic,1,Emergency,Home w/ Home Health Services,2017,149,Biliary tract disease,098,OT NON-OR GI THER PRCS,261,Major biliary tract procedures,07,Diseases and Disorders of the Hepatobiliary System and Pancreas,3,Major,Major,Surgical,Medicare,Medicare,,,N,Y,53471.60,12366.64
Long Island,Nassau,2908000,000511,NYU Winthrop Hospital,0 to 17,115,F,White,Spanish/Hispanic,7,Emergency,Home w/ Home Health Services,2017,214,Digestive congenital anomalies,099,OT OR GI THER PRCS,261,Major biliary tract procedures,07,Diseases and Disorders of the Hepatobiliary System and Pancreas,2,Moderate,Minor,Surgical,Medicaid,Medicaid,,,N,Y,135263.42,30637.71
Long Island,Nassau,2908000,000511,NYU Winthrop Hospital,50 to 69,115,F,White,Not Span/Hispanic,12,Emergency,Inpatient Rehabilitation Facility,2017,149,Biliary tract disease,098,OT NON-OR GI THER PRCS,261,Major biliary tract procedures,07,Diseases and Disorders of the Hepatobiliary System and Pancreas,3,Major,Major,Surgical,Medicare,Medicaid,,,N,Y,147668.01,33388.50
Long Island,Nassau,2908000,000511,NYU Winthrop Hospital,70 or Older,115,M,White,Not Span/Hispanic,6,Emergency,Home or Self Care,2017,152,Pancreatic disorders (not diabetes),097,OTHER GI DX PRCS,261,Major biliary tract procedures,07,Diseases and Disorders of the Hepatobiliary System and Pancreas,3,Major,Moderate,Surgical,Medicare,Medicare,Private Health Insurance,,N,Y,71761.61,14869.82
Long Island,Nassau,2908000,000511,NYU Winthrop Hospital,50 to 69,115,F,Other Race,Spanish/Hispanic,6,Emergency,Home w/ Home Health Services,2017,149,Biliary tract disease,098,OT NON-OR GI THER PRCS,261,Major biliary tract procedures,07,Diseases and Disorders of the Hepatobiliary System and Pancreas,2,Moderate,Moderate,Surgical,Medicare,Medicare,Medicaid,,N,Y,53282.66,12988.04
Long Island,Nassau,2908000,000511,NYU Winthrop Hospital,70 or Older,115,F,White,Not Span/Hispanic,7,Emergency,Skilled Nursing Home,2017,149,Biliary tract disease,098,OT NON-OR GI THER PRCS,261,Major biliary tract procedures,07,Diseases and Disorders of the Hepatobiliary System and Pancreas,3,Major,Major,Surgical,Medicare,Medicare,Private Health Insurance,,N,Y,151977.48,35281.12
Long Island,Nassau,2908000,000511,NYU Winthrop Hospital,50 to 69,117,M,White,Not Span/Hispanic,1,Elective,Home or Self Care,2017,149,Biliary tract disease,098,OT NON-OR GI THER PRCS,261,Major biliary tract procedures,07,Diseases and Disorders of the Hepatobiliary System and Pancreas,2,Moderate,Moderate,Surgical,Federal/State/Local/VA,,,,N,N,138082.02,27055.09
Long Island,Nassau,2908000,000511,NYU Winthrop Hospital,70 or Older,115,M,White,Not Span/Hispanic,20,Urgent,Skilled Nursing Home,2017,149,Biliary tract disease,099,OT OR GI THER PRCS,261,Major biliary tract procedures,07,Diseases and Disorders of the Hepatobiliary System and Pancreas,4,Extreme,Extreme,Surgical,Medicare,Medicare,Blue Cross/Blue Shield,,N,N,405485.21,105817.53
Long Island,Nassau,2908000,000511,NYU Winthrop Hospital,70 or Older,115,M,Black/African American,Not Span/Hispanic,2,Emergency,Home w/ Home Health Services,2017,149,Biliary tract disease,098,OT NON-OR GI THER PRCS,261,Major biliary tract procedures,07,Diseases and Disorders of the Hepatobiliary System and Pancreas,1,Minor,Moderate,Surgical,Medicare,Medicare,Private Health Insurance,,N,Y,30721.13,8139.89
Long Island,Nassau,2908000,000511,NYU Winthrop Hospital,70 or Older,114,F,White,Spanish/Hispanic,3,Elective,Home w/ Home Health Services,2017,149,Biliary tract disease,099,OT OR GI THER PRCS,261,Major biliary tract procedures,07,Diseases and Disorders of the Hepatobiliary System and Pancreas,2,Moderate,Moderate,Surgical,Medicaid,Medicaid,,,N,N,102804.36,31526.19
Long Island,Nassau,2908000,000511,NYU Winthrop Hospital,70 or Older,110,M,Other Race,Not Span/Hispanic,15,Emergency,Home w/ Home Health Services,2017,152,Pancreatic disorders (not diabetes),099,OT OR GI THER PRCS,261,Major biliary tract procedures,07,Diseases and Disorders of the Hepatobiliary System and Pancreas,2,Moderate,Moderate,Surgical,Medicare,Medicare,Medicaid,,N,Y,368400.62,93019.12
Long Island,Nassau,2908000,000511,NYU Winthrop Hospital,70 or Older,118,F,White,Not Span/Hispanic,8,Emergency,Home w/ Home Health Services,2017,149,Biliary tract disease,082,ENDO RETRO CAN OF PANCR,261,Major biliary tract procedures,07,Diseases and Disorders of the Hepatobiliary System and Pancreas,2,Moderate,Major,Surgical,Medicare,Medicare,Private Health Insurance,,N,Y,147953.08,27691.17
Long Island,Nassau,2908000,000511,NYU Winthrop Hospital,50 to 69,117,M,White,Not Span/Hispanic,12,Emergency,Home w/ Home Health Services,2017,149,Biliary tract disease,098,OT NON-OR GI THER PRCS,261,Major biliary tract procedures,07,Diseases and Disorders of the Hepatobiliary System and Pancreas,4,Extreme,Extreme,Surgical,Blue Cross/Blue Shield,,,,N,Y,210732.16,48718.22
Long Island,Nassau,2908000,000511,NYU Winthrop Hospital,70 or Older,115,M,White,Not Span/Hispanic,3,Emergency,Home w/ Home Health Services,2017,042,Secondary malignancies,061,OT OR PRCS VES NOT HEAD,261,Major biliary tract procedures,07,Diseases and Disorders of the Hepatobiliary System and Pancreas,2,Moderate,Moderate,Surgical,Medicare,Medicare,Private Health Insurance,,N,Y,216033.85,58696.16
Long Island,Nassau,2908000,000511,NYU Winthrop Hospital,50 to 69,115,M,White,Not Span/Hispanic,7,Emergency,Home w/ Home Health Services,2017,149,Biliary tract disease,098,OT NON-OR GI THER PRCS,261,Major biliary tract procedures,07,Diseases and Disorders of the Hepatobiliary System and Pancreas,4,Extreme,Extreme,Surgical,Medicare,Medicare,Private Health Insurance,,N,Y,80201.67,17953.37
