Hospital Service Area,Hospital County,Operating Certificate Number,Permanent Facility Id,Facility Name,Age Group,Zip Code - 3 digits,Gender,Race,Ethnicity,Length of Stay,Type of Admission,Patient Disposition,Discharge Year,CCS Diagnosis Code,CCS Diagnosis Description,CCS Procedure Code,CCS Procedure Description,APR DRG Code,APR DRG Description,APR MDC Code,APR MDC Description,APR Severity of Illness Code,APR Severity of Illness Description,APR Risk of Mortality,APR Medical Surgical Description,Payment Typology 1,Payment Typology 2,Payment Typology 3,Birth Weight,Abortion Edit Indicator,Emergency Department Indicator,Total Charges,Total Costs
New York City,Manhattan,7002054,001458,New York-Presbyterian Hospital - New York Weill Cornell Center,50 to 69,112,M,White,Not Span/Hispanic,8,Emergency,Home or Self Care,2019,DIG017,BILIARY TRACT DISEASE,HEP006,CHOLECYSTECTOMY,261,MAJOR BILIARY TRACT PROCEDURES,07,DISEASES AND DISORDERS OF THE HEPATOBILIARY SYSTEM AND PANCREAS,2,Moderate,Minor,Surgical,Medicare,Private Health Insurance,Self-Pay,,,true,120051.43,29390.62
Capital/Adirond,Albany,0101004,000005,St. Peter's Hospital,50 to 69,122,F,Other Race,Not Span/Hispanic,3,Elective,Home or Self Care,2019,DIG017,BILIARY TRACT DISEASE,HEP002,PANCREATICOBILIARY BIOPSY,261,MAJOR BILIARY TRACT PROCEDURES,07,DISEASES AND DISORDERS OF THE HEPATOBILIARY SYSTEM AND PANCREAS,2,Moderate,Minor,Surgical,Medicare,Medicare,,,,false,43278.8,16580.3
New York City,Manhattan,7002054,001464,New York-Presbyterian Hospital - Columbia Presbyterian Center,50 to 69,OOS,M,Other Race,Not Span/Hispanic,8,Elective,Home w/ Home Health Services,2019,NEO018,GASTROINTESTINAL CANCERS - BILE DUCT,HEP004,HEPATOBILIARY RESECTION AND ABLATION,261,MAJOR BILIARY TRACT PROCEDURES,07,DISEASES AND DISORDERS OF THE HEPATOBILIARY SYSTEM AND PANCREAS,3,Major,Major,Surgical,Medicare,Blue Cross/Blue Shield,Self-Pay,,,false,127201.04,32313.91
New York City,Manhattan,7002054,001464,New York-Presbyterian Hospital - Columbia Presbyterian Center,18 to 29,,M,White,Not Span/Hispanic,5,Emergency,Home or Self Care,2019,DIG017,BILIARY TRACT DISEASE,HEP010,HEPATOBILIARY AND PANCREATIC DRAINAGE,261,MAJOR BILIARY TRACT PROCEDURES,07,DISEASES AND DISORDERS OF THE HEPATOBILIARY SYSTEM AND PANCREAS,3,Major,Moderate,Surgical,Private Health Insurance,Self-Pay,,,,false,66500.62,15224.39
Capital/Adirond,Schenectady,4601001,000829,Ellis Hospital,70 or Older,121,F,White,Not Span/Hispanic,9,Elective,Home w/ Home Health Services,2019,DIG017,BILIARY TRACT DISEASE,HEP013,"HEPATOBILIARY AND PANCREATIC PROCEDURES, NEC",261,MAJOR BILIARY TRACT PROCEDURES,07,DISEASES AND DISORDERS OF THE HEPATOBILIARY SYSTEM AND PANCREAS,2,Moderate,Minor,Surgical,Medicare,Medicare,Private Health Insurance,,,false,44034.05,14483.04
New York City,Manhattan,7002053,001463,NYU Langone Hospitals,0 to 17,112,M,Other Race,Not Span/Hispanic,5,Elective,Home or Self Care,2019,MAL002,DIGESTIVE CONGENITAL ANOMALIES,HEP013,"HEPATOBILIARY AND PANCREATIC PROCEDURES, NEC",261,MAJOR BILIARY TRACT PROCEDURES,07,DISEASES AND DISORDERS OF THE HEPATOBILIARY SYSTEM AND PANCREAS,3,Major,Moderate,Surgical,Medicaid,,,,,false,130262.58,28734.26
New York City,Manhattan,7002054,001464,New York-Presbyterian Hospital - Columbia Presbyterian Center,0 to 17,100,M,Multi-racial,Not Span/Hispanic,3,Urgent,Home or Self Care,2019,MAL002,DIGESTIVE CONGENITAL ANOMALIES,HEP013,"HEPATOBILIARY AND PANCREATIC PROCEDURES, NEC",261,MAJOR BILIARY TRACT PROCEDURES,07,DISEASES AND DISORDERS OF THE HEPATOBILIARY SYSTEM AND PANCREAS,2,Moderate,Minor,Surgical,Private Health Insurance,Self-Pay,,,,false,99558.94,41768.88
Hudson Valley,Westchester,5957001,001139,Westchester Medical Center,0 to 17,109,M,Other Race,Unknown,2,Emergency,Home or Self Care,2019,DIG017,BILIARY TRACT DISEASE,HEP006,CHOLECYSTECTOMY,261,MAJOR BILIARY TRACT PROCEDURES,07,DISEASES AND DISORDERS OF THE HEPATOBILIARY SYSTEM AND PANCREAS,2,Moderate,Minor,Surgical,Medicaid,,,,,true,78373.57,13567.31
New York City,Manhattan,7002054,001464,New York-Presbyterian Hospital - Columbia Presbyterian Center,0 to 17,,F,Other Race,Not Span/Hispanic,4,Elective,Home or Self Care,2019,MAL002,DIGESTIVE CONGENITAL ANOMALIES,HEP013,"HEPATOBILIARY AND PANCREATIC PROCEDURES, NEC",261,MAJOR BILIARY TRACT PROCEDURES,07,DISEASES AND DISORDERS OF THE HEPATOBILIARY SYSTEM AND PANCREAS,3,Major,Minor,Surgical,Medicaid,Medicaid,Self-Pay,,,false,102967.27,42294.91
New York City,Manhattan,7002054,001464,New York-Presbyterian Hospital - Columbia Presbyterian Center,0 to 17,OOS,F,White,Not Span/Hispanic,3,Elective,Home or Self Care,2019,MAL002,DIGESTIVE CONGENITAL ANOMALIES,HEP013,"HEPATOBILIARY AND PANCREATIC PROCEDURES, NEC",261,MAJOR BILIARY TRACT PROCEDURES,07,DISEASES AND DISORDERS OF THE HEPATOBILIARY SYSTEM AND PANCREAS,3,Major,Minor,Surgical,Private Health Insurance,Self-Pay,,,,false,91603.95,34884.48
New York City,Queens,7003010,001637,New York - Presbyterian/Queens,50 to 69,113,M,White,Not Span/Hispanic,11,Emergency,Home or Self Care,2019,DIG017,BILIARY TRACT DISEASE,HEP006,CHOLECYSTECTOMY,261,MAJOR BILIARY TRACT PROCEDURES,07,DISEASES AND DISORDERS OF THE HEPATOBILIARY SYSTEM AND PANCREAS,2,Moderate,Moderate,Surgical,Medicare,Medicare,Medicaid,,,true,121530.27,43601.47
Western NY,Erie,1401014,000207,Buffalo General Medical Center,50 to 69,140,M,White,Not Span/Hispanic,14,Elective,Home w/ Home Health Services,2019,DIG017,BILIARY TRACT DISEASE,HEP013,"HEPATOBILIARY AND PANCREATIC PROCEDURES, NEC",261,MAJOR BILIARY TRACT PROCEDURES,07,DISEASES AND DISORDERS OF THE HEPATOBILIARY SYSTEM AND PANCREAS,3,Major,Major,Surgical,Medicare,Blue Cross/Blue Shield,Self-Pay,,,false,121674.58,43752.46
Long Island,Nassau,2951001,000541,North Shore University Hospital,18 to 29,110,F,Other Race,Spanish/Hispanic,2,Emergency,Home or Self Care,2019,DIG017,BILIARY TRACT DISEASE,HEP007,BILIARY AND PANCREATIC CALCULUS REMOVAL,261,MAJOR BILIARY TRACT PROCEDURES,07,DISEASES AND DISORDERS OF THE HEPATOBILIARY SYSTEM AND PANCREAS,2,Moderate,Minor,Surgical,Medicaid,,,,,true,55391.74,12924.69
Long Island,Nassau,2908000,000511,NYU Langone Hospital-Long Island,70 or Older,115,M,White,Not Span/Hispanic,16,Emergency,Skilled Nursing Home,2019,DIG017,BILIARY TRACT DISEASE,HEP013,"HEPATOBILIARY AND PANCREATIC PROCEDURES, NEC",261,MAJOR BILIARY TRACT PROCEDURES,07,DISEASES AND DISORDERS OF THE HEPATOBILIARY SYSTEM AND PANCREAS,3,Major,Extreme,Surgical,Medicare,Medicare,Private Health Insurance,,,true,277466.93,46402.23
Finger Lakes,Monroe,2701005,000413,Strong Memorial Hospital,70 or Older,144,F,White,Not Span/Hispanic,12,Emergency,Hospice - Medical Facility,2019,NEO051,ENDOCRINE SYSTEM CANCERS - PANCREAS,GIS027,"UPPER GI THERAPEUTIC PROCEDURES, NEC (ENDOSCOPIC)",261,MAJOR BILIARY TRACT PROCEDURES,07,DISEASES AND DISORDERS OF THE HEPATOBILIARY SYSTEM AND PANCREAS,4,Extreme,Major,Surgical,Medicare,,,,,true,56178.28,25723.96
Hudson Valley,Westchester,5932000,001129,Phelps Hospital,70 or Older,109,M,White,Not Span/Hispanic,8,Urgent,Expired,2019,DIG017,BILIARY TRACT DISEASE,ADM002,TRANSFUSION OF PLASMA,261,MAJOR BILIARY TRACT PROCEDURES,07,DISEASES AND DISORDERS OF THE HEPATOBILIARY SYSTEM AND PANCREAS,4,Extreme,Major,Surgical,Medicare,Private Health Insurance,,,,false,145241.91,55812.61
Western NY,Erie,1401014,000207,Buffalo General Medical Center,50 to 69,148,F,White,Not Span/Hispanic,3,Elective,Home w/ Home Health Services,2019,DIG017,BILIARY TRACT DISEASE,HEP006,CHOLECYSTECTOMY,261,MAJOR BILIARY TRACT PROCEDURES,07,DISEASES AND DISORDERS OF THE HEPATOBILIARY SYSTEM AND PANCREAS,2,Moderate,Minor,Surgical,Medicare,Self-Pay,,,,false,76906.67,23521.03
New York City,Manhattan,7002054,001464,New York-Presbyterian Hospital - Columbia Presbyterian Center,70 or Older,104,F,Other Race,Spanish/Hispanic,11,Emergency,Skilled Nursing Home,2019,DIG017,BILIARY TRACT DISEASE,HEP013,"HEPATOBILIARY AND PANCREATIC PROCEDURES, NEC",261,MAJOR BILIARY TRACT PROCEDURES,07,DISEASES AND DISORDERS OF THE HEPATOBILIARY SYSTEM AND PANCREAS,3,Major,Major,Surgical,Medicaid,Self-Pay,,,,true,115926.26,25814.89
Finger Lakes,Monroe,2701003,000411,Rochester General Hospital,50 to 69,146,M,Black/African American,Not Span/Hispanic,3,Emergency,Home or Self Care,2019,DIG017,BILIARY TRACT DISEASE,HEP007,BILIARY AND PANCREATIC CALCULUS REMOVAL,261,MAJOR BILIARY TRACT PROCEDURES,07,DISEASES AND DISORDERS OF THE HEPATOBILIARY SYSTEM AND PANCREAS,2,Moderate,Minor,Surgical,Blue Cross/Blue Shield,,,,,true,21664.49,9393.76
New York City,Manhattan,7002054,001458,New York-Presbyterian Hospital - New York Weill Cornell Center,50 to 69,OOS,F,Other Race,Not Span/Hispanic,7,Elective,Home or Self Care,2019,NEO018,GASTROINTESTINAL CANCERS - BILE DUCT,HEP013,"HEPATOBILIARY AND PANCREATIC PROCEDURES, NEC",261,MAJOR BILIARY TRACT PROCEDURES,07,DISEASES AND DISORDERS OF THE HEPATOBILIARY SYSTEM AND PANCREAS,3,Major,Minor,Surgical,Medicare,Medicare,Self-Pay,,,false,159681.05,42649.12
New York City,Manhattan,7002054,001458,New York-Presbyterian Hospital - New York Weill Cornell Center,70 or Older,100,M,Other Race,Not Span/Hispanic,6,Elective,Home w/ Home Health Services,2019,NEO021,GASTROINTESTINAL CANCERS - ALL OTHER TYPES,HEP004,HEPATOBILIARY RESECTION AND ABLATION,261,MAJOR BILIARY TRACT PROCEDURES,07,DISEASES AND DISORDERS OF THE HEPATOBILIARY SYSTEM AND PANCREAS,2,Moderate,Moderate,Surgical,Medicare,Blue Cross/Blue Shield,Self-Pay,,,false,130654.7,33821.85
Central NY,Oneida,3202002,000598,St Elizabeth Medical Center,70 or Older,135,M,White,Not Span/Hispanic,3,Elective,Home or Self Care,2019,DIG017,BILIARY TRACT DISEASE,HEP010,HEPATOBILIARY AND PANCREATIC DRAINAGE,261,MAJOR BILIARY TRACT PROCEDURES,07,DISEASES AND DISORDERS OF THE HEPATOBILIARY SYSTEM AND PANCREAS,3,Major,Moderate,Surgical,Medicare,Private Health Insurance,,,,false,26295.95,10870.62
Long Island,Nassau,2908000,000511,NYU Langone Hospital-Long Island,50 to 69,115,M,Black/African American,Not Span/Hispanic,3,Elective,Home or Self Care,2019,NEO021,GASTROINTESTINAL CANCERS - ALL OTHER TYPES,HEP004,HEPATOBILIARY RESECTION AND ABLATION,261,MAJOR BILIARY TRACT PROCEDURES,07,DISEASES AND DISORDERS OF THE HEPATOBILIARY SYSTEM AND PANCREAS,2,Moderate,Minor,Surgical,Medicare,Medicare,,,,false,78168.65,13246.18
Hudson Valley,Dutchess,1302001,000181,Vassar Brothers Medical Center,50 to 69,125,M,White,Not Span/Hispanic,3,Elective,Home or Self Care,2019,DIG017,BILIARY TRACT DISEASE,HEP006,CHOLECYSTECTOMY,261,MAJOR BILIARY TRACT PROCEDURES,07,DISEASES AND DISORDERS OF THE HEPATOBILIARY SYSTEM AND PANCREAS,2,Moderate,Minor,Surgical,Private Health Insurance,Medicaid,,,,false,59796,24741.77
New York City,Manhattan,7002053,001463,NYU Langone Hospitals,30 to 49,OOS,M,White,Not Span/Hispanic,13,Emergency,Home w/ Home Health Services,2019,DIG017,BILIARY TRACT DISEASE,HEP013,"HEPATOBILIARY AND PANCREATIC PROCEDURES, NEC",261,MAJOR BILIARY TRACT PROCEDURES,07,DISEASES AND DISORDERS OF THE HEPATOBILIARY SYSTEM AND PANCREAS,4,Extreme,Major,Surgical,Medicare,Medicaid,,,,true,365093.94,109672.65
New York City,Manhattan,7002054,001464,New York-Presbyterian Hospital - Columbia Presbyterian Center,70 or Older,113,F,Other Race,Not Span/Hispanic,6,Urgent,Home w/ Home Health Services,2019,DIG017,BILIARY TRACT DISEASE,HEP006,CHOLECYSTECTOMY,261,MAJOR BILIARY TRACT PROCEDURES,07,DISEASES AND DISORDERS OF THE HEPATOBILIARY SYSTEM AND PANCREAS,3,Major,Major,Surgical,Medicaid,Medicaid,Self-Pay,,,false,99086.49,25515.32
New York City,Manhattan,7002054,001458,New York-Presbyterian Hospital - New York Weill Cornell Center,70 or Older,100,F,Other Race,Not Span/Hispanic,23,Emergency,Home w/ Home Health Services,2019,DIG020,PANCREATIC DISORDERS (EXCLUDING DIABETES),HEP013,"HEPATOBILIARY AND PANCREATIC PROCEDURES, NEC",261,MAJOR BILIARY TRACT PROCEDURES,07,DISEASES AND DISORDERS OF THE HEPATOBILIARY SYSTEM AND PANCREAS,4,Extreme,Extreme,Surgical,Medicare,Medicaid,Self-Pay,,,true,333298.11,82826.49
New York City,Kings,7001035,001318,Wyckoff Heights Medical Center,50 to 69,112,M,Other Race,Not Span/Hispanic,4,Emergency,Home or Self Care,2019,DIG017,BILIARY TRACT DISEASE,HEP007,BILIARY AND PANCREATIC CALCULUS REMOVAL,261,MAJOR BILIARY TRACT PROCEDURES,07,DISEASES AND DISORDERS OF THE HEPATOBILIARY SYSTEM AND PANCREAS,1,Minor,Minor,Surgical,Blue Cross/Blue Shield,,,,,true,32032.48,14930.93
New York City,Manhattan,7002054,001464,New York-Presbyterian Hospital - Columbia Presbyterian Center,70 or Older,100,M,Multi-racial,Spanish/Hispanic,10,Elective,Expired,2019,NEO051,ENDOCRINE SYSTEM CANCERS - PANCREAS,HEP013,"HEPATOBILIARY AND PANCREATIC PROCEDURES, NEC",261,MAJOR BILIARY TRACT PROCEDURES,07,DISEASES AND DISORDERS OF THE HEPATOBILIARY SYSTEM AND PANCREAS,4,Extreme,Extreme,Surgical,Medicare,Medicaid,Self-Pay,,,false,310973.67,129216.66
New York City,Queens,7003004,001630,Long Island Jewish Medical Center,70 or Older,114,M,Other Race,Spanish/Hispanic,5,Elective,Home w/ Home Health Services,2019,NEO018,GASTROINTESTINAL CANCERS - BILE DUCT,HEP013,"HEPATOBILIARY AND PANCREATIC PROCEDURES, NEC",261,MAJOR BILIARY TRACT PROCEDURES,07,DISEASES AND DISORDERS OF THE HEPATOBILIARY SYSTEM AND PANCREAS,2,Moderate,Minor,Surgical,Medicaid,Medicaid,Self-Pay,,,false,95892.75,20733.6
New York City,Kings,7001020,001305,Maimonides Medical Center,70 or Older,112,F,White,Not Span/Hispanic,6,Urgent,Home or Self Care,2019,NEO073,BENIGN NEOPLASMS,HEP005,PANCREATECTOMY,261,MAJOR BILIARY TRACT PROCEDURES,07,DISEASES AND DISORDERS OF THE HEPATOBILIARY SYSTEM AND PANCREAS,2,Moderate,Minor,Surgical,Medicare,Medicare,Self-Pay,,,false,75130.04,24953.7
New York City,Manhattan,7002020,001453,Memorial Hospital for Cancer and Allied Diseases,70 or Older,103,M,White,Not Span/Hispanic,1,Elective,Home or Self Care,2019,DIG017,BILIARY TRACT DISEASE,HEP010,HEPATOBILIARY AND PANCREATIC DRAINAGE,261,MAJOR BILIARY TRACT PROCEDURES,07,DISEASES AND DISORDERS OF THE HEPATOBILIARY SYSTEM AND PANCREAS,2,Moderate,Major,Surgical,Medicare,Private Health Insurance,,,,false,81967.64,36472.55
New York City,Manhattan,7002020,001453,Memorial Hospital for Cancer and Allied Diseases,70 or Older,113,M,White,Not Span/Hispanic,8,Elective,Home or Self Care,2019,DIG017,BILIARY TRACT DISEASE,HEP013,"HEPATOBILIARY AND PANCREATIC PROCEDURES, NEC",261,MAJOR BILIARY TRACT PROCEDURES,07,DISEASES AND DISORDERS OF THE HEPATOBILIARY SYSTEM AND PANCREAS,2,Moderate,Minor,Surgical,Medicare,,,,,false,103353.15,41483.22
Finger Lakes,Monroe,2701005,000413,Strong Memorial Hospital,50 to 69,145,M,White,Not Span/Hispanic,5,Elective,Home or Self Care,2019,MAL002,DIGESTIVE CONGENITAL ANOMALIES,HEP006,CHOLECYSTECTOMY,261,MAJOR BILIARY TRACT PROCEDURES,07,DISEASES AND DISORDERS OF THE HEPATOBILIARY SYSTEM AND PANCREAS,2,Moderate,Minor,Surgical,Medicaid,,,,,false,49351.2,27084.88
New York City,Queens,7003004,003376,Cohen Children's Medical Center,0 to 17,103,F,White,Not Span/Hispanic,6,Urgent,Home or Self Care,2019,MAL002,DIGESTIVE CONGENITAL ANOMALIES,HEP013,"HEPATOBILIARY AND PANCREATIC PROCEDURES, NEC",261,MAJOR BILIARY TRACT PROCEDURES,07,DISEASES AND DISORDERS OF THE HEPATOBILIARY SYSTEM AND PANCREAS,3,Major,Moderate,Surgical,Medicaid,Medicaid,Self-Pay,,,false,131697.11,39563.71
New York City,Manhattan,7002024,001456,Mount Sinai Hospital,50 to 69,112,M,Other Race,Not Span/Hispanic,14,Emergency,Home or Self Care,2019,NEO021,GASTROINTESTINAL CANCERS - ALL OTHER TYPES,HEP008,COMMON BILE DUCT SPHINCTEROTOMY AND STENTING,261,MAJOR BILIARY TRACT PROCEDURES,07,DISEASES AND DISORDERS OF THE HEPATOBILIARY SYSTEM AND PANCREAS,4,Extreme,Major,Surgical,Private Health Insurance,Medicaid,Self-Pay,,,true,188287.05,57315.98
Long Island,Nassau,2951001,000541,North Shore University Hospital,50 to 69,,M,Black/African American,Not Span/Hispanic,9,Emergency,Home or Self Care,2019,DIG020,PANCREATIC DISORDERS (EXCLUDING DIABETES),HEP004,HEPATOBILIARY RESECTION AND ABLATION,261,MAJOR BILIARY TRACT PROCEDURES,07,DISEASES AND DISORDERS OF THE HEPATOBILIARY SYSTEM AND PANCREAS,3,Major,Major,Surgical,Medicaid,Medicaid,,,,true,134812.43,25606.46
New York City,Manhattan,7002054,001458,New York-Presbyterian Hospital - New York Weill Cornell Center,70 or Older,100,F,White,Not Span/Hispanic,3,Emergency,Home or Self Care,2019,DIG017,BILIARY TRACT DISEASE,HEP006,CHOLECYSTECTOMY,261,MAJOR BILIARY TRACT PROCEDURES,07,DISEASES AND DISORDERS OF THE HEPATOBILIARY SYSTEM AND PANCREAS,2,Moderate,Minor,Surgical,Medicare,Blue Cross/Blue Shield,Self-Pay,,,false,62758.64,16689.22
New York City,Manhattan,7002020,001453,Memorial Hospital for Cancer and Allied Diseases,70 or Older,111,F,White,Not Span/Hispanic,8,Elective,Home or Self Care,2019,NEO051,ENDOCRINE SYSTEM CANCERS - PANCREAS,HEP013,"HEPATOBILIARY AND PANCREATIC PROCEDURES, NEC",261,MAJOR BILIARY TRACT PROCEDURES,07,DISEASES AND DISORDERS OF THE HEPATOBILIARY SYSTEM AND PANCREAS,3,Major,Major,Surgical,Medicare,Private Health Insurance,,,,false,105855.76,42136.53
New York City,Queens,7003004,001630,Long Island Jewish Medical Center,50 to 69,114,M,Other Race,Not Span/Hispanic,2,Urgent,Home or Self Care,2019,DIG024,POSTPROCEDURAL OR POSTOPERATIVE DIGESTIVE SYSTEM COMPLICATION,HEP013,"HEPATOBILIARY AND PANCREATIC PROCEDURES, NEC",261,MAJOR BILIARY TRACT PROCEDURES,07,DISEASES AND DISORDERS OF THE HEPATOBILIARY SYSTEM AND PANCREAS,1,Minor,Minor,Surgical,Blue Cross/Blue Shield,Self-Pay,,,,false,47621.08,10670.38
New York City,Queens,7003004,001638,Long Island Jewish Forest Hills,50 to 69,113,F,Other Race,Not Span/Hispanic,4,Emergency,Home or Self Care,2019,DIG017,BILIARY TRACT DISEASE,HEP007,BILIARY AND PANCREATIC CALCULUS REMOVAL,261,MAJOR BILIARY TRACT PROCEDURES,07,DISEASES AND DISORDERS OF THE HEPATOBILIARY SYSTEM AND PANCREAS,1,Minor,Minor,Surgical,Self-Pay,,,,,true,54651.98,11026.25
Hudson Valley,Westchester,5957001,001139,Westchester Medical Center,70 or Older,105,M,Other Race,Not Span/Hispanic,9,Emergency,Hospice - Home,2019,DIG017,BILIARY TRACT DISEASE,HEP010,HEPATOBILIARY AND PANCREATIC DRAINAGE,261,MAJOR BILIARY TRACT PROCEDURES,07,DISEASES AND DISORDERS OF THE HEPATOBILIARY SYSTEM AND PANCREAS,2,Moderate,Moderate,Surgical,Medicare,Medicaid,,,,true,195748.7,34780.65
New York City,Kings,7002053,001304,NYU Langone Hospital-Brooklyn,70 or Older,112,F,White,Spanish/Hispanic,6,Emergency,Home or Self Care,2019,DIG020,PANCREATIC DISORDERS (EXCLUDING DIABETES),HEP013,"HEPATOBILIARY AND PANCREATIC PROCEDURES, NEC",261,MAJOR BILIARY TRACT PROCEDURES,07,DISEASES AND DISORDERS OF THE HEPATOBILIARY SYSTEM AND PANCREAS,2,Moderate,Minor,Surgical,Medicaid,,,,,true,209669.54,44054.75
New York City,Manhattan,7002024,001456,Mount Sinai Hospital,0 to 17,112,F,Black/African American,Not Span/Hispanic,5,Elective,Home or Self Care,2019,MAL002,DIGESTIVE CONGENITAL ANOMALIES,HEP004,HEPATOBILIARY RESECTION AND ABLATION,261,MAJOR BILIARY TRACT PROCEDURES,07,DISEASES AND DISORDERS OF THE HEPATOBILIARY SYSTEM AND PANCREAS,2,Moderate,Minor,Surgical,Medicaid,Medicaid,Self-Pay,,,false,91200.16,58813.72
Central NY,Madison,2601001,000397,Oneida Health Hospital,50 to 69,130,M,White,Not Span/Hispanic,2,Urgent,Home or Self Care,2019,DIG017,BILIARY TRACT DISEASE,HEP013,"HEPATOBILIARY AND PANCREATIC PROCEDURES, NEC",261,MAJOR BILIARY TRACT PROCEDURES,07,DISEASES AND DISORDERS OF THE HEPATOBILIARY SYSTEM AND PANCREAS,2,Moderate,Minor,Surgical,Private Health Insurance,Self-Pay,Self-Pay,,,false,31729.45,10302.54
New York City,Kings,7001021,001306,New York - Presbyterian Brooklyn Methodist Hospital,50 to 69,112,M,White,Not Span/Hispanic,9,Emergency,Home w/ Home Health Services,2019,DIG017,BILIARY TRACT DISEASE,HEP010,HEPATOBILIARY AND PANCREATIC DRAINAGE,261,MAJOR BILIARY TRACT PROCEDURES,07,DISEASES AND DISORDERS OF THE HEPATOBILIARY SYSTEM AND PANCREAS,4,Extreme,Major,Surgical,Private Health Insurance,,,,,true,112974.74,37471.47
Capital/Adirond,Warren,5601000,001005,Glens Falls Hospital,70 or Older,128,M,White,Not Span/Hispanic,8,Emergency,Home or Self Care,2019,DIG017,BILIARY TRACT DISEASE,HEP008,COMMON BILE DUCT SPHINCTEROTOMY AND STENTING,261,MAJOR BILIARY TRACT PROCEDURES,07,DISEASES AND DISORDERS OF THE HEPATOBILIARY SYSTEM AND PANCREAS,3,Major,Extreme,Surgical,Medicare,Private Health Insurance,,,,true,63073.57,24362.74
Finger Lakes,Monroe,2701001,000409,Highland Hospital,30 to 49,144,F,White,Not Span/Hispanic,3,Emergency,Home w/ Home Health Services,2019,NEO070,SECONDARY MALIGNANCIES,HEP010,HEPATOBILIARY AND PANCREATIC DRAINAGE,261,MAJOR BILIARY TRACT PROCEDURES,07,DISEASES AND DISORDERS OF THE HEPATOBILIARY SYSTEM AND PANCREAS,3,Major,Minor,Surgical,Self-Pay,,,,,true,20480.01,4615.54
Long Island,Nassau,2950001,000527,Mount Sinai South Nassau,70 or Older,115,F,White,Not Span/Hispanic,12,Emergency,Skilled Nursing Home,2019,DIG017,BILIARY TRACT DISEASE,HEP010,HEPATOBILIARY AND PANCREATIC DRAINAGE,261,MAJOR BILIARY TRACT PROCEDURES,07,DISEASES AND DISORDERS OF THE HEPATOBILIARY SYSTEM AND PANCREAS,3,Major,Extreme,Surgical,Medicare,,,,,true,251971.65,42336.28
Finger Lakes,Monroe,2701005,000413,Strong Memorial Hospital,70 or Older,146,M,White,Not Span/Hispanic,6,Elective,Home or Self Care,2019,DIG017,BILIARY TRACT DISEASE,HEP006,CHOLECYSTECTOMY,261,MAJOR BILIARY TRACT PROCEDURES,07,DISEASES AND DISORDERS OF THE HEPATOBILIARY SYSTEM AND PANCREAS,2,Moderate,Moderate,Surgical,Medicare,,,,,false,35752.72,18931.03
Long Island,Suffolk,5151001,000245,Stony Brook University Hospital,70 or Older,119,F,White,Not Span/Hispanic,9,Emergency,Skilled Nursing Home,2019,DIG017,BILIARY TRACT DISEASE,HEP013,"HEPATOBILIARY AND PANCREATIC PROCEDURES, NEC",261,MAJOR BILIARY TRACT PROCEDURES,07,DISEASES AND DISORDERS OF THE HEPATOBILIARY SYSTEM AND PANCREAS,2,Moderate,Moderate,Surgical,Medicare,Medicare,Federal/State/Local/VA,,,true,155746.27,59526.63
Finger Lakes,Monroe,2701005,000413,Strong Memorial Hospital,70 or Older,145,M,White,Not Span/Hispanic,14,Emergency,Home w/ Home Health Services,2019,DIG017,BILIARY TRACT DISEASE,RES005,CHEST TUBE PLACEMENT AND THERAPEUTIC THORACENTESIS,261,MAJOR BILIARY TRACT PROCEDURES,07,DISEASES AND DISORDERS OF THE HEPATOBILIARY SYSTEM AND PANCREAS,3,Major,Moderate,Surgical,Medicare,,,,,true,52134.24,23719.37
Western NY,Erie,1401010,000216,Roswell Park Cancer Institute,50 to 69,140,M,White,Not Span/Hispanic,5,Elective,Home or Self Care,2019,DIG017,BILIARY TRACT DISEASE,HEP004,HEPATOBILIARY RESECTION AND ABLATION,261,MAJOR BILIARY TRACT PROCEDURES,07,DISEASES AND DISORDERS OF THE HEPATOBILIARY SYSTEM AND PANCREAS,2,Moderate,Minor,Surgical,"Managed Care, Unspecified",,,,,false,55002.21,21663.45
Capital/Adirond,Rensselaer,4102002,000756,Samaritan Hospital,70 or Older,120,M,White,Not Span/Hispanic,5,Elective,Home or Self Care,2019,DIG017,BILIARY TRACT DISEASE,HEP006,CHOLECYSTECTOMY,261,MAJOR BILIARY TRACT PROCEDURES,07,DISEASES AND DISORDERS OF THE HEPATOBILIARY SYSTEM AND PANCREAS,2,Moderate,Minor,Surgical,Medicare,Blue Cross/Blue Shield,,,,false,29485.4,9304.37
New York City,Kings,7001020,001305,Maimonides Medical Center,70 or Older,112,M,White,Not Span/Hispanic,7,Elective,Home w/ Home Health Services,2019,DIG017,BILIARY TRACT DISEASE,HEP006,CHOLECYSTECTOMY,261,MAJOR BILIARY TRACT PROCEDURES,07,DISEASES AND DISORDERS OF THE HEPATOBILIARY SYSTEM AND PANCREAS,2,Moderate,Moderate,Surgical,Medicare,Medicaid,Self-Pay,,,false,86447.05,27840.09
New York City,Manhattan,7002054,001464,New York-Presbyterian Hospital - Columbia Presbyterian Center,0 to 17,100,M,White,Spanish/Hispanic,45,Emergency,Home or Self Care,2019,INJ036,"COMPLICATION OF TRANSPLANTED ORGANS OR TISSUE, INITIAL ENCOUNTER",HEP010,HEPATOBILIARY AND PANCREATIC DRAINAGE,261,MAJOR BILIARY TRACT PROCEDURES,07,DISEASES AND DISORDERS OF THE HEPATOBILIARY SYSTEM AND PANCREAS,4,Extreme,Extreme,Surgical,Private Health Insurance,Self-Pay,,,,true,1287521.77,430709.36