Hospital Service Area,Hospital County,Operating Certificate Number,Permanent Facility Id,Facility Name,Age Group,Zip Code - 3 digits,Gender,Race,Ethnicity,Length of Stay,Type of Admission,Patient Disposition,Discharge Year,CCS Diagnosis Code,CCS Diagnosis Description,CCS Procedure Code,CCS Procedure Description,APR DRG Code,APR DRG Description,APR MDC Code,APR MDC Description,APR Severity of Illness Code,APR Severity of Illness Description,APR Risk of Mortality,APR Medical Surgical Description,Payment Typology 1,Payment Typology 2,Payment Typology 3,Birth Weight,Abortion Edit Indicator,Emergency Department Indicator,Total Charges,Total Costs
New York City,Manhattan,7002001,001438,Bellevue Hospital Center,30 to 49,100,M,Other Race,Spanish/Hispanic,6,Emergency,Home or Self Care,2017,149,Biliary tract disease,084,CHOLECYSTECTOMY/EXPLOR,262,Cholecystectomy except laparoscopic,07,Diseases and Disorders of the Hepatobiliary System and Pancreas,2,Moderate,Minor,Surgical,Medicaid,,,,N,Y,33373.63,21517.58
New York City,Manhattan,7002001,001438,Bellevue Hospital Center,30 to 49,112,F,Other Race,Spanish/Hispanic,2,Emergency,Home or Self Care,2017,149,Biliary tract disease,084,CHOLECYSTECTOMY/EXPLOR,262,Cholecystectomy except laparoscopic,07,Diseases and Disorders of the Hepatobiliary System and Pancreas,1,Minor,Minor,Surgical,Medicaid,,,,N,Y,15899.58,10251.22
New York City,Manhattan,7002001,001438,Bellevue Hospital Center,70 or Older,100,M,Other Race,Spanish/Hispanic,6,Emergency,Home or Self Care,2017,018,Cancer of other GI organs; peritoneum,084,CHOLECYSTECTOMY/EXPLOR,262,Cholecystectomy except laparoscopic,07,Diseases and Disorders of the Hepatobiliary System and Pancreas,3,Major,Minor,Surgical,Medicare,Medicare,Medicaid,,N,N,44369.71,28607.28
New York City,Manhattan,7002001,001438,Bellevue Hospital Center,30 to 49,112,M,Other Race,Not Span/Hispanic,4,Emergency,Home or Self Care,2017,149,Biliary tract disease,084,CHOLECYSTECTOMY/EXPLOR,262,Cholecystectomy except laparoscopic,07,Diseases and Disorders of the Hepatobiliary System and Pancreas,2,Moderate,Minor,Surgical,Self-Pay,,,,N,N,22841.55,14727.04
New York City,Manhattan,7002001,001438,Bellevue Hospital Center,30 to 49,112,F,Other Race,Spanish/Hispanic,3,Emergency,Home or Self Care,2017,149,Biliary tract disease,084,CHOLECYSTECTOMY/EXPLOR,262,Cholecystectomy except laparoscopic,07,Diseases and Disorders of the Hepatobiliary System and Pancreas,1,Minor,Minor,Surgical,Medicaid,,,,N,Y,18410.44,11870.09
New York City,Manhattan,7002001,001438,Bellevue Hospital Center,30 to 49,113,F,Other Race,Not Span/Hispanic,3,Emergency,Home or Self Care,2017,149,Biliary tract disease,084,CHOLECYSTECTOMY/EXPLOR,262,Cholecystectomy except laparoscopic,07,Diseases and Disorders of the Hepatobiliary System and Pancreas,1,Minor,Minor,Surgical,Medicaid,Medicaid,,,N,Y,19712.01,12709.28
New York City,Manhattan,7002001,001438,Bellevue Hospital Center,30 to 49,112,M,Other Race,Spanish/Hispanic,4,Emergency,Home or Self Care,2017,149,Biliary tract disease,084,CHOLECYSTECTOMY/EXPLOR,262,Cholecystectomy except laparoscopic,07,Diseases and Disorders of the Hepatobiliary System and Pancreas,1,Minor,Minor,Surgical,Medicaid,,,,N,Y,25312.79,16320.37
New York City,Manhattan,7002001,001438,Bellevue Hospital Center,50 to 69,113,M,Other Race,Not Span/Hispanic,3,Emergency,Home or Self Care,2017,149,Biliary tract disease,084,CHOLECYSTECTOMY/EXPLOR,262,Cholecystectomy except laparoscopic,07,Diseases and Disorders of the Hepatobiliary System and Pancreas,1,Minor,Minor,Surgical,Medicaid,Medicaid,,,N,Y,19577.74,12622.71
New York City,Manhattan,7002001,001438,Bellevue Hospital Center,18 to 29,111,F,Other Race,Spanish/Hispanic,2,Emergency,Home or Self Care,2017,149,Biliary tract disease,084,CHOLECYSTECTOMY/EXPLOR,262,Cholecystectomy except laparoscopic,07,Diseases and Disorders of the Hepatobiliary System and Pancreas,1,Minor,Minor,Surgical,Medicaid,,,,N,Y,18349.08,11830.53
New York City,Manhattan,7002001,001438,Bellevue Hospital Center,50 to 69,113,M,Other Race,Not Span/Hispanic,7,Emergency,Home or Self Care,2017,018,Cancer of other GI organs; peritoneum,084,CHOLECYSTECTOMY/EXPLOR,262,Cholecystectomy except laparoscopic,07,Diseases and Disorders of the Hepatobiliary System and Pancreas,3,Major,Minor,Surgical,"Managed Care, Unspecified",Medicaid,,,N,N,46167.75,29766.56
New York City,Manhattan,7002001,001438,Bellevue Hospital Center,50 to 69,112,M,Other Race,Not Span/Hispanic,5,Emergency,Skilled Nursing Home,2017,149,Biliary tract disease,084,CHOLECYSTECTOMY/EXPLOR,262,Cholecystectomy except laparoscopic,07,Diseases and Disorders of the Hepatobiliary System and Pancreas,2,Moderate,Minor,Surgical,Medicare,Medicare,,,N,Y,35708.13,23022.75
New York City,Manhattan,7002001,001438,Bellevue Hospital Center,50 to 69,100,F,Other Race,Not Span/Hispanic,3,Emergency,Home or Self Care,2017,149,Biliary tract disease,084,CHOLECYSTECTOMY/EXPLOR,262,Cholecystectomy except laparoscopic,07,Diseases and Disorders of the Hepatobiliary System and Pancreas,1,Minor,Minor,Surgical,Medicaid,Medicaid,,,N,Y,26697.52,17213.17
New York City,Manhattan,7002001,001438,Bellevue Hospital Center,30 to 49,112,F,Black/African American,Not Span/Hispanic,7,Emergency,Home w/ Home Health Services,2017,149,Biliary tract disease,084,CHOLECYSTECTOMY/EXPLOR,262,Cholecystectomy except laparoscopic,07,Diseases and Disorders of the Hepatobiliary System and Pancreas,2,Moderate,Minor,Surgical,Medicaid,,,,N,Y,38869.70,25061.16
New York City,Manhattan,7002001,001438,Bellevue Hospital Center,50 to 69,112,M,Other Race,Not Span/Hispanic,8,Emergency,Home w/ Home Health Services,2017,149,Biliary tract disease,084,CHOLECYSTECTOMY/EXPLOR,262,Cholecystectomy except laparoscopic,07,Diseases and Disorders of the Hepatobiliary System and Pancreas,2,Moderate,Minor,Surgical,Medicaid,,,,N,N,38542.92,24850.47
