Hospital Service Area,Hospital County,Operating Certificate Number,Permanent Facility Id,Facility Name,Age Group,Zip Code - 3 digits,Gender,Race,Ethnicity,Length of Stay,Type of Admission,Patient Disposition,Discharge Year,CCS Diagnosis Code,CCS Diagnosis Description,CCS Procedure Code,CCS Procedure Description,APR DRG Code,APR DRG Description,APR MDC Code,APR MDC Description,APR Severity of Illness Code,APR Severity of Illness Description,APR Risk of Mortality,APR Medical Surgical Description,Payment Typology 1,Payment Typology 2,Payment Typology 3,Birth Weight,Abortion Edit Indicator,Emergency Department Indicator,Total Charges,Total Costs
Long Island,Nassau,2908000,000511,NYU Winthrop Hospital,70 or Older,110,M,White,Not Span/Hispanic,6,Emergency,Home w/ Home Health Services,2017,149,Biliary tract disease,084,CHOLECYSTECTOMY/EXPLOR,263,Laparoscopic cholecystectomy,07,Diseases and Disorders of the Hepatobiliary System and Pancreas,3,Major,Minor,Surgical,Medicare,Medicare,Private Health Insurance,,N,Y,108772.42,26722.86
Long Island,Nassau,2908000,000511,NYU Winthrop Hospital,70 or Older,115,F,White,Not Span/Hispanic,5,Urgent,Home w/ Home Health Services,2017,149,Biliary tract disease,084,CHOLECYSTECTOMY/EXPLOR,263,Laparoscopic cholecystectomy,07,Diseases and Disorders of the Hepatobiliary System and Pancreas,1,Minor,Minor,Surgical,Medicare,Medicare,Private Health Insurance,,N,Y,96255.90,21433.47
Long Island,Nassau,2908000,000511,NYU Winthrop Hospital,30 to 49,117,F,White,Spanish/Hispanic,4,Emergency,Home or Self Care,2017,152,Pancreatic disorders (not diabetes),084,CHOLECYSTECTOMY/EXPLOR,263,Laparoscopic cholecystectomy,07,Diseases and Disorders of the Hepatobiliary System and Pancreas,3,Major,Minor,Surgical,Blue Cross/Blue Shield,,,,N,Y,69576.51,14814.00
Long Island,Nassau,2908000,000511,NYU Winthrop Hospital,70 or Older,115,M,White,Not Span/Hispanic,4,Emergency,Home w/ Home Health Services,2017,149,Biliary tract disease,084,CHOLECYSTECTOMY/EXPLOR,263,Laparoscopic cholecystectomy,07,Diseases and Disorders of the Hepatobiliary System and Pancreas,2,Moderate,Moderate,Surgical,Medicare,Medicare,Private Health Insurance,,N,Y,88790.06,22331.78
Long Island,Nassau,2908000,000511,NYU Winthrop Hospital,70 or Older,117,F,White,Not Span/Hispanic,3,Emergency,Home w/ Home Health Services,2017,149,Biliary tract disease,084,CHOLECYSTECTOMY/EXPLOR,263,Laparoscopic cholecystectomy,07,Diseases and Disorders of the Hepatobiliary System and Pancreas,3,Major,Major,Surgical,Medicare,Medicare,Blue Cross/Blue Shield,,N,Y,78639.29,16495.86
Long Island,Nassau,2908000,000511,NYU Winthrop Hospital,70 or Older,115,M,White,Not Span/Hispanic,4,Emergency,Home w/ Home Health Services,2017,149,Biliary tract disease,084,CHOLECYSTECTOMY/EXPLOR,263,Laparoscopic cholecystectomy,07,Diseases and Disorders of the Hepatobiliary System and Pancreas,3,Major,Major,Surgical,Medicare,Medicare,,,N,Y,80574.06,21432.51
Long Island,Nassau,2908000,000511,NYU Winthrop Hospital,50 to 69,115,M,White,Not Span/Hispanic,4,Elective,Home w/ Home Health Services,2017,149,Biliary tract disease,084,CHOLECYSTECTOMY/EXPLOR,263,Laparoscopic cholecystectomy,07,Diseases and Disorders of the Hepatobiliary System and Pancreas,3,Major,Moderate,Surgical,Medicare,Medicare,Medicaid,,N,N,66132.46,15781.85
Long Island,Nassau,2908000,000511,NYU Winthrop Hospital,70 or Older,110,M,White,Not Span/Hispanic,5,Emergency,Home or Self Care,2017,152,Pancreatic disorders (not diabetes),084,CHOLECYSTECTOMY/EXPLOR,263,Laparoscopic cholecystectomy,07,Diseases and Disorders of the Hepatobiliary System and Pancreas,3,Major,Moderate,Surgical,Medicare,Medicare,Self-Pay,,N,Y,83588.86,16971.15
Long Island,Nassau,2908000,000511,NYU Winthrop Hospital,30 to 49,115,M,White,Spanish/Hispanic,3,Emergency,Home or Self Care,2017,152,Pancreatic disorders (not diabetes),084,CHOLECYSTECTOMY/EXPLOR,263,Laparoscopic cholecystectomy,07,Diseases and Disorders of the Hepatobiliary System and Pancreas,3,Major,Minor,Surgical,Private Health Insurance,,,,N,Y,70715.18,18330.85
Long Island,Nassau,2908000,000511,NYU Winthrop Hospital,50 to 69,115,M,White,Not Span/Hispanic,8,Emergency,Home or Self Care,2017,152,Pancreatic disorders (not diabetes),098,OT NON-OR GI THER PRCS,263,Laparoscopic cholecystectomy,07,Diseases and Disorders of the Hepatobiliary System and Pancreas,3,Major,Minor,Surgical,Federal/State/Local/VA,,,,N,Y,98523.29,23555.83
Long Island,Nassau,2908000,000511,NYU Winthrop Hospital,70 or Older,110,F,White,Not Span/Hispanic,1,Emergency,Home or Self Care,2017,149,Biliary tract disease,084,CHOLECYSTECTOMY/EXPLOR,263,Laparoscopic cholecystectomy,07,Diseases and Disorders of the Hepatobiliary System and Pancreas,1,Minor,Minor,Surgical,Medicare,Medicare,Blue Cross/Blue Shield,,N,Y,36885.64,9691.21
Long Island,Nassau,2908000,000511,NYU Winthrop Hospital,50 to 69,115,F,White,Not Span/Hispanic,25,Emergency,Skilled Nursing Home,2017,152,Pancreatic disorders (not diabetes),084,CHOLECYSTECTOMY/EXPLOR,263,Laparoscopic cholecystectomy,07,Diseases and Disorders of the Hepatobiliary System and Pancreas,3,Major,Moderate,Surgical,Federal/State/Local/VA,Medicaid,,,N,Y,315215.98,63192.77
Long Island,Nassau,2908000,000511,NYU Winthrop Hospital,50 to 69,115,M,White,Not Span/Hispanic,15,Emergency,Home or Self Care,2017,149,Biliary tract disease,084,CHOLECYSTECTOMY/EXPLOR,263,Laparoscopic cholecystectomy,07,Diseases and Disorders of the Hepatobiliary System and Pancreas,2,Moderate,Minor,Surgical,Blue Cross/Blue Shield,,,,N,Y,309843.97,67046.99
Long Island,Nassau,2908000,000511,NYU Winthrop Hospital,50 to 69,117,F,White,Not Span/Hispanic,1,Emergency,Home or Self Care,2017,149,Biliary tract disease,084,CHOLECYSTECTOMY/EXPLOR,263,Laparoscopic cholecystectomy,07,Diseases and Disorders of the Hepatobiliary System and Pancreas,1,Minor,Minor,Surgical,Blue Cross/Blue Shield,,,,N,Y,29276.41,8242.08
Long Island,Nassau,2908000,000511,NYU Winthrop Hospital,30 to 49,110,M,White,Not Span/Hispanic,5,Emergency,Home or Self Care,2017,149,Biliary tract disease,084,CHOLECYSTECTOMY/EXPLOR,263,Laparoscopic cholecystectomy,07,Diseases and Disorders of the Hepatobiliary System and Pancreas,2,Moderate,Minor,Surgical,Private Health Insurance,,,,N,Y,101666.53,24822.84
Long Island,Nassau,2908000,000511,NYU Winthrop Hospital,30 to 49,117,F,Black/African American,Not Span/Hispanic,1,Elective,Home or Self Care,2017,149,Biliary tract disease,084,CHOLECYSTECTOMY/EXPLOR,263,Laparoscopic cholecystectomy,07,Diseases and Disorders of the Hepatobiliary System and Pancreas,1,Minor,Minor,Surgical,Private Health Insurance,,,,N,N,24466.30,7926.88
Long Island,Nassau,2908000,000511,NYU Winthrop Hospital,50 to 69,115,F,White,Not Span/Hispanic,2,Emergency,Home or Self Care,2017,149,Biliary tract disease,084,CHOLECYSTECTOMY/EXPLOR,263,Laparoscopic cholecystectomy,07,Diseases and Disorders of the Hepatobiliary System and Pancreas,1,Minor,Minor,Surgical,Private Health Insurance,,,,N,Y,44523.85,10876.21
Long Island,Nassau,2908000,000511,NYU Winthrop Hospital,70 or Older,OOS,F,White,Not Span/Hispanic,4,Emergency,Home w/ Home Health Services,2017,149,Biliary tract disease,084,CHOLECYSTECTOMY/EXPLOR,263,Laparoscopic cholecystectomy,07,Diseases and Disorders of the Hepatobiliary System and Pancreas,2,Moderate,Minor,Surgical,Medicare,Medicare,Private Health Insurance,,N,Y,66461.99,16787.53
Long Island,Nassau,2908000,000511,NYU Winthrop Hospital,70 or Older,117,F,White,Not Span/Hispanic,2,Emergency,Home w/ Home Health Services,2017,149,Biliary tract disease,084,CHOLECYSTECTOMY/EXPLOR,263,Laparoscopic cholecystectomy,07,Diseases and Disorders of the Hepatobiliary System and Pancreas,2,Moderate,Moderate,Surgical,Medicare,Medicare,Private Health Insurance,,N,Y,56167.98,13499.37
Long Island,Nassau,2908000,000511,NYU Winthrop Hospital,50 to 69,117,F,White,Not Span/Hispanic,1,Emergency,Home or Self Care,2017,149,Biliary tract disease,084,CHOLECYSTECTOMY/EXPLOR,263,Laparoscopic cholecystectomy,07,Diseases and Disorders of the Hepatobiliary System and Pancreas,1,Minor,Minor,Surgical,Private Health Insurance,,,,N,N,10285.00,1947.57
Long Island,Nassau,2908000,000511,NYU Winthrop Hospital,50 to 69,117,F,White,Not Span/Hispanic,3,Emergency,Home or Self Care,2017,149,Biliary tract disease,084,CHOLECYSTECTOMY/EXPLOR,263,Laparoscopic cholecystectomy,07,Diseases and Disorders of the Hepatobiliary System and Pancreas,2,Moderate,Minor,Surgical,Private Health Insurance,,,,N,Y,63444.31,14731.32
Long Island,Nassau,2908000,000511,NYU Winthrop Hospital,18 to 29,113,F,White,Not Span/Hispanic,3,Emergency,Home or Self Care,2017,152,Pancreatic disorders (not diabetes),084,CHOLECYSTECTOMY/EXPLOR,263,Laparoscopic cholecystectomy,07,Diseases and Disorders of the Hepatobiliary System and Pancreas,3,Major,Minor,Surgical,Private Health Insurance,,,,N,Y,54329.96,12805.08
Long Island,Nassau,2908000,000511,NYU Winthrop Hospital,30 to 49,110,F,White,Not Span/Hispanic,1,Emergency,Home or Self Care,2017,149,Biliary tract disease,084,CHOLECYSTECTOMY/EXPLOR,263,Laparoscopic cholecystectomy,07,Diseases and Disorders of the Hepatobiliary System and Pancreas,1,Minor,Minor,Surgical,Private Health Insurance,,,,N,Y,48729.80,11214.50
Long Island,Nassau,2908000,000511,NYU Winthrop Hospital,50 to 69,115,F,White,Not Span/Hispanic,1,Emergency,Home or Self Care,2017,149,Biliary tract disease,084,CHOLECYSTECTOMY/EXPLOR,263,Laparoscopic cholecystectomy,07,Diseases and Disorders of the Hepatobiliary System and Pancreas,1,Minor,Minor,Surgical,Federal/State/Local/VA,,,,N,Y,37680.05,9258.88
Long Island,Nassau,2908000,000511,NYU Winthrop Hospital,30 to 49,115,F,Other Race,Spanish/Hispanic,4,Emergency,Home or Self Care,2017,149,Biliary tract disease,084,CHOLECYSTECTOMY/EXPLOR,263,Laparoscopic cholecystectomy,07,Diseases and Disorders of the Hepatobiliary System and Pancreas,1,Minor,Minor,Surgical,Self-Pay,,,,N,Y,79791.09,16312.24
Long Island,Nassau,2908000,000511,NYU Winthrop Hospital,30 to 49,115,M,Other Race,Not Span/Hispanic,3,Emergency,Home or Self Care,2017,149,Biliary tract disease,084,CHOLECYSTECTOMY/EXPLOR,263,Laparoscopic cholecystectomy,07,Diseases and Disorders of the Hepatobiliary System and Pancreas,2,Moderate,Minor,Surgical,Private Health Insurance,,,,N,Y,66699.54,16418.56
Long Island,Nassau,2908000,000511,NYU Winthrop Hospital,70 or Older,115,F,White,Unknown,6,Emergency,Home or Self Care,2017,149,Biliary tract disease,084,CHOLECYSTECTOMY/EXPLOR,263,Laparoscopic cholecystectomy,07,Diseases and Disorders of the Hepatobiliary System and Pancreas,2,Moderate,Minor,Surgical,Medicare,Medicare,Blue Cross/Blue Shield,,N,Y,102716.76,20529.44
Long Island,Nassau,2908000,000511,NYU Winthrop Hospital,50 to 69,113,F,White,Not Span/Hispanic,2,Emergency,Home or Self Care,2017,149,Biliary tract disease,084,CHOLECYSTECTOMY/EXPLOR,263,Laparoscopic cholecystectomy,07,Diseases and Disorders of the Hepatobiliary System and Pancreas,2,Moderate,Minor,Surgical,Private Health Insurance,,,,N,Y,53629.11,12412.66
Long Island,Nassau,2908000,000511,NYU Winthrop Hospital,50 to 69,117,F,Other Race,Unknown,5,Urgent,Home or Self Care,2017,149,Biliary tract disease,084,CHOLECYSTECTOMY/EXPLOR,263,Laparoscopic cholecystectomy,07,Diseases and Disorders of the Hepatobiliary System and Pancreas,2,Moderate,Minor,Surgical,Federal/State/Local/VA,,,,N,N,85704.92,24006.00
Long Island,Nassau,2908000,000511,NYU Winthrop Hospital,70 or Older,110,M,White,Not Span/Hispanic,2,Emergency,Home or Self Care,2017,149,Biliary tract disease,084,CHOLECYSTECTOMY/EXPLOR,263,Laparoscopic cholecystectomy,07,Diseases and Disorders of the Hepatobiliary System and Pancreas,2,Moderate,Moderate,Surgical,Medicare,Medicare,Private Health Insurance,,N,Y,39405.00,10731.24
Long Island,Nassau,2908000,000511,NYU Winthrop Hospital,30 to 49,115,F,White,Spanish/Hispanic,3,Emergency,Home or Self Care,2017,149,Biliary tract disease,084,CHOLECYSTECTOMY/EXPLOR,263,Laparoscopic cholecystectomy,07,Diseases and Disorders of the Hepatobiliary System and Pancreas,2,Moderate,Minor,Surgical,Private Health Insurance,,,,N,Y,72754.32,14537.55
Long Island,Nassau,2908000,000511,NYU Winthrop Hospital,70 or Older,115,F,White,Not Span/Hispanic,4,Emergency,Home w/ Home Health Services,2017,149,Biliary tract disease,084,CHOLECYSTECTOMY/EXPLOR,263,Laparoscopic cholecystectomy,07,Diseases and Disorders of the Hepatobiliary System and Pancreas,1,Minor,Minor,Surgical,Medicare,Medicare,,,N,Y,77101.16,16870.67
Long Island,Nassau,2908000,000511,NYU Winthrop Hospital,0 to 17,117,M,White,Not Span/Hispanic,4,Emergency,Home or Self Care,2017,149,Biliary tract disease,084,CHOLECYSTECTOMY/EXPLOR,263,Laparoscopic cholecystectomy,07,Diseases and Disorders of the Hepatobiliary System and Pancreas,1,Minor,Minor,Surgical,Federal/State/Local/VA,,,,N,Y,63022.09,15782.16
Long Island,Nassau,2908000,000511,NYU Winthrop Hospital,70 or Older,115,F,White,Not Span/Hispanic,4,Emergency,Home or Self Care,2017,149,Biliary tract disease,084,CHOLECYSTECTOMY/EXPLOR,263,Laparoscopic cholecystectomy,07,Diseases and Disorders of the Hepatobiliary System and Pancreas,1,Minor,Minor,Surgical,Medicare,Medicare,Blue Cross/Blue Shield,,N,Y,54153.89,13224.98
Long Island,Nassau,2908000,000511,NYU Winthrop Hospital,70 or Older,112,F,White,Not Span/Hispanic,4,Emergency,Home or Self Care,2017,149,Biliary tract disease,084,CHOLECYSTECTOMY/EXPLOR,263,Laparoscopic cholecystectomy,07,Diseases and Disorders of the Hepatobiliary System and Pancreas,2,Moderate,Moderate,Surgical,Medicare,Medicare,Private Health Insurance,,N,Y,53227.87,13087.38
Long Island,Nassau,2908000,000511,NYU Winthrop Hospital,50 to 69,117,F,White,Not Span/Hispanic,4,Emergency,Home or Self Care,2017,149,Biliary tract disease,084,CHOLECYSTECTOMY/EXPLOR,263,Laparoscopic cholecystectomy,07,Diseases and Disorders of the Hepatobiliary System and Pancreas,2,Moderate,Minor,Surgical,Medicare,Medicare,Medicaid,,N,Y,79535.20,17717.93
Long Island,Nassau,2908000,000511,NYU Winthrop Hospital,50 to 69,115,M,White,Not Span/Hispanic,5,Emergency,Home or Self Care,2017,152,Pancreatic disorders (not diabetes),084,CHOLECYSTECTOMY/EXPLOR,263,Laparoscopic cholecystectomy,07,Diseases and Disorders of the Hepatobiliary System and Pancreas,3,Major,Minor,Surgical,Private Health Insurance,Medicare,,,N,Y,63429.66,15229.00
Long Island,Nassau,2908000,000511,NYU Winthrop Hospital,30 to 49,117,F,White,Not Span/Hispanic,4,Emergency,Home or Self Care,2017,149,Biliary tract disease,084,CHOLECYSTECTOMY/EXPLOR,263,Laparoscopic cholecystectomy,07,Diseases and Disorders of the Hepatobiliary System and Pancreas,1,Minor,Minor,Surgical,Blue Cross/Blue Shield,Self-Pay,,,N,Y,70221.30,17274.68
Long Island,Nassau,2908000,000511,NYU Winthrop Hospital,18 to 29,115,F,Other Race,Spanish/Hispanic,3,Emergency,Home or Self Care,2017,152,Pancreatic disorders (not diabetes),084,CHOLECYSTECTOMY/EXPLOR,263,Laparoscopic cholecystectomy,07,Diseases and Disorders of the Hepatobiliary System and Pancreas,2,Moderate,Minor,Surgical,Medicaid,Medicaid,,,N,Y,51189.25,11375.25
Long Island,Nassau,2908000,000511,NYU Winthrop Hospital,50 to 69,117,M,White,Not Span/Hispanic,7,Emergency,Home or Self Care,2017,149,Biliary tract disease,084,CHOLECYSTECTOMY/EXPLOR,263,Laparoscopic cholecystectomy,07,Diseases and Disorders of the Hepatobiliary System and Pancreas,3,Major,Minor,Surgical,Medicare,Medicare,Medicaid,,N,Y,167579.41,39489.15
Long Island,Nassau,2908000,000511,NYU Winthrop Hospital,18 to 29,115,F,White,Spanish/Hispanic,5,Emergency,Home or Self Care,2017,149,Biliary tract disease,084,CHOLECYSTECTOMY/EXPLOR,263,Laparoscopic cholecystectomy,07,Diseases and Disorders of the Hepatobiliary System and Pancreas,1,Minor,Minor,Surgical,Medicaid,Medicaid,,,N,Y,82735.52,17149.26
Long Island,Nassau,2908000,000511,NYU Winthrop Hospital,30 to 49,115,F,Black/African American,Not Span/Hispanic,2,Emergency,Home or Self Care,2017,149,Biliary tract disease,084,CHOLECYSTECTOMY/EXPLOR,263,Laparoscopic cholecystectomy,07,Diseases and Disorders of the Hepatobiliary System and Pancreas,2,Moderate,Minor,Surgical,Blue Cross/Blue Shield,,,,N,Y,40200.05,9081.12
Long Island,Nassau,2908000,000511,NYU Winthrop Hospital,70 or Older,115,M,White,Not Span/Hispanic,3,Emergency,Home or Self Care,2017,149,Biliary tract disease,084,CHOLECYSTECTOMY/EXPLOR,263,Laparoscopic cholecystectomy,07,Diseases and Disorders of the Hepatobiliary System and Pancreas,1,Minor,Minor,Surgical,Medicare,Medicare,,,N,Y,44098.91,12021.50
Long Island,Nassau,2908000,000511,NYU Winthrop Hospital,50 to 69,115,M,Black/African American,Not Span/Hispanic,3,Emergency,Home or Self Care,2017,152,Pancreatic disorders (not diabetes),084,CHOLECYSTECTOMY/EXPLOR,263,Laparoscopic cholecystectomy,07,Diseases and Disorders of the Hepatobiliary System and Pancreas,2,Moderate,Minor,Surgical,Blue Cross/Blue Shield,,,,N,Y,45513.11,11275.57
Long Island,Nassau,2908000,000511,NYU Winthrop Hospital,30 to 49,118,F,White,Not Span/Hispanic,2,Emergency,Home or Self Care,2017,152,Pancreatic disorders (not diabetes),084,CHOLECYSTECTOMY/EXPLOR,263,Laparoscopic cholecystectomy,07,Diseases and Disorders of the Hepatobiliary System and Pancreas,3,Major,Minor,Surgical,Medicare,Medicare,,,N,Y,40792.78,10351.98
Long Island,Nassau,2908000,000511,NYU Winthrop Hospital,18 to 29,115,F,White,Not Span/Hispanic,1,Emergency,Home or Self Care,2017,152,Pancreatic disorders (not diabetes),084,CHOLECYSTECTOMY/EXPLOR,263,Laparoscopic cholecystectomy,07,Diseases and Disorders of the Hepatobiliary System and Pancreas,2,Moderate,Minor,Surgical,Blue Cross/Blue Shield,,,,N,Y,33031.70,8849.72
Long Island,Nassau,2908000,000511,NYU Winthrop Hospital,50 to 69,115,M,White,Not Span/Hispanic,2,Emergency,Home or Self Care,2017,149,Biliary tract disease,084,CHOLECYSTECTOMY/EXPLOR,263,Laparoscopic cholecystectomy,07,Diseases and Disorders of the Hepatobiliary System and Pancreas,2,Moderate,Moderate,Surgical,Blue Cross/Blue Shield,Medicare,,,N,Y,58346.06,14980.57
Long Island,Nassau,2908000,000511,NYU Winthrop Hospital,70 or Older,115,M,White,Not Span/Hispanic,10,Emergency,Skilled Nursing Home,2017,149,Biliary tract disease,084,CHOLECYSTECTOMY/EXPLOR,263,Laparoscopic cholecystectomy,07,Diseases and Disorders of the Hepatobiliary System and Pancreas,4,Extreme,Extreme,Surgical,Medicare,Medicare,Blue Cross/Blue Shield,,N,Y,243697.13,46698.65
Long Island,Nassau,2908000,000511,NYU Winthrop Hospital,70 or Older,115,F,White,Not Span/Hispanic,6,Emergency,Home w/ Home Health Services,2017,149,Biliary tract disease,084,CHOLECYSTECTOMY/EXPLOR,263,Laparoscopic cholecystectomy,07,Diseases and Disorders of the Hepatobiliary System and Pancreas,2,Moderate,Moderate,Surgical,Medicare,Medicare,Private Health Insurance,,N,Y,109015.79,24978.87
Long Island,Nassau,2908000,000511,NYU Winthrop Hospital,70 or Older,115,M,White,Not Span/Hispanic,2,Elective,Home w/ Home Health Services,2017,149,Biliary tract disease,084,CHOLECYSTECTOMY/EXPLOR,263,Laparoscopic cholecystectomy,07,Diseases and Disorders of the Hepatobiliary System and Pancreas,1,Minor,Minor,Surgical,Medicare,Medicare,,,N,N,48478.98,14585.16
Long Island,Nassau,2908000,000511,NYU Winthrop Hospital,30 to 49,115,M,Black/African American,Not Span/Hispanic,1,Emergency,Home or Self Care,2017,149,Biliary tract disease,084,CHOLECYSTECTOMY/EXPLOR,263,Laparoscopic cholecystectomy,07,Diseases and Disorders of the Hepatobiliary System and Pancreas,1,Minor,Minor,Surgical,Private Health Insurance,,,,N,Y,43053.09,10590.38
Long Island,Nassau,2908000,000511,NYU Winthrop Hospital,50 to 69,117,F,White,Not Span/Hispanic,2,Emergency,Home or Self Care,2017,149,Biliary tract disease,084,CHOLECYSTECTOMY/EXPLOR,263,Laparoscopic cholecystectomy,07,Diseases and Disorders of the Hepatobiliary System and Pancreas,1,Minor,Minor,Surgical,Private Health Insurance,,,,N,N,6676.00,2030.48
Long Island,Nassau,2908000,000511,NYU Winthrop Hospital,18 to 29,115,F,White,Spanish/Hispanic,4,Emergency,Home or Self Care,2017,149,Biliary tract disease,084,CHOLECYSTECTOMY/EXPLOR,263,Laparoscopic cholecystectomy,07,Diseases and Disorders of the Hepatobiliary System and Pancreas,2,Moderate,Minor,Surgical,Medicaid,Medicaid,,,N,Y,58395.01,14072.21
Long Island,Nassau,2908000,000511,NYU Winthrop Hospital,70 or Older,115,F,White,Spanish/Hispanic,4,Emergency,Skilled Nursing Home,2017,149,Biliary tract disease,084,CHOLECYSTECTOMY/EXPLOR,263,Laparoscopic cholecystectomy,07,Diseases and Disorders of the Hepatobiliary System and Pancreas,2,Moderate,Minor,Surgical,Medicaid,Medicaid,,,N,Y,55883.08,15058.58
Long Island,Nassau,2908000,000511,NYU Winthrop Hospital,70 or Older,115,F,White,Not Span/Hispanic,2,Emergency,Home or Self Care,2017,149,Biliary tract disease,070,UP GASTRO ENDOSC/BIOPSY,263,Laparoscopic cholecystectomy,07,Diseases and Disorders of the Hepatobiliary System and Pancreas,2,Moderate,Moderate,Surgical,Medicare,Medicare,Self-Pay,,N,Y,69830.29,14894.98
Long Island,Nassau,2908000,000511,NYU Winthrop Hospital,50 to 69,117,F,White,Not Span/Hispanic,3,Elective,Home or Self Care,2017,152,Pancreatic disorders (not diabetes),084,CHOLECYSTECTOMY/EXPLOR,263,Laparoscopic cholecystectomy,07,Diseases and Disorders of the Hepatobiliary System and Pancreas,3,Major,Minor,Surgical,Blue Cross/Blue Shield,Private Health Insurance,,,N,N,67264.75,16547.06
Long Island,Nassau,2908000,000511,NYU Winthrop Hospital,70 or Older,115,F,White,Not Span/Hispanic,4,Emergency,Inpatient Rehabilitation Facility,2017,149,Biliary tract disease,084,CHOLECYSTECTOMY/EXPLOR,263,Laparoscopic cholecystectomy,07,Diseases and Disorders of the Hepatobiliary System and Pancreas,3,Major,Moderate,Surgical,Medicare,Medicare,Private Health Insurance,,N,Y,63332.50,17724.81
Long Island,Nassau,2908000,000511,NYU Winthrop Hospital,30 to 49,115,M,White,Not Span/Hispanic,3,Emergency,Home or Self Care,2017,152,Pancreatic disorders (not diabetes),084,CHOLECYSTECTOMY/EXPLOR,263,Laparoscopic cholecystectomy,07,Diseases and Disorders of the Hepatobiliary System and Pancreas,2,Moderate,Minor,Surgical,Self-Pay,,,,N,Y,76556.92,18760.35
Long Island,Nassau,2908000,000511,NYU Winthrop Hospital,70 or Older,115,F,Black/African American,Not Span/Hispanic,13,Emergency,Home or Self Care,2017,149,Biliary tract disease,084,CHOLECYSTECTOMY/EXPLOR,263,Laparoscopic cholecystectomy,07,Diseases and Disorders of the Hepatobiliary System and Pancreas,3,Major,Major,Surgical,Medicare,Medicare,,,N,Y,243636.52,60706.60
Long Island,Nassau,2908000,000511,NYU Winthrop Hospital,70 or Older,115,F,White,Not Span/Hispanic,4,Emergency,Home or Self Care,2017,149,Biliary tract disease,084,CHOLECYSTECTOMY/EXPLOR,263,Laparoscopic cholecystectomy,07,Diseases and Disorders of the Hepatobiliary System and Pancreas,2,Moderate,Minor,Surgical,Medicare,Medicare,Private Health Insurance,,N,Y,70937.19,17707.59
Long Island,Nassau,2908000,000511,NYU Winthrop Hospital,70 or Older,117,F,White,Not Span/Hispanic,8,Emergency,Home or Self Care,2017,152,Pancreatic disorders (not diabetes),084,CHOLECYSTECTOMY/EXPLOR,263,Laparoscopic cholecystectomy,07,Diseases and Disorders of the Hepatobiliary System and Pancreas,3,Major,Moderate,Surgical,Medicare,Medicare,Blue Cross/Blue Shield,,N,Y,70543.82,16977.64
Long Island,Nassau,2908000,000511,NYU Winthrop Hospital,70 or Older,115,F,White,Not Span/Hispanic,5,Emergency,Home w/ Home Health Services,2017,149,Biliary tract disease,084,CHOLECYSTECTOMY/EXPLOR,263,Laparoscopic cholecystectomy,07,Diseases and Disorders of the Hepatobiliary System and Pancreas,1,Minor,Moderate,Surgical,Medicare,Medicare,Blue Cross/Blue Shield,,N,Y,80162.44,17956.78
Long Island,Nassau,2908000,000511,NYU Winthrop Hospital,50 to 69,115,M,Black/African American,Not Span/Hispanic,1,Elective,Home or Self Care,2017,149,Biliary tract disease,084,CHOLECYSTECTOMY/EXPLOR,263,Laparoscopic cholecystectomy,07,Diseases and Disorders of the Hepatobiliary System and Pancreas,2,Moderate,Minor,Surgical,Private Health Insurance,Self-Pay,,,N,N,27095.47,8537.50