Hospital Service Area,Hospital County,Operating Certificate Number,Permanent Facility Id,Facility Name,Age Group,Zip Code - 3 digits,Gender,Race,Ethnicity,Length of Stay,Type of Admission,Patient Disposition,Discharge Year,CCS Diagnosis Code,CCS Diagnosis Description,CCS Procedure Code,CCS Procedure Description,APR DRG Code,APR DRG Description,APR MDC Code,APR MDC Description,APR Severity of Illness Code,APR Severity of Illness Description,APR Risk of Mortality,APR Medical Surgical Description,Payment Typology 1,Payment Typology 2,Payment Typology 3,Birth Weight,Abortion Edit Indicator,Emergency Department Indicator,Total Charges,Total Costs
Long Island,Suffolk,5123000,000885,Brookhaven Memorial Hospital Medical Center Inc,18 to 29,119,F,White,Not Span/Hispanic,5,Emergency,Home or Self Care,2017,152,Pancreatic disorders (not diabetes),084,CHOLECYSTECTOMY/EXPLOR,263,Laparoscopic cholecystectomy,07,Diseases and Disorders of the Hepatobiliary System and Pancreas,3,Major,Minor,Surgical,Private Health Insurance,,,,N,Y,59725.07,10710.06
Long Island,Suffolk,5123000,000885,Brookhaven Memorial Hospital Medical Center Inc,30 to 49,117,F,Black/African American,Not Span/Hispanic,2,Emergency,Home or Self Care,2017,149,Biliary tract disease,084,CHOLECYSTECTOMY/EXPLOR,263,Laparoscopic cholecystectomy,07,Diseases and Disorders of the Hepatobiliary System and Pancreas,1,Minor,Minor,Surgical,Private Health Insurance,Medicaid,,,N,Y,30559.21,6507.39
Long Island,Suffolk,5123000,000885,Brookhaven Memorial Hospital Medical Center Inc,50 to 69,119,M,White,Not Span/Hispanic,5,Emergency,Home or Self Care,2017,149,Biliary tract disease,084,CHOLECYSTECTOMY/EXPLOR,263,Laparoscopic cholecystectomy,07,Diseases and Disorders of the Hepatobiliary System and Pancreas,3,Major,Moderate,Surgical,Medicare,,,,N,Y,78393.31,12316.79
Long Island,Suffolk,5123000,000885,Brookhaven Memorial Hospital Medical Center Inc,50 to 69,119,M,White,Not Span/Hispanic,5,Emergency,Home or Self Care,2017,149,Biliary tract disease,098,OT NON-OR GI THER PRCS,263,Laparoscopic cholecystectomy,07,Diseases and Disorders of the Hepatobiliary System and Pancreas,1,Minor,Minor,Surgical,Private Health Insurance,,,,N,Y,79031.40,14731.14
Long Island,Suffolk,5123000,000885,Brookhaven Memorial Hospital Medical Center Inc,30 to 49,119,F,White,Not Span/Hispanic,4,Emergency,Home or Self Care,2017,149,Biliary tract disease,084,CHOLECYSTECTOMY/EXPLOR,263,Laparoscopic cholecystectomy,07,Diseases and Disorders of the Hepatobiliary System and Pancreas,1,Minor,Minor,Surgical,Private Health Insurance,Medicaid,,,N,Y,41602.24,8993.23
Long Island,Suffolk,5123000,000885,Brookhaven Memorial Hospital Medical Center Inc,50 to 69,119,F,Other Race,Not Span/Hispanic,4,Emergency,Home or Self Care,2017,149,Biliary tract disease,097,OTHER GI DX PRCS,263,Laparoscopic cholecystectomy,07,Diseases and Disorders of the Hepatobiliary System and Pancreas,2,Moderate,Minor,Surgical,Medicaid,,,,N,Y,68955.53,12850.81
Long Island,Suffolk,5123000,000885,Brookhaven Memorial Hospital Medical Center Inc,30 to 49,117,F,White,Not Span/Hispanic,5,Emergency,Home or Self Care,2017,149,Biliary tract disease,084,CHOLECYSTECTOMY/EXPLOR,263,Laparoscopic cholecystectomy,07,Diseases and Disorders of the Hepatobiliary System and Pancreas,3,Major,Major,Surgical,Private Health Insurance,,,,N,Y,86572.48,16005.09
Long Island,Suffolk,5123000,000885,Brookhaven Memorial Hospital Medical Center Inc,50 to 69,119,M,White,Not Span/Hispanic,3,Emergency,Home or Self Care,2017,149,Biliary tract disease,084,CHOLECYSTECTOMY/EXPLOR,263,Laparoscopic cholecystectomy,07,Diseases and Disorders of the Hepatobiliary System and Pancreas,1,Minor,Minor,Surgical,Medicare,Medicare,Private Health Insurance,,N,Y,50300.66,8278.56
Long Island,Suffolk,5123000,000885,Brookhaven Memorial Hospital Medical Center Inc,30 to 49,117,F,White,Not Span/Hispanic,2,Emergency,Home or Self Care,2017,149,Biliary tract disease,084,CHOLECYSTECTOMY/EXPLOR,263,Laparoscopic cholecystectomy,07,Diseases and Disorders of the Hepatobiliary System and Pancreas,1,Minor,Minor,Surgical,Self-Pay,,,,N,Y,33597.22,7411.88
Long Island,Suffolk,5123000,000885,Brookhaven Memorial Hospital Medical Center Inc,50 to 69,117,F,White,Not Span/Hispanic,4,Emergency,Home or Self Care,2017,149,Biliary tract disease,084,CHOLECYSTECTOMY/EXPLOR,263,Laparoscopic cholecystectomy,07,Diseases and Disorders of the Hepatobiliary System and Pancreas,2,Moderate,Minor,Surgical,Blue Cross/Blue Shield,,,,N,Y,46167.24,9454.31
Long Island,Suffolk,5123000,000885,Brookhaven Memorial Hospital Medical Center Inc,50 to 69,119,M,White,Not Span/Hispanic,3,Emergency,Home or Self Care,2017,149,Biliary tract disease,084,CHOLECYSTECTOMY/EXPLOR,263,Laparoscopic cholecystectomy,07,Diseases and Disorders of the Hepatobiliary System and Pancreas,2,Moderate,Minor,Surgical,Medicare,Medicare,,,N,Y,35788.48,5405.58
Long Island,Suffolk,5123000,000885,Brookhaven Memorial Hospital Medical Center Inc,50 to 69,119,M,White,Not Span/Hispanic,6,Emergency,Home or Self Care,2017,149,Biliary tract disease,084,CHOLECYSTECTOMY/EXPLOR,263,Laparoscopic cholecystectomy,07,Diseases and Disorders of the Hepatobiliary System and Pancreas,3,Major,Moderate,Surgical,Medicare,,,,N,Y,87816.66,14101.59
Long Island,Suffolk,5123000,000885,Brookhaven Memorial Hospital Medical Center Inc,18 to 29,117,F,Black/African American,Not Span/Hispanic,2,Emergency,Home or Self Care,2017,149,Biliary tract disease,084,CHOLECYSTECTOMY/EXPLOR,263,Laparoscopic cholecystectomy,07,Diseases and Disorders of the Hepatobiliary System and Pancreas,1,Minor,Minor,Surgical,Medicaid,,,,N,Y,41217.43,6566.02
Long Island,Suffolk,5123000,000885,Brookhaven Memorial Hospital Medical Center Inc,50 to 69,119,M,White,Not Span/Hispanic,7,Emergency,Home or Self Care,2017,149,Biliary tract disease,084,CHOLECYSTECTOMY/EXPLOR,263,Laparoscopic cholecystectomy,07,Diseases and Disorders of the Hepatobiliary System and Pancreas,1,Minor,Minor,Surgical,Blue Cross/Blue Shield,,,,N,Y,85408.95,17972.59
Long Island,Suffolk,5123000,000885,Brookhaven Memorial Hospital Medical Center Inc,30 to 49,117,F,White,Not Span/Hispanic,3,Emergency,Home or Self Care,2017,152,Pancreatic disorders (not diabetes),084,CHOLECYSTECTOMY/EXPLOR,263,Laparoscopic cholecystectomy,07,Diseases and Disorders of the Hepatobiliary System and Pancreas,3,Major,Minor,Surgical,Private Health Insurance,,,,N,Y,54605.75,8565.30
Long Island,Suffolk,5123000,000885,Brookhaven Memorial Hospital Medical Center Inc,50 to 69,117,F,White,Not Span/Hispanic,3,Emergency,Home or Self Care,2017,149,Biliary tract disease,084,CHOLECYSTECTOMY/EXPLOR,263,Laparoscopic cholecystectomy,07,Diseases and Disorders of the Hepatobiliary System and Pancreas,1,Minor,Minor,Surgical,Medicare,Medicare,,,N,Y,42748.85,8507.32
Long Island,Suffolk,5123000,000885,Brookhaven Memorial Hospital Medical Center Inc,50 to 69,119,M,White,Not Span/Hispanic,1,Emergency,Home or Self Care,2017,149,Biliary tract disease,084,CHOLECYSTECTOMY/EXPLOR,263,Laparoscopic cholecystectomy,07,Diseases and Disorders of the Hepatobiliary System and Pancreas,1,Minor,Minor,Surgical,Blue Cross/Blue Shield,,,,N,Y,22872.64,4893.86
Long Island,Suffolk,5123000,000885,Brookhaven Memorial Hospital Medical Center Inc,30 to 49,117,F,White,Not Span/Hispanic,4,Emergency,Home or Self Care,2017,149,Biliary tract disease,084,CHOLECYSTECTOMY/EXPLOR,263,Laparoscopic cholecystectomy,07,Diseases and Disorders of the Hepatobiliary System and Pancreas,2,Moderate,Minor,Surgical,Medicare,Medicare,Private Health Insurance,,N,Y,79737.96,14829.67
Long Island,Suffolk,5123000,000885,Brookhaven Memorial Hospital Medical Center Inc,18 to 29,119,F,White,Not Span/Hispanic,1,Emergency,Home or Self Care,2017,149,Biliary tract disease,084,CHOLECYSTECTOMY/EXPLOR,263,Laparoscopic cholecystectomy,07,Diseases and Disorders of the Hepatobiliary System and Pancreas,1,Minor,Minor,Surgical,Blue Cross/Blue Shield,,,,N,Y,22780.91,4819.26
Long Island,Suffolk,5123000,000885,Brookhaven Memorial Hospital Medical Center Inc,50 to 69,119,F,Other Race,Not Span/Hispanic,5,Emergency,Home or Self Care,2017,149,Biliary tract disease,084,CHOLECYSTECTOMY/EXPLOR,263,Laparoscopic cholecystectomy,07,Diseases and Disorders of the Hepatobiliary System and Pancreas,2,Moderate,Minor,Surgical,Medicare,,,,N,Y,60263.80,10901.97
Long Island,Suffolk,5123000,000885,Brookhaven Memorial Hospital Medical Center Inc,18 to 29,117,F,White,Not Span/Hispanic,1,Emergency,Home or Self Care,2017,149,Biliary tract disease,084,CHOLECYSTECTOMY/EXPLOR,263,Laparoscopic cholecystectomy,07,Diseases and Disorders of the Hepatobiliary System and Pancreas,2,Moderate,Minor,Surgical,Blue Cross/Blue Shield,,,,N,Y,24051.56,5153.53
Long Island,Suffolk,5123000,000885,Brookhaven Memorial Hospital Medical Center Inc,30 to 49,119,F,Other Race,Not Span/Hispanic,1,Emergency,Home or Self Care,2017,149,Biliary tract disease,084,CHOLECYSTECTOMY/EXPLOR,263,Laparoscopic cholecystectomy,07,Diseases and Disorders of the Hepatobiliary System and Pancreas,2,Moderate,Minor,Surgical,Private Health Insurance,,,,N,Y,20771.75,4669.70
Long Island,Suffolk,5123000,000885,Brookhaven Memorial Hospital Medical Center Inc,30 to 49,119,F,Other Race,Not Span/Hispanic,3,Emergency,Home or Self Care,2017,149,Biliary tract disease,084,CHOLECYSTECTOMY/EXPLOR,263,Laparoscopic cholecystectomy,07,Diseases and Disorders of the Hepatobiliary System and Pancreas,1,Minor,Minor,Surgical,Blue Cross/Blue Shield,,,,N,Y,34703.91,7594.31
Long Island,Suffolk,5123000,000885,Brookhaven Memorial Hospital Medical Center Inc,50 to 69,117,M,White,Not Span/Hispanic,6,Emergency,Home or Self Care,2017,149,Biliary tract disease,084,CHOLECYSTECTOMY/EXPLOR,263,Laparoscopic cholecystectomy,07,Diseases and Disorders of the Hepatobiliary System and Pancreas,3,Major,Moderate,Surgical,Private Health Insurance,,,,N,Y,86948.82,14101.61
Long Island,Suffolk,5123000,000885,Brookhaven Memorial Hospital Medical Center Inc,50 to 69,117,M,Black/African American,Not Span/Hispanic,3,Elective,Home or Self Care,2017,149,Biliary tract disease,084,CHOLECYSTECTOMY/EXPLOR,263,Laparoscopic cholecystectomy,07,Diseases and Disorders of the Hepatobiliary System and Pancreas,2,Moderate,Moderate,Surgical,Private Health Insurance,,,,N,N,32888.85,7656.65
Long Island,Suffolk,5123000,000885,Brookhaven Memorial Hospital Medical Center Inc,30 to 49,117,M,White,Not Span/Hispanic,2,Emergency,Home or Self Care,2017,149,Biliary tract disease,084,CHOLECYSTECTOMY/EXPLOR,263,Laparoscopic cholecystectomy,07,Diseases and Disorders of the Hepatobiliary System and Pancreas,1,Minor,Minor,Surgical,Blue Cross/Blue Shield,,,,N,Y,32197.24,6640.67
Long Island,Suffolk,5123000,000885,Brookhaven Memorial Hospital Medical Center Inc,30 to 49,117,M,Other Race,Not Span/Hispanic,1,Emergency,Home or Self Care,2017,149,Biliary tract disease,084,CHOLECYSTECTOMY/EXPLOR,263,Laparoscopic cholecystectomy,07,Diseases and Disorders of the Hepatobiliary System and Pancreas,1,Minor,Minor,Surgical,Medicaid,,,,N,Y,27648.89,6300.93
Long Island,Suffolk,5123000,000885,Brookhaven Memorial Hospital Medical Center Inc,50 to 69,117,F,Black/African American,Not Span/Hispanic,10,Emergency,Home or Self Care,2017,149,Biliary tract disease,084,CHOLECYSTECTOMY/EXPLOR,263,Laparoscopic cholecystectomy,07,Diseases and Disorders of the Hepatobiliary System and Pancreas,2,Moderate,Moderate,Surgical,Medicare,Medicare,Medicaid,,N,Y,108791.05,20734.37
Long Island,Suffolk,5123000,000885,Brookhaven Memorial Hospital Medical Center Inc,18 to 29,119,F,Other Race,Not Span/Hispanic,2,Emergency,Home or Self Care,2017,149,Biliary tract disease,084,CHOLECYSTECTOMY/EXPLOR,263,Laparoscopic cholecystectomy,07,Diseases and Disorders of the Hepatobiliary System and Pancreas,1,Minor,Minor,Surgical,Self-Pay,,,,N,Y,26583.53,5732.33
Long Island,Suffolk,5123000,000885,Brookhaven Memorial Hospital Medical Center Inc,18 to 29,119,F,White,Not Span/Hispanic,1,Emergency,Home or Self Care,2017,149,Biliary tract disease,084,CHOLECYSTECTOMY/EXPLOR,263,Laparoscopic cholecystectomy,07,Diseases and Disorders of the Hepatobiliary System and Pancreas,1,Minor,Minor,Surgical,Blue Cross/Blue Shield,,,,N,Y,23292.55,4951.47
Long Island,Suffolk,5123000,000885,Brookhaven Memorial Hospital Medical Center Inc,30 to 49,119,F,White,Not Span/Hispanic,1,Emergency,Home or Self Care,2017,149,Biliary tract disease,084,CHOLECYSTECTOMY/EXPLOR,263,Laparoscopic cholecystectomy,07,Diseases and Disorders of the Hepatobiliary System and Pancreas,2,Moderate,Minor,Surgical,Private Health Insurance,,,,N,Y,23840.72,5495.89
Long Island,Suffolk,5123000,000885,Brookhaven Memorial Hospital Medical Center Inc,30 to 49,119,F,White,Not Span/Hispanic,3,Emergency,Home or Self Care,2017,149,Biliary tract disease,084,CHOLECYSTECTOMY/EXPLOR,263,Laparoscopic cholecystectomy,07,Diseases and Disorders of the Hepatobiliary System and Pancreas,1,Minor,Minor,Surgical,Private Health Insurance,,,,N,Y,41990.28,8893.04
Long Island,Suffolk,5123000,000885,Brookhaven Memorial Hospital Medical Center Inc,50 to 69,117,M,Other Race,Not Span/Hispanic,4,Emergency,Home or Self Care,2017,149,Biliary tract disease,084,CHOLECYSTECTOMY/EXPLOR,263,Laparoscopic cholecystectomy,07,Diseases and Disorders of the Hepatobiliary System and Pancreas,3,Major,Minor,Surgical,Private Health Insurance,,,,N,Y,45015.74,9565.96
Long Island,Suffolk,5123000,000885,Brookhaven Memorial Hospital Medical Center Inc,18 to 29,117,F,Black/African American,Not Span/Hispanic,2,Emergency,Home or Self Care,2017,149,Biliary tract disease,084,CHOLECYSTECTOMY/EXPLOR,263,Laparoscopic cholecystectomy,07,Diseases and Disorders of the Hepatobiliary System and Pancreas,1,Minor,Minor,Surgical,Private Health Insurance,,,,N,Y,40472.96,6837.16
Long Island,Suffolk,5123000,000885,Brookhaven Memorial Hospital Medical Center Inc,30 to 49,117,M,White,Not Span/Hispanic,2,Emergency,Home or Self Care,2017,149,Biliary tract disease,084,CHOLECYSTECTOMY/EXPLOR,263,Laparoscopic cholecystectomy,07,Diseases and Disorders of the Hepatobiliary System and Pancreas,1,Minor,Minor,Surgical,Medicaid,,,,N,Y,33340.43,7448.20
Long Island,Suffolk,5123000,000885,Brookhaven Memorial Hospital Medical Center Inc,70 or Older,119,M,White,Not Span/Hispanic,7,Emergency,Home w/ Home Health Services,2017,152,Pancreatic disorders (not diabetes),084,CHOLECYSTECTOMY/EXPLOR,263,Laparoscopic cholecystectomy,07,Diseases and Disorders of the Hepatobiliary System and Pancreas,3,Major,Moderate,Surgical,Medicare,Medicare,Blue Cross/Blue Shield,,N,Y,92832.37,15363.65
Long Island,Suffolk,5123000,000885,Brookhaven Memorial Hospital Medical Center Inc,30 to 49,119,F,White,Not Span/Hispanic,3,Emergency,Home or Self Care,2017,149,Biliary tract disease,084,CHOLECYSTECTOMY/EXPLOR,263,Laparoscopic cholecystectomy,07,Diseases and Disorders of the Hepatobiliary System and Pancreas,2,Moderate,Minor,Surgical,Private Health Insurance,,,,N,Y,31932.46,7390.36
Long Island,Suffolk,5123000,000885,Brookhaven Memorial Hospital Medical Center Inc,50 to 69,117,M,Other Race,Not Span/Hispanic,2,Emergency,Home or Self Care,2017,149,Biliary tract disease,084,CHOLECYSTECTOMY/EXPLOR,263,Laparoscopic cholecystectomy,07,Diseases and Disorders of the Hepatobiliary System and Pancreas,1,Minor,Minor,Surgical,Self-Pay,,,,N,Y,36185.75,6138.99
Long Island,Suffolk,5123000,000885,Brookhaven Memorial Hospital Medical Center Inc,18 to 29,119,F,White,Not Span/Hispanic,2,Emergency,Home or Self Care,2017,149,Biliary tract disease,084,CHOLECYSTECTOMY/EXPLOR,263,Laparoscopic cholecystectomy,07,Diseases and Disorders of the Hepatobiliary System and Pancreas,1,Minor,Minor,Surgical,Blue Cross/Blue Shield,,,,N,Y,27381.03,5832.46
Long Island,Suffolk,5123000,000885,Brookhaven Memorial Hospital Medical Center Inc,18 to 29,117,F,Other Race,Not Span/Hispanic,4,Emergency,Left Against Medical Advice,2017,149,Biliary tract disease,084,CHOLECYSTECTOMY/EXPLOR,263,Laparoscopic cholecystectomy,07,Diseases and Disorders of the Hepatobiliary System and Pancreas,1,Minor,Minor,Surgical,Medicaid,,,,N,Y,51055.19,10047.91
Long Island,Suffolk,5123000,000885,Brookhaven Memorial Hospital Medical Center Inc,50 to 69,119,F,Other Race,Not Span/Hispanic,9,Emergency,Home or Self Care,2017,152,Pancreatic disorders (not diabetes),084,CHOLECYSTECTOMY/EXPLOR,263,Laparoscopic cholecystectomy,07,Diseases and Disorders of the Hepatobiliary System and Pancreas,2,Moderate,Minor,Surgical,Private Health Insurance,,,,N,Y,106060.43,17391.36
Long Island,Suffolk,5123000,000885,Brookhaven Memorial Hospital Medical Center Inc,30 to 49,,M,White,Not Span/Hispanic,2,Emergency,Home or Self Care,2017,149,Biliary tract disease,084,CHOLECYSTECTOMY/EXPLOR,263,Laparoscopic cholecystectomy,07,Diseases and Disorders of the Hepatobiliary System and Pancreas,1,Minor,Minor,Surgical,Self-Pay,,,,N,Y,39757.53,6451.73
Long Island,Suffolk,5123000,000885,Brookhaven Memorial Hospital Medical Center Inc,30 to 49,117,M,White,Not Span/Hispanic,1,Emergency,Home or Self Care,2017,149,Biliary tract disease,084,CHOLECYSTECTOMY/EXPLOR,263,Laparoscopic cholecystectomy,07,Diseases and Disorders of the Hepatobiliary System and Pancreas,1,Minor,Minor,Surgical,Private Health Insurance,,,,N,Y,26395.85,5593.12
Long Island,Suffolk,5123000,000885,Brookhaven Memorial Hospital Medical Center Inc,30 to 49,117,F,White,Not Span/Hispanic,2,Emergency,Home or Self Care,2017,149,Biliary tract disease,084,CHOLECYSTECTOMY/EXPLOR,263,Laparoscopic cholecystectomy,07,Diseases and Disorders of the Hepatobiliary System and Pancreas,1,Minor,Minor,Surgical,Private Health Insurance,,,,N,Y,51727.80,8745.58
Long Island,Suffolk,5123000,000885,Brookhaven Memorial Hospital Medical Center Inc,70 or Older,117,F,White,Not Span/Hispanic,1,Urgent,Home or Self Care,2017,149,Biliary tract disease,084,CHOLECYSTECTOMY/EXPLOR,263,Laparoscopic cholecystectomy,07,Diseases and Disorders of the Hepatobiliary System and Pancreas,1,Minor,Minor,Surgical,Private Health Insurance,,,,N,N,22359.76,5627.59
Long Island,Suffolk,5123000,000885,Brookhaven Memorial Hospital Medical Center Inc,30 to 49,117,F,Other Race,Not Span/Hispanic,2,Emergency,Home or Self Care,2017,149,Biliary tract disease,084,CHOLECYSTECTOMY/EXPLOR,263,Laparoscopic cholecystectomy,07,Diseases and Disorders of the Hepatobiliary System and Pancreas,1,Minor,Minor,Surgical,Blue Cross/Blue Shield,,,,N,Y,39880.81,6350.74
Long Island,Suffolk,5123000,000885,Brookhaven Memorial Hospital Medical Center Inc,30 to 49,119,F,Other Race,Not Span/Hispanic,1,Emergency,Home or Self Care,2017,149,Biliary tract disease,084,CHOLECYSTECTOMY/EXPLOR,263,Laparoscopic cholecystectomy,07,Diseases and Disorders of the Hepatobiliary System and Pancreas,1,Minor,Minor,Surgical,Medicaid,,,,N,Y,21296.41,4826.82
Long Island,Suffolk,5123000,000885,Brookhaven Memorial Hospital Medical Center Inc,18 to 29,117,F,White,Not Span/Hispanic,4,Emergency,Home or Self Care,2017,149,Biliary tract disease,084,CHOLECYSTECTOMY/EXPLOR,263,Laparoscopic cholecystectomy,07,Diseases and Disorders of the Hepatobiliary System and Pancreas,1,Minor,Minor,Surgical,Blue Cross/Blue Shield,,,,N,Y,85992.78,14579.59
Long Island,Suffolk,5123000,000885,Brookhaven Memorial Hospital Medical Center Inc,30 to 49,119,M,Other Race,Not Span/Hispanic,1,Emergency,Home or Self Care,2017,149,Biliary tract disease,084,CHOLECYSTECTOMY/EXPLOR,263,Laparoscopic cholecystectomy,07,Diseases and Disorders of the Hepatobiliary System and Pancreas,1,Minor,Minor,Surgical,Private Health Insurance,,,,N,Y,20955.23,4523.15
Long Island,Suffolk,5123000,000885,Brookhaven Memorial Hospital Medical Center Inc,50 to 69,117,M,White,Not Span/Hispanic,2,Emergency,Home or Self Care,2017,149,Biliary tract disease,084,CHOLECYSTECTOMY/EXPLOR,263,Laparoscopic cholecystectomy,07,Diseases and Disorders of the Hepatobiliary System and Pancreas,1,Minor,Minor,Surgical,Blue Cross/Blue Shield,,,,N,Y,48220.85,6721.87
Long Island,Suffolk,5123000,000885,Brookhaven Memorial Hospital Medical Center Inc,30 to 49,117,F,Other Race,Not Span/Hispanic,13,Emergency,Home or Self Care,2017,149,Biliary tract disease,084,CHOLECYSTECTOMY/EXPLOR,263,Laparoscopic cholecystectomy,07,Diseases and Disorders of the Hepatobiliary System and Pancreas,3,Major,Major,Surgical,Medicaid,,,,N,Y,127353.16,25663.87
Long Island,Suffolk,5123000,000885,Brookhaven Memorial Hospital Medical Center Inc,70 or Older,117,F,Other Race,Not Span/Hispanic,4,Emergency,Home or Self Care,2017,149,Biliary tract disease,084,CHOLECYSTECTOMY/EXPLOR,263,Laparoscopic cholecystectomy,07,Diseases and Disorders of the Hepatobiliary System and Pancreas,3,Major,Major,Surgical,Medicare,Medicaid,,,N,Y,58159.58,9973.14
Long Island,Suffolk,5123000,000885,Brookhaven Memorial Hospital Medical Center Inc,70 or Older,119,M,White,Not Span/Hispanic,5,Emergency,Home w/ Home Health Services,2017,149,Biliary tract disease,084,CHOLECYSTECTOMY/EXPLOR,263,Laparoscopic cholecystectomy,07,Diseases and Disorders of the Hepatobiliary System and Pancreas,3,Major,Major,Surgical,Medicare,,,,N,Y,73778.19,13030.23
Long Island,Suffolk,5123000,000885,Brookhaven Memorial Hospital Medical Center Inc,18 to 29,119,F,White,Not Span/Hispanic,3,Emergency,Home or Self Care,2017,152,Pancreatic disorders (not diabetes),084,CHOLECYSTECTOMY/EXPLOR,263,Laparoscopic cholecystectomy,07,Diseases and Disorders of the Hepatobiliary System and Pancreas,3,Major,Minor,Surgical,Private Health Insurance,,,,N,Y,44929.06,7365.89
Long Island,Suffolk,5123000,000885,Brookhaven Memorial Hospital Medical Center Inc,50 to 69,117,M,Other Race,Not Span/Hispanic,2,Emergency,Home or Self Care,2017,149,Biliary tract disease,084,CHOLECYSTECTOMY/EXPLOR,263,Laparoscopic cholecystectomy,07,Diseases and Disorders of the Hepatobiliary System and Pancreas,1,Minor,Minor,Surgical,Private Health Insurance,,,,N,Y,27339.46,5831.31
Long Island,Suffolk,5123000,000885,Brookhaven Memorial Hospital Medical Center Inc,70 or Older,119,M,White,Not Span/Hispanic,9,Emergency,Skilled Nursing Home,2017,149,Biliary tract disease,084,CHOLECYSTECTOMY/EXPLOR,263,Laparoscopic cholecystectomy,07,Diseases and Disorders of the Hepatobiliary System and Pancreas,3,Major,Major,Surgical,Private Health Insurance,,,,N,Y,132689.25,22183.10
Long Island,Suffolk,5123000,000885,Brookhaven Memorial Hospital Medical Center Inc,50 to 69,119,F,White,Not Span/Hispanic,1,Emergency,Home or Self Care,2017,149,Biliary tract disease,084,CHOLECYSTECTOMY/EXPLOR,263,Laparoscopic cholecystectomy,07,Diseases and Disorders of the Hepatobiliary System and Pancreas,2,Moderate,Minor,Surgical,Private Health Insurance,,,,N,Y,35400.44,5087.96
Long Island,Suffolk,5123000,000885,Brookhaven Memorial Hospital Medical Center Inc,50 to 69,119,M,White,Not Span/Hispanic,2,Emergency,Home or Self Care,2017,149,Biliary tract disease,084,CHOLECYSTECTOMY/EXPLOR,263,Laparoscopic cholecystectomy,07,Diseases and Disorders of the Hepatobiliary System and Pancreas,1,Minor,Minor,Surgical,Blue Cross/Blue Shield,Blue Cross/Blue Shield,,,N,Y,62182.56,9543.32
Long Island,Suffolk,5123000,000885,Brookhaven Memorial Hospital Medical Center Inc,70 or Older,,M,White,Not Span/Hispanic,4,Emergency,Home w/ Home Health Services,2017,149,Biliary tract disease,084,CHOLECYSTECTOMY/EXPLOR,263,Laparoscopic cholecystectomy,07,Diseases and Disorders of the Hepatobiliary System and Pancreas,2,Moderate,Minor,Surgical,Medicare,Medicare,,,N,Y,66158.06,11557.92
Long Island,Suffolk,5123000,000885,Brookhaven Memorial Hospital Medical Center Inc,18 to 29,117,F,White,Not Span/Hispanic,2,Emergency,Home or Self Care,2017,152,Pancreatic disorders (not diabetes),084,CHOLECYSTECTOMY/EXPLOR,263,Laparoscopic cholecystectomy,07,Diseases and Disorders of the Hepatobiliary System and Pancreas,3,Major,Minor,Surgical,Private Health Insurance,,,,N,Y,41543.20,6656.64