Hospital Service Area,Hospital County,Operating Certificate Number,Permanent Facility Id,Facility Name,Age Group,Zip Code - 3 digits,Gender,Race,Ethnicity,Length of Stay,Type of Admission,Patient Disposition,Discharge Year,CCS Diagnosis Code,CCS Diagnosis Description,CCS Procedure Code,CCS Procedure Description,APR DRG Code,APR DRG Description,APR MDC Code,APR MDC Description,APR Severity of Illness Code,APR Severity of Illness Description,APR Risk of Mortality,APR Medical Surgical Description,Payment Typology 1,Payment Typology 2,Payment Typology 3,Birth Weight,Abortion Edit Indicator,Emergency Department Indicator,Total Charges,Total Costs
New York City,Manhattan,7002001,001438,Bellevue Hospital Center,18 to 29,112,M,Other Race,Spanish/Hispanic,9,Emergency,Home or Self Care,2017,152,Pancreatic disorders (not diabetes),097,OTHER GI DX PRCS,264,"Other hepatobiliary, pancreas & abdominal procedures",07,Diseases and Disorders of the Hepatobiliary System and Pancreas,3,Major,Minor,Surgical,Medicaid,,,,N,N,51704.60,33336.44
New York City,Manhattan,7002001,001438,Bellevue Hospital Center,30 to 49,114,M,Other Race,Spanish/Hispanic,4,Emergency,Home or Self Care,2017,151,Other liver diseases,097,OTHER GI DX PRCS,264,"Other hepatobiliary, pancreas & abdominal procedures",07,Diseases and Disorders of the Hepatobiliary System and Pancreas,3,Major,Moderate,Surgical,Self-Pay,,,,N,Y,28200.57,18182.26
New York City,Manhattan,7002001,001438,Bellevue Hospital Center,50 to 69,113,M,White,Not Span/Hispanic,1,Elective,Home or Self Care,2017,149,Biliary tract disease,097,OTHER GI DX PRCS,264,"Other hepatobiliary, pancreas & abdominal procedures",07,Diseases and Disorders of the Hepatobiliary System and Pancreas,2,Moderate,Minor,Surgical,Medicaid,,,,N,N,6523.04,4205.72
New York City,Manhattan,7002001,001438,Bellevue Hospital Center,30 to 49,114,M,Other Race,Not Span/Hispanic,23,Emergency,Home or Self Care,2017,660,Alcohol-related disorders,070,UP GASTRO ENDOSC/BIOPSY,264,"Other hepatobiliary, pancreas & abdominal procedures",07,Diseases and Disorders of the Hepatobiliary System and Pancreas,3,Major,Moderate,Surgical,Medicaid,,,,N,Y,131048.23,84493.08
New York City,Manhattan,7002001,001438,Bellevue Hospital Center,50 to 69,111,M,Other Race,Not Span/Hispanic,9,Emergency,Home or Self Care,2017,151,Other liver diseases,097,OTHER GI DX PRCS,264,"Other hepatobiliary, pancreas & abdominal procedures",07,Diseases and Disorders of the Hepatobiliary System and Pancreas,3,Major,Major,Surgical,Private Health Insurance,,,,N,Y,55522.18,35797.81
New York City,Manhattan,7002001,001438,Bellevue Hospital Center,50 to 69,100,M,Other Race,Not Span/Hispanic,10,Emergency,Home or Self Care,2017,016,Cancer of liver and intrahepatic bile duct,090,EXCISION; LYS PERI ADHS,264,"Other hepatobiliary, pancreas & abdominal procedures",07,Diseases and Disorders of the Hepatobiliary System and Pancreas,3,Major,Moderate,Surgical,Medicare,Medicare,Medicaid,,N,N,65233.75,42059.33
New York City,Manhattan,7002001,001438,Bellevue Hospital Center,50 to 69,100,M,Other Race,Spanish/Hispanic,2,Emergency,Home or Self Care,2017,660,Alcohol-related disorders,097,OTHER GI DX PRCS,264,"Other hepatobiliary, pancreas & abdominal procedures",07,Diseases and Disorders of the Hepatobiliary System and Pancreas,2,Moderate,Moderate,Surgical,Medicare,Medicare,Medicaid,,N,Y,19249.58,12411.13
New York City,Manhattan,7002001,001438,Bellevue Hospital Center,50 to 69,112,M,White,Not Span/Hispanic,1,Emergency,Home or Self Care,2017,155,Other gastrointestinal disorders,231,OTHER THERAPEUTIC PRCS,264,"Other hepatobiliary, pancreas & abdominal procedures",07,Diseases and Disorders of the Hepatobiliary System and Pancreas,1,Minor,Minor,Surgical,Medicaid,,,,N,Y,9204.12,5934.34
New York City,Manhattan,7002001,001438,Bellevue Hospital Center,30 to 49,114,M,Other Race,Spanish/Hispanic,14,Emergency,Home or Self Care,2017,660,Alcohol-related disorders,088,ABDOMINAL PARACENTESIS,264,"Other hepatobiliary, pancreas & abdominal procedures",07,Diseases and Disorders of the Hepatobiliary System and Pancreas,2,Moderate,Major,Surgical,Medicaid,,,,N,Y,74041.35,47738.01
New York City,Manhattan,7002001,001438,Bellevue Hospital Center,30 to 49,100,F,Other Race,Spanish/Hispanic,2,Emergency,Home or Self Care,2017,006,Hepatitis,099,OT OR GI THER PRCS,264,"Other hepatobiliary, pancreas & abdominal procedures",07,Diseases and Disorders of the Hepatobiliary System and Pancreas,2,Moderate,Minor,Surgical,Medicaid,Medicaid,,,N,Y,14948.41,9637.96
New York City,Manhattan,7002001,001438,Bellevue Hospital Center,70 or Older,100,M,Other Race,Not Span/Hispanic,1,Emergency,Expired,2017,234,Crushing injury or internal injury,097,OTHER GI DX PRCS,264,"Other hepatobiliary, pancreas & abdominal procedures",07,Diseases and Disorders of the Hepatobiliary System and Pancreas,3,Major,Major,Surgical,Miscellaneous/Other,Medicare,,,N,Y,17666.11,11390.19
New York City,Manhattan,7002001,001438,Bellevue Hospital Center,50 to 69,112,M,Other Race,Spanish/Hispanic,29,Emergency,Skilled Nursing Home,2017,660,Alcohol-related disorders,097,OTHER GI DX PRCS,264,"Other hepatobiliary, pancreas & abdominal procedures",07,Diseases and Disorders of the Hepatobiliary System and Pancreas,4,Extreme,Major,Surgical,Medicare,Medicaid,,,N,Y,156209.89,100716.01
New York City,Manhattan,7002001,001438,Bellevue Hospital Center,70 or Older,103,F,Other Race,Not Span/Hispanic,11,Emergency,Expired,2017,149,Biliary tract disease,098,OT NON-OR GI THER PRCS,264,"Other hepatobiliary, pancreas & abdominal procedures",07,Diseases and Disorders of the Hepatobiliary System and Pancreas,2,Moderate,Moderate,Surgical,Medicaid,,,,N,Y,61045.34,39358.86
New York City,Manhattan,7002001,001438,Bellevue Hospital Center,50 to 69,113,M,Other Race,Not Span/Hispanic,9,Emergency,Short-term Hospital,2017,151,Other liver diseases,222,BLOOD TRANSFUSION,264,"Other hepatobiliary, pancreas & abdominal procedures",07,Diseases and Disorders of the Hepatobiliary System and Pancreas,3,Major,Major,Surgical,Medicare,Medicaid,,,N,Y,70958.72,45750.49
New York City,Manhattan,7002001,001438,Bellevue Hospital Center,50 to 69,100,M,Black/African American,Not Span/Hispanic,8,Emergency,Home or Self Care,2017,660,Alcohol-related disorders,097,OTHER GI DX PRCS,264,"Other hepatobiliary, pancreas & abdominal procedures",07,Diseases and Disorders of the Hepatobiliary System and Pancreas,3,Major,Moderate,Surgical,Medicaid,Medicaid,,,N,Y,44983.24,29002.85
New York City,Manhattan,7002001,001438,Bellevue Hospital Center,70 or Older,100,F,Other Race,Not Span/Hispanic,24,Emergency,Expired,2017,149,Biliary tract disease,061,OT OR PRCS VES NOT HEAD,264,"Other hepatobiliary, pancreas & abdominal procedures",07,Diseases and Disorders of the Hepatobiliary System and Pancreas,3,Major,Major,Surgical,Self-Pay,,,,N,Y,140411.12,90529.79
New York City,Manhattan,7002001,001438,Bellevue Hospital Center,50 to 69,100,M,White,Not Span/Hispanic,29,Emergency,Home w/ Home Health Services,2017,660,Alcohol-related disorders,088,ABDOMINAL PARACENTESIS,264,"Other hepatobiliary, pancreas & abdominal procedures",07,Diseases and Disorders of the Hepatobiliary System and Pancreas,4,Extreme,Extreme,Surgical,Medicaid,,,,N,Y,155976.64,100565.63
New York City,Manhattan,7002001,001438,Bellevue Hospital Center,30 to 49,112,M,Other Race,Spanish/Hispanic,31,Emergency,Home or Self Care,2017,660,Alcohol-related disorders,088,ABDOMINAL PARACENTESIS,264,"Other hepatobiliary, pancreas & abdominal procedures",07,Diseases and Disorders of the Hepatobiliary System and Pancreas,2,Moderate,Major,Surgical,Medicaid,Medicaid,,,N,Y,160026.24,103176.60
New York City,Manhattan,7002001,001438,Bellevue Hospital Center,70 or Older,114,M,Other Race,Not Span/Hispanic,6,Emergency,Expired,2017,016,Cancer of liver and intrahepatic bile duct,097,OTHER GI DX PRCS,264,"Other hepatobiliary, pancreas & abdominal procedures",07,Diseases and Disorders of the Hepatobiliary System and Pancreas,3,Major,Major,Surgical,Medicaid,,,,N,Y,33956.98,21893.69
New York City,Manhattan,7002001,001438,Bellevue Hospital Center,50 to 69,100,M,White,Not Span/Hispanic,3,Emergency,Home or Self Care,2017,660,Alcohol-related disorders,088,ABDOMINAL PARACENTESIS,264,"Other hepatobiliary, pancreas & abdominal procedures",07,Diseases and Disorders of the Hepatobiliary System and Pancreas,2,Moderate,Moderate,Surgical,Medicaid,,,,N,Y,18707.38,12061.55
New York City,Manhattan,7002001,001438,Bellevue Hospital Center,30 to 49,100,M,Other Race,Not Span/Hispanic,8,Emergency,Home or Self Care,2017,016,Cancer of liver and intrahepatic bile duct,083,BIOPSY OF LIVER,264,"Other hepatobiliary, pancreas & abdominal procedures",07,Diseases and Disorders of the Hepatobiliary System and Pancreas,4,Extreme,Major,Surgical,Medicaid,Medicaid,,,N,Y,45802.18,29530.86
New York City,Manhattan,7002001,001438,Bellevue Hospital Center,30 to 49,100,F,Other Race,Not Span/Hispanic,3,Emergency,Home or Self Care,2017,151,Other liver diseases,097,OTHER GI DX PRCS,264,"Other hepatobiliary, pancreas & abdominal procedures",07,Diseases and Disorders of the Hepatobiliary System and Pancreas,2,Moderate,Moderate,Surgical,Medicaid,,,,N,Y,25291.97,16306.95
New York City,Manhattan,7002001,001438,Bellevue Hospital Center,30 to 49,100,M,Other Race,Not Span/Hispanic,12,Emergency,Expired,2017,660,Alcohol-related disorders,097,OTHER GI DX PRCS,264,"Other hepatobiliary, pancreas & abdominal procedures",07,Diseases and Disorders of the Hepatobiliary System and Pancreas,3,Major,Extreme,Surgical,Medicaid,,,,N,Y,98008.47,63190.77
New York City,Manhattan,7002001,001438,Bellevue Hospital Center,30 to 49,112,M,White,Not Span/Hispanic,3,Emergency,Home or Self Care,2017,660,Alcohol-related disorders,097,OTHER GI DX PRCS,264,"Other hepatobiliary, pancreas & abdominal procedures",07,Diseases and Disorders of the Hepatobiliary System and Pancreas,2,Moderate,Moderate,Surgical,Self-Pay,,,,N,Y,22335.14,14400.54
New York City,Manhattan,7002001,001438,Bellevue Hospital Center,30 to 49,100,M,Other Race,Spanish/Hispanic,19,Emergency,Home or Self Care,2017,660,Alcohol-related disorders,077,PROCTOSCOPY & AR BIOPSY,264,"Other hepatobiliary, pancreas & abdominal procedures",07,Diseases and Disorders of the Hepatobiliary System and Pancreas,3,Major,Moderate,Surgical,Medicaid,,,,N,Y,107029.15,69006.83
New York City,Manhattan,7002001,001438,Bellevue Hospital Center,50 to 69,100,F,White,Not Span/Hispanic,3,Emergency,Home or Self Care,2017,660,Alcohol-related disorders,097,OTHER GI DX PRCS,264,"Other hepatobiliary, pancreas & abdominal procedures",07,Diseases and Disorders of the Hepatobiliary System and Pancreas,1,Minor,Minor,Surgical,Medicare,Medicaid,,,N,Y,20703.28,13348.40
New York City,Manhattan,7002001,001438,Bellevue Hospital Center,50 to 69,100,M,White,Not Span/Hispanic,5,Emergency,Expired,2017,660,Alcohol-related disorders,063,OT NON-OR THER CARDIO,264,"Other hepatobiliary, pancreas & abdominal procedures",07,Diseases and Disorders of the Hepatobiliary System and Pancreas,4,Extreme,Extreme,Surgical,Private Health Insurance,,,,N,Y,46426.17,29933.18
New York City,Manhattan,7002001,001438,Bellevue Hospital Center,30 to 49,112,M,Other Race,Not Span/Hispanic,14,Emergency,Home or Self Care,2017,660,Alcohol-related disorders,097,OTHER GI DX PRCS,264,"Other hepatobiliary, pancreas & abdominal procedures",07,Diseases and Disorders of the Hepatobiliary System and Pancreas,2,Moderate,Moderate,Surgical,Medicaid,Medicaid,,,N,Y,74873.42,48274.49
New York City,Manhattan,7002001,001438,Bellevue Hospital Center,50 to 69,113,M,Other Race,Spanish/Hispanic,3,Emergency,Home or Self Care,2017,151,Other liver diseases,088,ABDOMINAL PARACENTESIS,264,"Other hepatobiliary, pancreas & abdominal procedures",07,Diseases and Disorders of the Hepatobiliary System and Pancreas,2,Moderate,Moderate,Surgical,Medicaid,,,,N,Y,25050.91,16151.52
New York City,Manhattan,7002001,001438,Bellevue Hospital Center,50 to 69,100,M,Other Race,Not Span/Hispanic,6,Emergency,Home or Self Care,2017,660,Alcohol-related disorders,056,OT VASCULAR BYP/SHUNT,264,"Other hepatobiliary, pancreas & abdominal procedures",07,Diseases and Disorders of the Hepatobiliary System and Pancreas,3,Major,Major,Surgical,Medicaid,,,,N,Y,45498.13,29334.83
New York City,Manhattan,7002001,001438,Bellevue Hospital Center,50 to 69,113,M,Other Race,Spanish/Hispanic,13,Emergency,Home or Self Care,2017,660,Alcohol-related disorders,097,OTHER GI DX PRCS,264,"Other hepatobiliary, pancreas & abdominal procedures",07,Diseases and Disorders of the Hepatobiliary System and Pancreas,3,Major,Major,Surgical,Medicaid,,,,N,Y,67763.14,43690.15
New York City,Manhattan,7002001,001438,Bellevue Hospital Center,50 to 69,112,M,White,Not Span/Hispanic,3,Emergency,Home w/ Home Health Services,2017,660,Alcohol-related disorders,097,OTHER GI DX PRCS,264,"Other hepatobiliary, pancreas & abdominal procedures",07,Diseases and Disorders of the Hepatobiliary System and Pancreas,2,Moderate,Minor,Surgical,Medicaid,Medicaid,,,N,Y,20286.78,13079.86
New York City,Manhattan,7002001,001438,Bellevue Hospital Center,30 to 49,113,M,White,Not Span/Hispanic,43,Emergency,Expired,2017,660,Alcohol-related disorders,097,OTHER GI DX PRCS,264,"Other hepatobiliary, pancreas & abdominal procedures",07,Diseases and Disorders of the Hepatobiliary System and Pancreas,4,Extreme,Extreme,Surgical,Medicaid,,,,N,Y,242767.90,156524.12
New York City,Manhattan,7002001,001438,Bellevue Hospital Center,50 to 69,112,M,White,Spanish/Hispanic,29,Emergency,Expired,2017,151,Other liver diseases,097,OTHER GI DX PRCS,264,"Other hepatobiliary, pancreas & abdominal procedures",07,Diseases and Disorders of the Hepatobiliary System and Pancreas,4,Extreme,Major,Surgical,Medicare,Medicaid,,,N,Y,155151.81,100033.82
New York City,Manhattan,7002001,001438,Bellevue Hospital Center,70 or Older,112,F,Other Race,Spanish/Hispanic,5,Emergency,Home or Self Care,2017,151,Other liver diseases,097,OTHER GI DX PRCS,264,"Other hepatobiliary, pancreas & abdominal procedures",07,Diseases and Disorders of the Hepatobiliary System and Pancreas,3,Major,Major,Surgical,Medicare,Medicare,Medicaid,,N,N,27241.62,17563.98
New York City,Manhattan,7002001,001438,Bellevue Hospital Center,50 to 69,100,M,Other Race,Spanish/Hispanic,5,Emergency,Home or Self Care,2017,660,Alcohol-related disorders,088,ABDOMINAL PARACENTESIS,264,"Other hepatobiliary, pancreas & abdominal procedures",07,Diseases and Disorders of the Hepatobiliary System and Pancreas,3,Major,Major,Surgical,Medicaid,,,,N,Y,31559.10,20347.67
New York City,Manhattan,7002001,001438,Bellevue Hospital Center,50 to 69,113,M,Other Race,Spanish/Hispanic,5,Emergency,Home or Self Care,2017,155,Other gastrointestinal disorders,097,OTHER GI DX PRCS,264,"Other hepatobiliary, pancreas & abdominal procedures",07,Diseases and Disorders of the Hepatobiliary System and Pancreas,3,Major,Major,Surgical,Medicaid,,,,N,Y,30143.40,19434.90
New York City,Manhattan,7002001,001438,Bellevue Hospital Center,70 or Older,OOS,M,Black/African American,Not Span/Hispanic,6,Emergency,Home or Self Care,2017,016,Cancer of liver and intrahepatic bile duct,083,BIOPSY OF LIVER,264,"Other hepatobiliary, pancreas & abdominal procedures",07,Diseases and Disorders of the Hepatobiliary System and Pancreas,3,Major,Major,Surgical,Medicaid,,,,N,Y,40600.48,26177.08
New York City,Manhattan,7002001,001438,Bellevue Hospital Center,70 or Older,112,F,Other Race,Spanish/Hispanic,8,Emergency,Home or Self Care,2017,151,Other liver diseases,222,BLOOD TRANSFUSION,264,"Other hepatobiliary, pancreas & abdominal procedures",07,Diseases and Disorders of the Hepatobiliary System and Pancreas,3,Major,Major,Surgical,Medicare,Medicare,Medicaid,,N,Y,50547.94,32590.68
New York City,Manhattan,7002001,001438,Bellevue Hospital Center,50 to 69,112,M,Other Race,Not Span/Hispanic,6,Emergency,Home or Self Care,2017,151,Other liver diseases,097,OTHER GI DX PRCS,264,"Other hepatobiliary, pancreas & abdominal procedures",07,Diseases and Disorders of the Hepatobiliary System and Pancreas,3,Major,Moderate,Surgical,Medicaid,,,,N,Y,32802.51,21149.35
New York City,Manhattan,7002001,001438,Bellevue Hospital Center,50 to 69,112,M,Other Race,Not Span/Hispanic,40,Emergency,Home or Self Care,2017,660,Alcohol-related disorders,088,ABDOMINAL PARACENTESIS,264,"Other hepatobiliary, pancreas & abdominal procedures",07,Diseases and Disorders of the Hepatobiliary System and Pancreas,3,Major,Moderate,Surgical,Private Health Insurance,Medicaid,,,N,Y,203419.41,131154.26
New York City,Manhattan,7002001,001438,Bellevue Hospital Center,50 to 69,113,M,Other Race,Spanish/Hispanic,3,Emergency,Home or Self Care,2017,660,Alcohol-related disorders,097,OTHER GI DX PRCS,264,"Other hepatobiliary, pancreas & abdominal procedures",07,Diseases and Disorders of the Hepatobiliary System and Pancreas,2,Moderate,Minor,Surgical,Medicaid,Medicaid,,,N,Y,20341.86,13115.37
New York City,Manhattan,7002001,001438,Bellevue Hospital Center,30 to 49,100,M,Other Race,Not Span/Hispanic,3,Emergency,Home or Self Care,2017,660,Alcohol-related disorders,097,OTHER GI DX PRCS,264,"Other hepatobiliary, pancreas & abdominal procedures",07,Diseases and Disorders of the Hepatobiliary System and Pancreas,2,Moderate,Moderate,Surgical,Medicaid,Medicaid,,,N,Y,18791.89,12116.03
