Hospital Service Area,Hospital County,Operating Certificate Number,Permanent Facility Id,Facility Name,Age Group,Zip Code - 3 digits,Gender,Race,Ethnicity,Length of Stay,Type of Admission,Patient Disposition,Discharge Year,CCS Diagnosis Code,CCS Diagnosis Description,CCS Procedure Code,CCS Procedure Description,APR DRG Code,APR DRG Description,APR MDC Code,APR MDC Description,APR Severity of Illness Code,APR Severity of Illness Description,APR Risk of Mortality,APR Medical Surgical Description,Payment Typology 1,Payment Typology 2,Payment Typology 3,Birth Weight,Abortion Edit Indicator,Emergency Department Indicator,Total Charges,Total Costs
Long Island,Nassau,2908000,000511,NYU Winthrop Hospital,50 to 69,117,M,White,Not Span/Hispanic,5,Emergency,Home or Self Care,2017,018,Cancer of other GI organs; peritoneum,098,OT NON-OR GI THER PRCS,264,"Other hepatobiliary, pancreas & abdominal procedures",07,Diseases and Disorders of the Hepatobiliary System and Pancreas,3,Major,Moderate,Surgical,Medicare,Medicare,Private Health Insurance,,N,Y,90778.42,19566.45
Long Island,Nassau,2908000,000511,NYU Winthrop Hospital,50 to 69,114,F,White,Not Span/Hispanic,9,Emergency,Hospice - Medical Facility,2017,042,Secondary malignancies,097,OTHER GI DX PRCS,264,"Other hepatobiliary, pancreas & abdominal procedures",07,Diseases and Disorders of the Hepatobiliary System and Pancreas,3,Major,Major,Surgical,Medicare,Medicare,Private Health Insurance,,N,Y,85551.13,18283.09
Long Island,Nassau,2908000,000511,NYU Winthrop Hospital,50 to 69,110,F,White,Not Span/Hispanic,8,Emergency,Left Against Medical Advice,2017,006,Hepatitis,039,INCISION OF PLEURA,264,"Other hepatobiliary, pancreas & abdominal procedures",07,Diseases and Disorders of the Hepatobiliary System and Pancreas,3,Major,Major,Surgical,Medicaid,Medicaid,,,N,Y,84262.51,17730.88
Long Island,Nassau,2908000,000511,NYU Winthrop Hospital,70 or Older,115,F,Black/African American,Not Span/Hispanic,4,Emergency,Hospice - Home,2017,017,Cancer of pancreas,097,OTHER GI DX PRCS,264,"Other hepatobiliary, pancreas & abdominal procedures",07,Diseases and Disorders of the Hepatobiliary System and Pancreas,3,Major,Major,Surgical,Medicare,Medicaid,,,N,Y,43076.11,8326.62
Long Island,Nassau,2908000,000511,NYU Winthrop Hospital,30 to 49,115,M,Other Race,Spanish/Hispanic,7,Emergency,Home or Self Care,2017,660,Alcohol-related disorders,097,OTHER GI DX PRCS,264,"Other hepatobiliary, pancreas & abdominal procedures",07,Diseases and Disorders of the Hepatobiliary System and Pancreas,3,Major,Moderate,Surgical,Medicaid,,,,N,Y,76961.32,14803.57
Long Island,Nassau,2908000,000511,NYU Winthrop Hospital,50 to 69,115,F,White,Not Span/Hispanic,2,Emergency,Home or Self Care,2017,149,Biliary tract disease,070,UP GASTRO ENDOSC/BIOPSY,264,"Other hepatobiliary, pancreas & abdominal procedures",07,Diseases and Disorders of the Hepatobiliary System and Pancreas,3,Major,Major,Surgical,Private Health Insurance,Blue Cross/Blue Shield,,,N,Y,65534.43,11285.65
Long Island,Nassau,2908000,000511,NYU Winthrop Hospital,70 or Older,115,M,White,Not Span/Hispanic,6,Emergency,Home or Self Care,2017,149,Biliary tract disease,098,OT NON-OR GI THER PRCS,264,"Other hepatobiliary, pancreas & abdominal procedures",07,Diseases and Disorders of the Hepatobiliary System and Pancreas,2,Moderate,Minor,Surgical,Medicare,Medicare,Blue Cross/Blue Shield,,N,Y,81115.53,15322.03
Long Island,Nassau,2908000,000511,NYU Winthrop Hospital,70 or Older,114,M,White,Not Span/Hispanic,3,Elective,Home w/ Home Health Services,2017,018,Cancer of other GI organs; peritoneum,083,BIOPSY OF LIVER,264,"Other hepatobiliary, pancreas & abdominal procedures",07,Diseases and Disorders of the Hepatobiliary System and Pancreas,1,Minor,Minor,Surgical,Medicare,Medicare,Blue Cross/Blue Shield,,N,N,70092.85,19531.10
Long Island,Nassau,2908000,000511,NYU Winthrop Hospital,70 or Older,118,F,Other Race,Not Span/Hispanic,7,Emergency,Hospice - Home,2017,017,Cancer of pancreas,222,BLOOD TRANSFUSION,264,"Other hepatobiliary, pancreas & abdominal procedures",07,Diseases and Disorders of the Hepatobiliary System and Pancreas,3,Major,Extreme,Surgical,Medicare,Medicare,,,N,Y,111986.35,24935.12
Long Island,Nassau,2908000,000511,NYU Winthrop Hospital,70 or Older,115,M,White,Not Span/Hispanic,7,Emergency,Home w/ Home Health Services,2017,151,Other liver diseases,097,OTHER GI DX PRCS,264,"Other hepatobiliary, pancreas & abdominal procedures",07,Diseases and Disorders of the Hepatobiliary System and Pancreas,3,Major,Major,Surgical,Medicare,Medicare,,,N,Y,79365.87,17402.85
Long Island,Nassau,2908000,000511,NYU Winthrop Hospital,70 or Older,115,F,Black/African American,Not Span/Hispanic,18,Emergency,Home w/ Home Health Services,2017,018,Cancer of other GI organs; peritoneum,067,OT THER PRCS; HEM/LYMPH,264,"Other hepatobiliary, pancreas & abdominal procedures",07,Diseases and Disorders of the Hepatobiliary System and Pancreas,4,Extreme,Major,Surgical,Medicare,Medicare,Medicaid,,N,Y,161901.80,31855.74
Long Island,Nassau,2908000,000511,NYU Winthrop Hospital,70 or Older,115,F,White,Not Span/Hispanic,3,Emergency,Skilled Nursing Home,2017,152,Pancreatic disorders (not diabetes),097,OTHER GI DX PRCS,264,"Other hepatobiliary, pancreas & abdominal procedures",07,Diseases and Disorders of the Hepatobiliary System and Pancreas,1,Minor,Minor,Surgical,Medicare,Medicare,Private Health Insurance,,N,Y,64913.01,11692.24
Long Island,Nassau,2908000,000511,NYU Winthrop Hospital,70 or Older,115,M,White,Not Span/Hispanic,12,Emergency,Home w/ Home Health Services,2017,151,Other liver diseases,097,OTHER GI DX PRCS,264,"Other hepatobiliary, pancreas & abdominal procedures",07,Diseases and Disorders of the Hepatobiliary System and Pancreas,3,Major,Major,Surgical,Medicare,Medicare,Self-Pay,,N,Y,86296.37,22092.54
Long Island,Nassau,2908000,000511,NYU Winthrop Hospital,70 or Older,119,M,White,Not Span/Hispanic,2,Emergency,Home or Self Care,2017,006,Hepatitis,088,ABDOMINAL PARACENTESIS,264,"Other hepatobiliary, pancreas & abdominal procedures",07,Diseases and Disorders of the Hepatobiliary System and Pancreas,3,Major,Moderate,Surgical,Medicare,Medicare,,,N,Y,48628.34,12328.66
Long Island,Nassau,2908000,000511,NYU Winthrop Hospital,70 or Older,115,F,White,Not Span/Hispanic,8,Emergency,Home or Self Care,2017,151,Other liver diseases,088,ABDOMINAL PARACENTESIS,264,"Other hepatobiliary, pancreas & abdominal procedures",07,Diseases and Disorders of the Hepatobiliary System and Pancreas,2,Moderate,Moderate,Surgical,Medicare,Medicaid,Medicare,,N,Y,60329.04,15034.86
Long Island,Nassau,2908000,000511,NYU Winthrop Hospital,50 to 69,115,M,White,Spanish/Hispanic,6,Emergency,Home or Self Care,2017,660,Alcohol-related disorders,097,OTHER GI DX PRCS,264,"Other hepatobiliary, pancreas & abdominal procedures",07,Diseases and Disorders of the Hepatobiliary System and Pancreas,3,Major,Moderate,Surgical,Blue Cross/Blue Shield,,,,N,Y,82551.82,18541.58
Long Island,Nassau,2908000,000511,NYU Winthrop Hospital,70 or Older,115,M,White,Not Span/Hispanic,2,Emergency,Home w/ Home Health Services,2017,151,Other liver diseases,097,OTHER GI DX PRCS,264,"Other hepatobiliary, pancreas & abdominal procedures",07,Diseases and Disorders of the Hepatobiliary System and Pancreas,3,Major,Major,Surgical,Medicare,Medicare,Private Health Insurance,,N,Y,60721.24,13201.43
Long Island,Nassau,2908000,000511,NYU Winthrop Hospital,70 or Older,115,M,White,Not Span/Hispanic,4,Emergency,Home w/ Home Health Services,2017,042,Secondary malignancies,098,OT NON-OR GI THER PRCS,264,"Other hepatobiliary, pancreas & abdominal procedures",07,Diseases and Disorders of the Hepatobiliary System and Pancreas,2,Moderate,Moderate,Surgical,Medicare,Medicare,Private Health Insurance,,N,Y,79097.56,20757.07
Long Island,Nassau,2908000,000511,NYU Winthrop Hospital,50 to 69,117,F,White,Not Span/Hispanic,10,Emergency,Home w/ Home Health Services,2017,151,Other liver diseases,051,ENDARTERECTOMY;VES HEAD,264,"Other hepatobiliary, pancreas & abdominal procedures",07,Diseases and Disorders of the Hepatobiliary System and Pancreas,2,Moderate,Major,Surgical,Medicare,Medicare,,,N,Y,328546.14,85180.09
Long Island,Nassau,2908000,000511,NYU Winthrop Hospital,70 or Older,115,F,White,Not Span/Hispanic,3,Elective,Home w/ Home Health Services,2017,016,Cancer of liver and intrahepatic bile duct,083,BIOPSY OF LIVER,264,"Other hepatobiliary, pancreas & abdominal procedures",07,Diseases and Disorders of the Hepatobiliary System and Pancreas,1,Minor,Minor,Surgical,Medicare,Medicare,Blue Cross/Blue Shield,,N,N,84440.67,25599.26
Long Island,Nassau,2908000,000511,NYU Winthrop Hospital,50 to 69,113,M,White,Not Span/Hispanic,16,Emergency,Hospice - Medical Facility,2017,017,Cancer of pancreas,097,OTHER GI DX PRCS,264,"Other hepatobiliary, pancreas & abdominal procedures",07,Diseases and Disorders of the Hepatobiliary System and Pancreas,4,Extreme,Extreme,Surgical,Medicare,Medicare,Blue Cross/Blue Shield,,N,Y,168146.08,46245.95
Long Island,Nassau,2908000,000511,NYU Winthrop Hospital,50 to 69,115,F,White,Not Span/Hispanic,6,Emergency,Home or Self Care,2017,660,Alcohol-related disorders,097,OTHER GI DX PRCS,264,"Other hepatobiliary, pancreas & abdominal procedures",07,Diseases and Disorders of the Hepatobiliary System and Pancreas,3,Major,Major,Surgical,Private Health Insurance,,,,N,Y,89361.15,17864.38
Long Island,Nassau,2908000,000511,NYU Winthrop Hospital,70 or Older,115,F,Other Race,Spanish/Hispanic,10,Emergency,Home w/ Home Health Services,2017,151,Other liver diseases,097,OTHER GI DX PRCS,264,"Other hepatobiliary, pancreas & abdominal procedures",07,Diseases and Disorders of the Hepatobiliary System and Pancreas,3,Major,Major,Surgical,Blue Cross/Blue Shield,Medicare,Medicare,,N,Y,89322.52,22200.88
Long Island,Nassau,2908000,000511,NYU Winthrop Hospital,70 or Older,115,F,White,Not Span/Hispanic,6,Emergency,Home w/ Home Health Services,2017,149,Biliary tract disease,097,OTHER GI DX PRCS,264,"Other hepatobiliary, pancreas & abdominal procedures",07,Diseases and Disorders of the Hepatobiliary System and Pancreas,2,Moderate,Moderate,Surgical,Medicare,Medicare,Private Health Insurance,,N,Y,92687.68,18985.32
Long Island,Nassau,2908000,000511,NYU Winthrop Hospital,70 or Older,119,F,White,Not Span/Hispanic,4,Elective,Home or Self Care,2017,152,Pancreatic disorders (not diabetes),097,OTHER GI DX PRCS,264,"Other hepatobiliary, pancreas & abdominal procedures",07,Diseases and Disorders of the Hepatobiliary System and Pancreas,1,Minor,Moderate,Surgical,Medicare,Medicare,Blue Cross/Blue Shield,,N,N,112404.97,27378.70
Long Island,Nassau,2908000,000511,NYU Winthrop Hospital,50 to 69,115,M,White,Not Span/Hispanic,5,Emergency,Left Against Medical Advice,2017,660,Alcohol-related disorders,097,OTHER GI DX PRCS,264,"Other hepatobiliary, pancreas & abdominal procedures",07,Diseases and Disorders of the Hepatobiliary System and Pancreas,4,Extreme,Major,Surgical,Medicare,Medicare,Private Health Insurance,,N,Y,69871.10,12496.24
Long Island,Nassau,2908000,000511,NYU Winthrop Hospital,50 to 69,118,M,White,Not Span/Hispanic,18,Emergency,Short-term Hospital,2017,151,Other liver diseases,092,OTHER BOWEL DX PRCS,264,"Other hepatobiliary, pancreas & abdominal procedures",07,Diseases and Disorders of the Hepatobiliary System and Pancreas,3,Major,Major,Surgical,Medicare,Medicare,Private Health Insurance,,N,Y,235677.76,50227.65
Long Island,Nassau,2908000,000511,NYU Winthrop Hospital,70 or Older,110,M,White,Not Span/Hispanic,6,Emergency,Home or Self Care,2017,151,Other liver diseases,070,UP GASTRO ENDOSC/BIOPSY,264,"Other hepatobiliary, pancreas & abdominal procedures",07,Diseases and Disorders of the Hepatobiliary System and Pancreas,3,Major,Major,Surgical,Medicare,Medicare,Blue Cross/Blue Shield,,N,Y,132467.68,31084.55
Long Island,Nassau,2908000,000511,NYU Winthrop Hospital,30 to 49,115,M,White,Spanish/Hispanic,17,Emergency,Home w/ Home Health Services,2017,660,Alcohol-related disorders,070,UP GASTRO ENDOSC/BIOPSY,264,"Other hepatobiliary, pancreas & abdominal procedures",07,Diseases and Disorders of the Hepatobiliary System and Pancreas,3,Major,Major,Surgical,Federal/State/Local/VA,,,,N,Y,183207.35,35921.69
Long Island,Nassau,2908000,000511,NYU Winthrop Hospital,30 to 49,115,M,White,Spanish/Hispanic,10,Emergency,Home w/ Home Health Services,2017,660,Alcohol-related disorders,097,OTHER GI DX PRCS,264,"Other hepatobiliary, pancreas & abdominal procedures",07,Diseases and Disorders of the Hepatobiliary System and Pancreas,3,Major,Moderate,Surgical,Federal/State/Local/VA,,,,N,Y,134111.65,27205.34
Long Island,Nassau,2908000,000511,NYU Winthrop Hospital,50 to 69,110,M,Other Race,Not Span/Hispanic,6,Emergency,Home or Self Care,2017,155,Other gastrointestinal disorders,058,HEMODIALYSIS,264,"Other hepatobiliary, pancreas & abdominal procedures",07,Diseases and Disorders of the Hepatobiliary System and Pancreas,2,Moderate,Moderate,Surgical,Medicare,Medicare,Private Health Insurance,,N,Y,85003.07,19508.34
Long Island,Nassau,2908000,000511,NYU Winthrop Hospital,70 or Older,115,M,Black/African American,Not Span/Hispanic,6,Emergency,Expired,2017,152,Pancreatic disorders (not diabetes),097,OTHER GI DX PRCS,264,"Other hepatobiliary, pancreas & abdominal procedures",07,Diseases and Disorders of the Hepatobiliary System and Pancreas,4,Extreme,Extreme,Surgical,Medicare,Medicare,Blue Cross/Blue Shield,,N,Y,109227.28,19606.24
Long Island,Nassau,2908000,000511,NYU Winthrop Hospital,70 or Older,110,F,White,Not Span/Hispanic,6,Emergency,Home or Self Care,2017,149,Biliary tract disease,070,UP GASTRO ENDOSC/BIOPSY,264,"Other hepatobiliary, pancreas & abdominal procedures",07,Diseases and Disorders of the Hepatobiliary System and Pancreas,3,Major,Major,Surgical,Medicare,Medicare,,,N,Y,181707.30,38468.67
Long Island,Nassau,2908000,000511,NYU Winthrop Hospital,70 or Older,110,F,Other Race,Not Span/Hispanic,30,Emergency,Expired,2017,151,Other liver diseases,216,RESP INTUB/MECH VENTIL,264,"Other hepatobiliary, pancreas & abdominal procedures",07,Diseases and Disorders of the Hepatobiliary System and Pancreas,4,Extreme,Extreme,Surgical,Medicaid,Medicaid,,,N,Y,376864.77,85465.13
Long Island,Nassau,2908000,000511,NYU Winthrop Hospital,50 to 69,117,F,White,Not Span/Hispanic,2,Emergency,Hospice - Medical Facility,2017,017,Cancer of pancreas,097,OTHER GI DX PRCS,264,"Other hepatobiliary, pancreas & abdominal procedures",07,Diseases and Disorders of the Hepatobiliary System and Pancreas,3,Major,Moderate,Surgical,Medicaid,Medicaid,,,N,Y,44758.63,9365.15
Long Island,Nassau,2908000,000511,NYU Winthrop Hospital,30 to 49,115,M,White,Not Span/Hispanic,9,Emergency,Home w/ Home Health Services,2017,660,Alcohol-related disorders,222,BLOOD TRANSFUSION,264,"Other hepatobiliary, pancreas & abdominal procedures",07,Diseases and Disorders of the Hepatobiliary System and Pancreas,3,Major,Major,Surgical,Federal/State/Local/VA,,,,N,Y,101279.12,21052.10
Long Island,Nassau,2908000,000511,NYU Winthrop Hospital,70 or Older,117,F,White,Not Span/Hispanic,4,Urgent,Home or Self Care,2017,151,Other liver diseases,083,BIOPSY OF LIVER,264,"Other hepatobiliary, pancreas & abdominal procedures",07,Diseases and Disorders of the Hepatobiliary System and Pancreas,2,Moderate,Moderate,Surgical,Medicare,Medicare,Private Health Insurance,,N,N,45032.26,9224.23
Long Island,Nassau,2908000,000511,NYU Winthrop Hospital,70 or Older,115,F,White,Not Span/Hispanic,5,Emergency,Home w/ Home Health Services,2017,016,Cancer of liver and intrahepatic bile duct,097,OTHER GI DX PRCS,264,"Other hepatobiliary, pancreas & abdominal procedures",07,Diseases and Disorders of the Hepatobiliary System and Pancreas,3,Major,Moderate,Surgical,Medicare,Medicare,Blue Cross/Blue Shield,,N,Y,69481.67,14934.84
