Hospital Service Area,Hospital County,Operating Certificate Number,Permanent Facility Id,Facility Name,Age Group,Zip Code - 3 digits,Gender,Race,Ethnicity,Length of Stay,Type of Admission,Patient Disposition,Discharge Year,CCS Diagnosis Code,CCS Diagnosis Description,CCS Procedure Code,CCS Procedure Description,APR DRG Code,APR DRG Description,APR MDC Code,APR MDC Description,APR Severity of Illness Code,APR Severity of Illness Description,APR Risk of Mortality,APR Medical Surgical Description,Payment Typology 1,Payment Typology 2,Payment Typology 3,Birth Weight,Abortion Edit Indicator,Emergency Department Indicator,Total Charges,Total Costs
New York City,Manhattan,7002001,001438,Bellevue Hospital Center,70 or Older,112,M,White,Not Span/Hispanic,3,Emergency,Home or Self Care,2019,NEO070,SECONDARY MALIGNANCIES,GIS028,"LOWER GI THERAPEUTIC PROCEDURES, NEC (OPEN AND LAPAROSCOPIC)",264,"OTHER HEPATOBILIARY, PANCREAS & ABDOMINAL PROCEDURES",07,DISEASES AND DISORDERS OF THE HEPATOBILIARY SYSTEM AND PANCREAS,2,Moderate,Minor,Surgical,Medicaid,,,,,false,19483.22,12948.55
New York City,Manhattan,7002001,001438,Bellevue Hospital Center,50 to 69,114,F,Other Race,Not Span/Hispanic,19,Emergency,Home or Self Care,2019,DIG020,PANCREATIC DISORDERS (EXCLUDING DIABETES),GIS005,EXPLORATION OF PERITONEAL CAVITY,264,"OTHER HEPATOBILIARY, PANCREAS & ABDOMINAL PROCEDURES",07,DISEASES AND DISORDERS OF THE HEPATOBILIARY SYSTEM AND PANCREAS,3,Major,Moderate,Surgical,Blue Cross/Blue Shield,,,,,false,139363.6,92621.05
New York City,Manhattan,7002001,001438,Bellevue Hospital Center,70 or Older,112,F,Other Race,Spanish/Hispanic,1,Emergency,Home or Self Care,2019,NEO017,GASTROINTESTINAL CANCERS - LIVER,HEP004,HEPATOBILIARY RESECTION AND ABLATION,264,"OTHER HEPATOBILIARY, PANCREAS & ABDOMINAL PROCEDURES",07,DISEASES AND DISORDERS OF THE HEPATOBILIARY SYSTEM AND PANCREAS,2,Moderate,Moderate,Surgical,Medicare,Medicare,Medicaid,,,false,2772.42,1842.55
New York City,Manhattan,7002001,001438,Bellevue Hospital Center,50 to 69,112,M,Other Race,Not Span/Hispanic,4,Emergency,Home or Self Care,2019,NEO018,GASTROINTESTINAL CANCERS - BILE DUCT,GIS024,OTHER PERITONEAL CAVITY PROCEDURES,264,"OTHER HEPATOBILIARY, PANCREAS & ABDOMINAL PROCEDURES",07,DISEASES AND DISORDERS OF THE HEPATOBILIARY SYSTEM AND PANCREAS,3,Major,Major,Surgical,Medicaid,,,,,true,37254.6,24759.41
New York City,Manhattan,7002001,001438,Bellevue Hospital Center,50 to 69,100,F,Other Race,Spanish/Hispanic,4,Emergency,Home or Self Care,2019,DIG017,BILIARY TRACT DISEASE,HEP007,BILIARY AND PANCREATIC CALCULUS REMOVAL,264,"OTHER HEPATOBILIARY, PANCREAS & ABDOMINAL PROCEDURES",07,DISEASES AND DISORDERS OF THE HEPATOBILIARY SYSTEM AND PANCREAS,2,Moderate,Minor,Surgical,Medicaid,,,,,true,42092.97,27974.99
New York City,Manhattan,7002001,001438,Bellevue Hospital Center,50 to 69,114,M,Other Race,Not Span/Hispanic,1,Emergency,Home or Self Care,2019,SYM006,ABDOMINAL PAIN AND OTHER DIGESTIVE/ABDOMEN SIGNS AND SYMPTOMS,HEP004,HEPATOBILIARY RESECTION AND ABLATION,264,"OTHER HEPATOBILIARY, PANCREAS & ABDOMINAL PROCEDURES",07,DISEASES AND DISORDERS OF THE HEPATOBILIARY SYSTEM AND PANCREAS,2,Moderate,Moderate,Surgical,Medicaid,,,,,false,23801.54,15818.5
New York City,Manhattan,7002001,001438,Bellevue Hospital Center,50 to 69,112,F,Other Race,Unknown,1,Elective,Home or Self Care,2019,NEO017,GASTROINTESTINAL CANCERS - LIVER,HEP004,HEPATOBILIARY RESECTION AND ABLATION,264,"OTHER HEPATOBILIARY, PANCREAS & ABDOMINAL PROCEDURES",07,DISEASES AND DISORDERS OF THE HEPATOBILIARY SYSTEM AND PANCREAS,2,Moderate,Moderate,Surgical,Medicaid,,,,,false,10776.66,7162.17
New York City,Manhattan,7002001,001438,Bellevue Hospital Center,50 to 69,112,F,White,Unknown,6,Urgent,Short-term Hospital,2019,DIG017,BILIARY TRACT DISEASE,LYM001,LYMPH NODE BIOPSY,264,"OTHER HEPATOBILIARY, PANCREAS & ABDOMINAL PROCEDURES",07,DISEASES AND DISORDERS OF THE HEPATOBILIARY SYSTEM AND PANCREAS,2,Moderate,Minor,Surgical,Medicaid,,,,,false,68384.2,45448.14
New York City,Manhattan,7002001,001438,Bellevue Hospital Center,30 to 49,104,U,Black/African American,Unknown,1,Elective,Home or Self Care,2019,NEO017,GASTROINTESTINAL CANCERS - LIVER,HEP004,HEPATOBILIARY RESECTION AND ABLATION,264,"OTHER HEPATOBILIARY, PANCREAS & ABDOMINAL PROCEDURES",07,DISEASES AND DISORDERS OF THE HEPATOBILIARY SYSTEM AND PANCREAS,2,Moderate,Moderate,Surgical,Self-Pay,,,,,false,14576.76,9687.71
New York City,Manhattan,7002001,001438,Bellevue Hospital Center,18 to 29,112,M,White,Spanish/Hispanic,10,Emergency,Home or Self Care,2019,DIG023,NONINFECTIOUS HEPATITIS,HEP001,LIVER BIOPSY,264,"OTHER HEPATOBILIARY, PANCREAS & ABDOMINAL PROCEDURES",07,DISEASES AND DISORDERS OF THE HEPATOBILIARY SYSTEM AND PANCREAS,1,Minor,Minor,Surgical,Medicaid,,,,,true,76642.84,50936.83
New York City,Manhattan,7002001,001438,Bellevue Hospital Center,50 to 69,100,M,Other Race,Unknown,12,Emergency,Skilled Nursing Home,2019,NEO018,GASTROINTESTINAL CANCERS - BILE DUCT,GIS021,GI SYSTEM REPAIR (EXCLUDING ANORECTAL),264,"OTHER HEPATOBILIARY, PANCREAS & ABDOMINAL PROCEDURES",07,DISEASES AND DISORDERS OF THE HEPATOBILIARY SYSTEM AND PANCREAS,3,Major,Minor,Surgical,Medicaid,,,,,true,114864.53,76338.97
New York City,Manhattan,7002001,001438,Bellevue Hospital Center,30 to 49,100,M,Other Race,Spanish/Hispanic,15,Emergency,Home or Self Care,2019,DIG017,BILIARY TRACT DISEASE,HEP007,BILIARY AND PANCREATIC CALCULUS REMOVAL,264,"OTHER HEPATOBILIARY, PANCREAS & ABDOMINAL PROCEDURES",07,DISEASES AND DISORDERS OF THE HEPATOBILIARY SYSTEM AND PANCREAS,3,Major,Major,Surgical,Medicaid,,,,,true,144025.03,95719.03
