Hospital Service Area,Hospital County,Operating Certificate Number,Permanent Facility Id,Facility Name,Age Group,Zip Code - 3 digits,Gender,Race,Ethnicity,Length of Stay,Type of Admission,Patient Disposition,Discharge Year,CCS Diagnosis Code,CCS Diagnosis Description,CCS Procedure Code,CCS Procedure Description,APR DRG Code,APR DRG Description,APR MDC Code,APR MDC Description,APR Severity of Illness Code,APR Severity of Illness Description,APR Risk of Mortality,APR Medical Surgical Description,Payment Typology 1,Payment Typology 2,Payment Typology 3,Birth Weight,Abortion Edit Indicator,Emergency Department Indicator,Total Charges,Total Costs
New York City,Manhattan,7002001,001438,Bellevue Hospital Center,30 to 49,,M,Other Race,Unknown,7,Emergency,Home or Self Care,2020,INJ010,"INTERNAL ORGAN INJURY, INITIAL ENCOUNTER",GIS005,EXPLORATION OF PERITONEAL CAVITY,264,"OTHER HEPATOBILIARY, PANCREAS & ABDOMINAL PROCEDURES",07,DISEASES AND DISORDERS OF THE HEPATOBILIARY SYSTEM AND PANCREAS,4,Extreme,Extreme,Surgical,Medicaid,,,,,Y,89911.84,51706.86
New York City,Manhattan,7002001,001438,Bellevue Hospital Center,50 to 69,104,M,Other Race,Unknown,4,Urgent,Short-term Hospital,2020,DIG017,BILIARY TRACT DISEASE,HEP007,BILIARY AND PANCREATIC CALCULUS REMOVAL,264,"OTHER HEPATOBILIARY, PANCREAS & ABDOMINAL PROCEDURES",07,DISEASES AND DISORDERS OF THE HEPATOBILIARY SYSTEM AND PANCREAS,2,Moderate,Major,Surgical,Medicare,Medicaid,,,,N,55700.64,32032.55
New York City,Manhattan,7002001,001438,Bellevue Hospital Center,50 to 69,100,M,Other Race,Unknown,7,Emergency,Home w/ Home Health Services,2020,NEO070,SECONDARY MALIGNANCIES,HEP001,LIVER BIOPSY,264,"OTHER HEPATOBILIARY, PANCREAS & ABDOMINAL PROCEDURES",07,DISEASES AND DISORDERS OF THE HEPATOBILIARY SYSTEM AND PANCREAS,3,Major,Major,Surgical,Medicaid,,,,,Y,58812.94,33822.38
New York City,Manhattan,7002001,001438,Bellevue Hospital Center,70 or Older,114,M,Black/African American,Not Span/Hispanic,1,Elective,Home or Self Care,2020,NEO017,GASTROINTESTINAL CANCERS - LIVER,HEP004,HEPATOBILIARY RESECTION AND ABLATION,264,"OTHER HEPATOBILIARY, PANCREAS & ABDOMINAL PROCEDURES",07,DISEASES AND DISORDERS OF THE HEPATOBILIARY SYSTEM AND PANCREAS,1,Minor,Minor,Surgical,Medicare,Medicaid,,,,N,13602.05,7822.32
New York City,Manhattan,7002001,001438,Bellevue Hospital Center,50 to 69,114,F,Other Race,Spanish/Hispanic,4,Elective,Home or Self Care,2020,NEO019,GASTROINTESTINAL CANCERS - GALLBLADDER,GNR009,"RETROPERITONEAL PROCEDURES, NEC",264,"OTHER HEPATOBILIARY, PANCREAS & ABDOMINAL PROCEDURES",07,DISEASES AND DISORDERS OF THE HEPATOBILIARY SYSTEM AND PANCREAS,1,Minor,Moderate,Surgical,Medicaid,,,,,N,67410.3,38766.58
New York City,Manhattan,7002001,001438,Bellevue Hospital Center,50 to 69,112,M,Other Race,Spanish/Hispanic,1,Elective,Home or Self Care,2020,NEO017,GASTROINTESTINAL CANCERS - LIVER,HEP004,HEPATOBILIARY RESECTION AND ABLATION,264,"OTHER HEPATOBILIARY, PANCREAS & ABDOMINAL PROCEDURES",07,DISEASES AND DISORDERS OF THE HEPATOBILIARY SYSTEM AND PANCREAS,2,Moderate,Moderate,Surgical,Medicare,Medicaid,,,,N,13936.75,8014.8
New York City,Manhattan,7002001,001438,Bellevue Hospital Center,30 to 49,113,M,Other Race,Spanish/Hispanic,2,Emergency,Home or Self Care,2020,DIG017,BILIARY TRACT DISEASE,HEP006,CHOLECYSTECTOMY,264,"OTHER HEPATOBILIARY, PANCREAS & ABDOMINAL PROCEDURES",07,DISEASES AND DISORDERS OF THE HEPATOBILIARY SYSTEM AND PANCREAS,1,Minor,Minor,Surgical,Medicaid,,,,,Y,30239.24,17390.1
New York City,Manhattan,7002001,001438,Bellevue Hospital Center,50 to 69,113,F,Other Race,Not Span/Hispanic,8,Elective,Home or Self Care,2020,NEO070,SECONDARY MALIGNANCIES,HEP001,LIVER BIOPSY,264,"OTHER HEPATOBILIARY, PANCREAS & ABDOMINAL PROCEDURES",07,DISEASES AND DISORDERS OF THE HEPATOBILIARY SYSTEM AND PANCREAS,3,Major,Major,Surgical,Private Health Insurance,,,,,N,110367.5,63470.58
New York City,Manhattan,7002001,001438,Bellevue Hospital Center,50 to 69,112,F,Other Race,Spanish/Hispanic,1,Elective,Home or Self Care,2020,DIG023,NONINFECTIOUS HEPATITIS,HEP004,HEPATOBILIARY RESECTION AND ABLATION,264,"OTHER HEPATOBILIARY, PANCREAS & ABDOMINAL PROCEDURES",07,DISEASES AND DISORDERS OF THE HEPATOBILIARY SYSTEM AND PANCREAS,2,Moderate,Moderate,Surgical,Medicaid,,,,,N,12099.06,6957.98
New York City,Manhattan,7002001,001438,Bellevue Hospital Center,70 or Older,100,M,Other Race,Spanish/Hispanic,1,Elective,Home or Self Care,2020,NEO017,GASTROINTESTINAL CANCERS - LIVER,HEP004,HEPATOBILIARY RESECTION AND ABLATION,264,"OTHER HEPATOBILIARY, PANCREAS & ABDOMINAL PROCEDURES",07,DISEASES AND DISORDERS OF THE HEPATOBILIARY SYSTEM AND PANCREAS,2,Moderate,Moderate,Surgical,Medicare,,,,,N,13769.52,7918.63
New York City,Manhattan,7002001,001438,Bellevue Hospital Center,50 to 69,100,F,Other Race,Spanish/Hispanic,4,Elective,Home or Self Care,2020,NEO019,GASTROINTESTINAL CANCERS - GALLBLADDER,LYM001,LYMPH NODE BIOPSY,264,"OTHER HEPATOBILIARY, PANCREAS & ABDOMINAL PROCEDURES",07,DISEASES AND DISORDERS OF THE HEPATOBILIARY SYSTEM AND PANCREAS,2,Moderate,Moderate,Surgical,Medicaid,,,,,N,75209.05,43251.52
New York City,Manhattan,7002001,001438,Bellevue Hospital Center,30 to 49,100,F,Other Race,Not Span/Hispanic,17,Emergency,Home or Self Care,2020,SYM006,ABDOMINAL PAIN AND OTHER DIGESTIVE/ABDOMEN SIGNS AND SYMPTOMS,GIS003,GI SYSTEM BIOPSY (NON-ENDOSCOPIC),264,"OTHER HEPATOBILIARY, PANCREAS & ABDOMINAL PROCEDURES",07,DISEASES AND DISORDERS OF THE HEPATOBILIARY SYSTEM AND PANCREAS,4,Extreme,Major,Surgical,Medicaid,,,,,Y,151349.3,87038.56
New York City,Manhattan,7002001,001438,Bellevue Hospital Center,50 to 69,112,M,Other Race,Spanish/Hispanic,1,Elective,Home or Self Care,2020,NEO017,GASTROINTESTINAL CANCERS - LIVER,HEP004,HEPATOBILIARY RESECTION AND ABLATION,264,"OTHER HEPATOBILIARY, PANCREAS & ABDOMINAL PROCEDURES",07,DISEASES AND DISORDERS OF THE HEPATOBILIARY SYSTEM AND PANCREAS,1,Minor,Minor,Surgical,Medicaid,,,,,N,19355.14,11130.83
