Hospital Service Area,Hospital County,Operating Certificate Number,Permanent Facility Id,Facility Name,Age Group,Zip Code - 3 digits,Gender,Race,Ethnicity,Length of Stay,Type of Admission,Patient Disposition,Discharge Year,CCS Diagnosis Code,CCS Diagnosis Description,CCS Procedure Code,CCS Procedure Description,APR DRG Code,APR DRG Description,APR MDC Code,APR MDC Description,APR Severity of Illness Code,APR Severity of Illness Description,APR Risk of Mortality,APR Medical Surgical Description,Payment Typology 1,Payment Typology 2,Payment Typology 3,Birth Weight,Abortion Edit Indicator,Emergency Department Indicator,Total Charges,Total Costs
Long Island,Nassau,2908000,000511,NYU Langone Hospital-Long Island,50 to 69,115,F,Other Race,Spanish/Hispanic,9,Emergency,Home or Self Care,2020,NEO051,ENDOCRINE SYSTEM CANCERS - PANCREAS,GIS019,GASTRO-JEJUNAL BYPASS (INCLUDING BARIATRIC),264,"OTHER HEPATOBILIARY, PANCREAS & ABDOMINAL PROCEDURES",07,DISEASES AND DISORDERS OF THE HEPATOBILIARY SYSTEM AND PANCREAS,3,Major,Moderate,Surgical,Private Health Insurance,Medicaid,,,,Y,218357.79,48089.76
Long Island,Nassau,2908000,000511,NYU Langone Hospital-Long Island,70 or Older,118,M,White,Not Span/Hispanic,10,Emergency,Home or Self Care,2020,NEO051,ENDOCRINE SYSTEM CANCERS - PANCREAS,GIS005,EXPLORATION OF PERITONEAL CAVITY,264,"OTHER HEPATOBILIARY, PANCREAS & ABDOMINAL PROCEDURES",07,DISEASES AND DISORDERS OF THE HEPATOBILIARY SYSTEM AND PANCREAS,3,Major,Major,Surgical,Medicare,Medicare,,,,Y,232791.86,50577.46
Long Island,Nassau,2908000,000511,NYU Langone Hospital-Long Island,70 or Older,110,F,White,Not Span/Hispanic,1,Elective,Home or Self Care,2020,NEO070,SECONDARY MALIGNANCIES,HEP001,LIVER BIOPSY,264,"OTHER HEPATOBILIARY, PANCREAS & ABDOMINAL PROCEDURES",07,DISEASES AND DISORDERS OF THE HEPATOBILIARY SYSTEM AND PANCREAS,2,Moderate,Moderate,Surgical,Medicare,Blue Cross/Blue Shield,,,,N,48575.97,8618.64
Long Island,Nassau,2908000,000511,NYU Langone Hospital-Long Island,50 to 69,115,F,Black/African American,Not Span/Hispanic,1,Elective,Short-term Hospital,2020,NEO051,ENDOCRINE SYSTEM CANCERS - PANCREAS,HEP001,LIVER BIOPSY,264,"OTHER HEPATOBILIARY, PANCREAS & ABDOMINAL PROCEDURES",07,DISEASES AND DISORDERS OF THE HEPATOBILIARY SYSTEM AND PANCREAS,2,Moderate,Moderate,Surgical,Blue Cross/Blue Shield,,,,,N,99387.75,17142.45
Long Island,Nassau,2908000,000511,NYU Langone Hospital-Long Island,70 or Older,115,M,White,Not Span/Hispanic,6,Emergency,Home or Self Care,2020,CIR033,ACUTE PHLEBITIS; THROMBOPHLEBITIS AND THROMBOEMBOLISM,CAR008,ANGIOPLASTY AND RELATED VESSEL PROCEDURES (ENDOVASCULAR; EXCLUDING CAROTID),264,"OTHER HEPATOBILIARY, PANCREAS & ABDOMINAL PROCEDURES",07,DISEASES AND DISORDERS OF THE HEPATOBILIARY SYSTEM AND PANCREAS,3,Major,Major,Surgical,Medicare,Medicare,,,,Y,166261.25,38454.85
Long Island,Nassau,2908000,000511,NYU Langone Hospital-Long Island,70 or Older,115,F,Black/African American,Not Span/Hispanic,2,Emergency,Home w/ Home Health Services,2020,DIG019,OTHER SPECIFIED AND UNSPECIFIED LIVER DISEASE,HEP001,LIVER BIOPSY,264,"OTHER HEPATOBILIARY, PANCREAS & ABDOMINAL PROCEDURES",07,DISEASES AND DISORDERS OF THE HEPATOBILIARY SYSTEM AND PANCREAS,2,Moderate,Moderate,Surgical,Medicare,,,,,Y,95320.25,18698.24
Long Island,Nassau,2908000,000511,NYU Langone Hospital-Long Island,70 or Older,117,F,White,Not Span/Hispanic,4,Emergency,Home or Self Care,2020,NEO070,SECONDARY MALIGNANCIES,HEP009,PANCREATIC AND PROXIMAL BILIARY DILATION AND STENTING,264,"OTHER HEPATOBILIARY, PANCREAS & ABDOMINAL PROCEDURES",07,DISEASES AND DISORDERS OF THE HEPATOBILIARY SYSTEM AND PANCREAS,3,Major,Moderate,Surgical,Medicare,Blue Cross/Blue Shield,,,,Y,269019.26,47586.28
Long Island,Nassau,2908000,000511,NYU Langone Hospital-Long Island,70 or Older,119,M,White,Not Span/Hispanic,1,Elective,Home or Self Care,2020,NEO051,ENDOCRINE SYSTEM CANCERS - PANCREAS,HEP001,LIVER BIOPSY,264,"OTHER HEPATOBILIARY, PANCREAS & ABDOMINAL PROCEDURES",07,DISEASES AND DISORDERS OF THE HEPATOBILIARY SYSTEM AND PANCREAS,2,Moderate,Moderate,Surgical,Medicare,Medicare,,,,N,115498.51,18525.06
Long Island,Nassau,2908000,000511,NYU Langone Hospital-Long Island,70 or Older,115,M,White,Not Span/Hispanic,6,Emergency,Home w/ Home Health Services,2020,DIG006,GASTROINTESTINAL AND BILIARY PERFORATION,HEP001,LIVER BIOPSY,264,"OTHER HEPATOBILIARY, PANCREAS & ABDOMINAL PROCEDURES",07,DISEASES AND DISORDERS OF THE HEPATOBILIARY SYSTEM AND PANCREAS,3,Major,Major,Surgical,Medicare,Blue Cross/Blue Shield,,,,Y,172381.04,39441.82
Long Island,Nassau,2908000,000511,NYU Langone Hospital-Long Island,50 to 69,115,F,Black/African American,Not Span/Hispanic,2,Emergency,Another Type Not Listed,2020,NEO070,SECONDARY MALIGNANCIES,HEP001,LIVER BIOPSY,264,"OTHER HEPATOBILIARY, PANCREAS & ABDOMINAL PROCEDURES",07,DISEASES AND DISORDERS OF THE HEPATOBILIARY SYSTEM AND PANCREAS,2,Moderate,Moderate,Surgical,Medicare,Medicaid,,,,N,130841.71,23834.58
Long Island,Nassau,2908000,000511,NYU Langone Hospital-Long Island,70 or Older,110,F,White,Not Span/Hispanic,5,Emergency,Home w/ Home Health Services,2020,NEO021,GASTROINTESTINAL CANCERS - ALL OTHER TYPES,HEP001,LIVER BIOPSY,264,"OTHER HEPATOBILIARY, PANCREAS & ABDOMINAL PROCEDURES",07,DISEASES AND DISORDERS OF THE HEPATOBILIARY SYSTEM AND PANCREAS,2,Moderate,Minor,Surgical,Medicare,,,,,Y,200061.44,42172
Long Island,Nassau,2908000,000511,NYU Langone Hospital-Long Island,50 to 69,117,F,White,Unknown,4,Emergency,Home or Self Care,2020,NEO051,ENDOCRINE SYSTEM CANCERS - PANCREAS,HEP002,PANCREATICOBILIARY BIOPSY,264,"OTHER HEPATOBILIARY, PANCREAS & ABDOMINAL PROCEDURES",07,DISEASES AND DISORDERS OF THE HEPATOBILIARY SYSTEM AND PANCREAS,3,Major,Major,Surgical,Medicare,Medicare,,,,Y,104214.12,26288.54
Long Island,Nassau,2908000,000511,NYU Langone Hospital-Long Island,70 or Older,112,F,Black/African American,Not Span/Hispanic,1,Elective,Home or Self Care,2020,NEO070,SECONDARY MALIGNANCIES,HEP004,HEPATOBILIARY RESECTION AND ABLATION,264,"OTHER HEPATOBILIARY, PANCREAS & ABDOMINAL PROCEDURES",07,DISEASES AND DISORDERS OF THE HEPATOBILIARY SYSTEM AND PANCREAS,1,Minor,Minor,Surgical,Medicare,Blue Cross/Blue Shield,,,,N,53754.21,10690.84
Long Island,Nassau,2908000,000511,NYU Langone Hospital-Long Island,50 to 69,117,F,White,Not Span/Hispanic,15,Emergency,Home or Self Care,2020,NEO051,ENDOCRINE SYSTEM CANCERS - PANCREAS,HEP001,LIVER BIOPSY,264,"OTHER HEPATOBILIARY, PANCREAS & ABDOMINAL PROCEDURES",07,DISEASES AND DISORDERS OF THE HEPATOBILIARY SYSTEM AND PANCREAS,4,Extreme,Extreme,Surgical,Medicare,Blue Cross/Blue Shield,,,,Y,339874.79,91548.95
Long Island,Nassau,2908000,000511,NYU Langone Hospital-Long Island,18 to 29,115,F,Other Race,Not Span/Hispanic,2,Emergency,Home or Self Care,2020,DIG017,BILIARY TRACT DISEASE,HEP001,LIVER BIOPSY,264,"OTHER HEPATOBILIARY, PANCREAS & ABDOMINAL PROCEDURES",07,DISEASES AND DISORDERS OF THE HEPATOBILIARY SYSTEM AND PANCREAS,2,Moderate,Minor,Surgical,Medicaid,,,,,Y,85376.73,13428.57
