Hospital Service Area,Hospital County,Operating Certificate Number,Permanent Facility Id,Facility Name,Age Group,Zip Code - 3 digits,Gender,Race,Ethnicity,Length of Stay,Type of Admission,Patient Disposition,Discharge Year,CCS Diagnosis Code,CCS Diagnosis Description,CCS Procedure Code,CCS Procedure Description,APR DRG Code,APR DRG Description,APR MDC Code,APR MDC Description,APR Severity of Illness Code,APR Severity of Illness Description,APR Risk of Mortality,APR Medical Surgical Description,Payment Typology 1,Payment Typology 2,Payment Typology 3,Birth Weight,Abortion Edit Indicator,Emergency Department Indicator,Total Charges,Total Costs
New York City,Manhattan,7002053,001463,NYU Langone Hospitals,50 to 69,112,F,Other Race,Not Span/Hispanic,5,Emergency,Home w/ Home Health Services,2019,DIG018,HEPATIC FAILURE,ESA004,NON-INVASIVE VENTILATION,279,HEPATIC COMA & OTHER MAJOR ACUTE LIVER DISORDERS,07,DISEASES AND DISORDERS OF THE HEPATOBILIARY SYSTEM AND PANCREAS,3,Major,Major,Medical,Medicare,Medicaid,,,,true,95998.03,21284.52
New York City,Manhattan,7002053,001463,NYU Langone Hospitals,50 to 69,112,F,Black/African American,Not Span/Hispanic,5,Emergency,Home or Self Care,2019,INJ036,"COMPLICATION OF TRANSPLANTED ORGANS OR TISSUE, INITIAL ENCOUNTER",ADM001,TRANSFUSION OF BLOOD AND BLOOD PRODUCTS,279,HEPATIC COMA & OTHER MAJOR ACUTE LIVER DISORDERS,07,DISEASES AND DISORDERS OF THE HEPATOBILIARY SYSTEM AND PANCREAS,3,Major,Extreme,Medical,Medicaid,,,,,true,79020.91,20563.19
New York City,Manhattan,7002053,001463,NYU Langone Hospitals,50 to 69,104,M,White,Not Span/Hispanic,3,Emergency,Skilled Nursing Home,2019,DIG018,HEPATIC FAILURE,,,279,HEPATIC COMA & OTHER MAJOR ACUTE LIVER DISORDERS,07,DISEASES AND DISORDERS OF THE HEPATOBILIARY SYSTEM AND PANCREAS,3,Major,Moderate,Medical,Medicare,Blue Cross/Blue Shield,,,,true,44506.4,12619.05
New York City,Manhattan,7002053,001463,NYU Langone Hospitals,70 or Older,112,M,Black/African American,Not Span/Hispanic,3,Emergency,Home or Self Care,2019,INJ036,"COMPLICATION OF TRANSPLANTED ORGANS OR TISSUE, INITIAL ENCOUNTER",HEP001,LIVER BIOPSY,279,HEPATIC COMA & OTHER MAJOR ACUTE LIVER DISORDERS,07,DISEASES AND DISORDERS OF THE HEPATOBILIARY SYSTEM AND PANCREAS,2,Moderate,Major,Medical,Medicare,Medicare,,,,true,68804.25,15835.54
New York City,Manhattan,7002053,001463,NYU Langone Hospitals,70 or Older,100,M,White,Not Span/Hispanic,3,Emergency,Home or Self Care,2019,DIG016,PERITONITIS AND INTRA-ABDOMINAL ABSCESS,HEP010,HEPATOBILIARY AND PANCREATIC DRAINAGE,279,HEPATIC COMA & OTHER MAJOR ACUTE LIVER DISORDERS,07,DISEASES AND DISORDERS OF THE HEPATOBILIARY SYSTEM AND PANCREAS,3,Major,Minor,Medical,Medicare,Medicare,,,,true,59403.6,15173.87
New York City,Manhattan,7002053,001463,NYU Langone Hospitals,50 to 69,113,M,Other Race,Not Span/Hispanic,1,Emergency,Home w/ Home Health Services,2019,INJ036,"COMPLICATION OF TRANSPLANTED ORGANS OR TISSUE, INITIAL ENCOUNTER",HEP010,HEPATOBILIARY AND PANCREATIC DRAINAGE,279,HEPATIC COMA & OTHER MAJOR ACUTE LIVER DISORDERS,07,DISEASES AND DISORDERS OF THE HEPATOBILIARY SYSTEM AND PANCREAS,3,Major,Moderate,Medical,Medicare,Medicaid,,,,true,108499.94,27897
New York City,Manhattan,7002053,001463,NYU Langone Hospitals,30 to 49,103,F,Other Race,Spanish/Hispanic,4,Emergency,Home or Self Care,2019,INJ036,"COMPLICATION OF TRANSPLANTED ORGANS OR TISSUE, INITIAL ENCOUNTER",HEP001,LIVER BIOPSY,279,HEPATIC COMA & OTHER MAJOR ACUTE LIVER DISORDERS,07,DISEASES AND DISORDERS OF THE HEPATOBILIARY SYSTEM AND PANCREAS,2,Moderate,Minor,Medical,Blue Cross/Blue Shield,,,,,true,80025.16,19735.34
New York City,Manhattan,7002053,001463,NYU Langone Hospitals,70 or Older,100,F,White,Not Span/Hispanic,9,Emergency,Home w/ Home Health Services,2019,DIG016,PERITONITIS AND INTRA-ABDOMINAL ABSCESS,HEP010,HEPATOBILIARY AND PANCREATIC DRAINAGE,279,HEPATIC COMA & OTHER MAJOR ACUTE LIVER DISORDERS,07,DISEASES AND DISORDERS OF THE HEPATOBILIARY SYSTEM AND PANCREAS,3,Major,Moderate,Medical,Medicare,Blue Cross/Blue Shield,,,,true,123414.69,37783.6
New York City,Manhattan,7002053,001463,NYU Langone Hospitals,50 to 69,104,M,Other Race,Not Span/Hispanic,4,Emergency,Home or Self Care,2019,INJ036,"COMPLICATION OF TRANSPLANTED ORGANS OR TISSUE, INITIAL ENCOUNTER",GIS027,"UPPER GI THERAPEUTIC PROCEDURES, NEC (ENDOSCOPIC)",279,HEPATIC COMA & OTHER MAJOR ACUTE LIVER DISORDERS,07,DISEASES AND DISORDERS OF THE HEPATOBILIARY SYSTEM AND PANCREAS,3,Major,Major,Medical,Federal/State/Local/VA,,,,,true,90399.63,21167.19
New York City,Manhattan,7002053,001463,NYU Langone Hospitals,50 to 69,100,M,White,Not Span/Hispanic,15,Emergency,Skilled Nursing Home,2019,DIG018,HEPATIC FAILURE,GIS006,PARACENTESIS,279,HEPATIC COMA & OTHER MAJOR ACUTE LIVER DISORDERS,07,DISEASES AND DISORDERS OF THE HEPATOBILIARY SYSTEM AND PANCREAS,4,Extreme,Extreme,Medical,Private Health Insurance,,,,,true,160895.16,55017.98
New York City,Manhattan,7002053,001463,NYU Langone Hospitals,70 or Older,100,F,White,Not Span/Hispanic,18,Emergency,Skilled Nursing Home,2019,DIG016,PERITONITIS AND INTRA-ABDOMINAL ABSCESS,ADM001,TRANSFUSION OF BLOOD AND BLOOD PRODUCTS,279,HEPATIC COMA & OTHER MAJOR ACUTE LIVER DISORDERS,07,DISEASES AND DISORDERS OF THE HEPATOBILIARY SYSTEM AND PANCREAS,4,Extreme,Extreme,Medical,Medicare,Blue Cross/Blue Shield,,,,true,204822.06,73571.76
New York City,Manhattan,7002053,001463,NYU Langone Hospitals,50 to 69,112,M,Other Race,Not Span/Hispanic,30,Emergency,Skilled Nursing Home,2019,INJ036,"COMPLICATION OF TRANSPLANTED ORGANS OR TISSUE, INITIAL ENCOUNTER",ADM001,TRANSFUSION OF BLOOD AND BLOOD PRODUCTS,279,HEPATIC COMA & OTHER MAJOR ACUTE LIVER DISORDERS,07,DISEASES AND DISORDERS OF THE HEPATOBILIARY SYSTEM AND PANCREAS,4,Extreme,Extreme,Medical,Medicare,Medicaid,,,,true,385464.71,110543.49
New York City,Manhattan,7002053,001463,NYU Langone Hospitals,50 to 69,112,M,White,Not Span/Hispanic,1,Emergency,Home w/ Home Health Services,2019,DIG016,PERITONITIS AND INTRA-ABDOMINAL ABSCESS,HEP010,HEPATOBILIARY AND PANCREATIC DRAINAGE,279,HEPATIC COMA & OTHER MAJOR ACUTE LIVER DISORDERS,07,DISEASES AND DISORDERS OF THE HEPATOBILIARY SYSTEM AND PANCREAS,3,Major,Minor,Medical,Medicare,Medicare,,,,true,55739.73,9441.37
New York City,Manhattan,7002053,001463,NYU Langone Hospitals,50 to 69,117,M,White,Spanish/Hispanic,4,Emergency,Home w/ Home Health Services,2019,INJ036,"COMPLICATION OF TRANSPLANTED ORGANS OR TISSUE, INITIAL ENCOUNTER",HEP001,LIVER BIOPSY,279,HEPATIC COMA & OTHER MAJOR ACUTE LIVER DISORDERS,07,DISEASES AND DISORDERS OF THE HEPATOBILIARY SYSTEM AND PANCREAS,2,Moderate,Minor,Medical,Medicare,Blue Cross/Blue Shield,,,,false,91357.62,26690.84
New York City,Manhattan,7002053,001463,NYU Langone Hospitals,50 to 69,OOS,M,Other Race,Not Span/Hispanic,10,Emergency,Home w/ Home Health Services,2019,DIG018,HEPATIC FAILURE,,,279,HEPATIC COMA & OTHER MAJOR ACUTE LIVER DISORDERS,07,DISEASES AND DISORDERS OF THE HEPATOBILIARY SYSTEM AND PANCREAS,4,Extreme,Major,Medical,Blue Cross/Blue Shield,Medicare,,,,true,112104.35,35029.5
New York City,Manhattan,7002053,001463,NYU Langone Hospitals,50 to 69,113,F,White,Not Span/Hispanic,19,Emergency,Home w/ Home Health Services,2019,INJ036,"COMPLICATION OF TRANSPLANTED ORGANS OR TISSUE, INITIAL ENCOUNTER",LYM007,BONE MARROW BIOPSY,279,HEPATIC COMA & OTHER MAJOR ACUTE LIVER DISORDERS,07,DISEASES AND DISORDERS OF THE HEPATOBILIARY SYSTEM AND PANCREAS,4,Extreme,Major,Medical,Blue Cross/Blue Shield,Medicare,,,,true,322952.81,88244.77
New York City,Manhattan,7002053,001463,NYU Langone Hospitals,50 to 69,112,M,White,Not Span/Hispanic,2,Urgent,Home or Self Care,2019,DIG016,PERITONITIS AND INTRA-ABDOMINAL ABSCESS,,,279,HEPATIC COMA & OTHER MAJOR ACUTE LIVER DISORDERS,07,DISEASES AND DISORDERS OF THE HEPATOBILIARY SYSTEM AND PANCREAS,4,Extreme,Moderate,Medical,Private Health Insurance,,,,,false,22241.39,7815.96
New York City,Manhattan,7002053,001463,NYU Langone Hospitals,50 to 69,117,F,White,Spanish/Hispanic,9,Emergency,Home w/ Home Health Services,2019,DIG018,HEPATIC FAILURE,,,279,HEPATIC COMA & OTHER MAJOR ACUTE LIVER DISORDERS,07,DISEASES AND DISORDERS OF THE HEPATOBILIARY SYSTEM AND PANCREAS,4,Extreme,Major,Medical,Medicaid,,,,,true,132117.38,42871.89
New York City,Manhattan,7002053,001463,NYU Langone Hospitals,30 to 49,103,F,Other Race,Not Span/Hispanic,3,Emergency,Home or Self Care,2019,INJ036,"COMPLICATION OF TRANSPLANTED ORGANS OR TISSUE, INITIAL ENCOUNTER",,,279,HEPATIC COMA & OTHER MAJOR ACUTE LIVER DISORDERS,07,DISEASES AND DISORDERS OF THE HEPATOBILIARY SYSTEM AND PANCREAS,2,Moderate,Minor,Medical,Private Health Insurance,,,,,false,33593.94,11624.4
New York City,Manhattan,7002053,001463,NYU Langone Hospitals,50 to 69,113,M,Other Race,Not Span/Hispanic,4,Emergency,Home or Self Care,2019,INJ036,"COMPLICATION OF TRANSPLANTED ORGANS OR TISSUE, INITIAL ENCOUNTER",HEP010,HEPATOBILIARY AND PANCREATIC DRAINAGE,279,HEPATIC COMA & OTHER MAJOR ACUTE LIVER DISORDERS,07,DISEASES AND DISORDERS OF THE HEPATOBILIARY SYSTEM AND PANCREAS,3,Major,Moderate,Medical,Medicare,Medicaid,,,,true,116974.49,23129.52
New York City,Manhattan,7002053,001463,NYU Langone Hospitals,50 to 69,OOS,F,White,Not Span/Hispanic,39,Elective,Skilled Nursing Home,2019,CIR033,ACUTE PHLEBITIS; THROMBOPHLEBITIS AND THROMBOEMBOLISM,LYM007,BONE MARROW BIOPSY,279,HEPATIC COMA & OTHER MAJOR ACUTE LIVER DISORDERS,07,DISEASES AND DISORDERS OF THE HEPATOBILIARY SYSTEM AND PANCREAS,4,Extreme,Extreme,Medical,Medicare,Private Health Insurance,,,,false,601630.28,160038.21
New York City,Manhattan,7002053,001463,NYU Langone Hospitals,50 to 69,OOS,M,White,Not Span/Hispanic,14,Emergency,Home w/ Home Health Services,2019,DIG018,HEPATIC FAILURE,GIS006,PARACENTESIS,279,HEPATIC COMA & OTHER MAJOR ACUTE LIVER DISORDERS,07,DISEASES AND DISORDERS OF THE HEPATOBILIARY SYSTEM AND PANCREAS,4,Extreme,Major,Medical,Medicare,,,,,false,243493.76,77362.61
New York City,Manhattan,7002053,001463,NYU Langone Hospitals,70 or Older,112,M,White,Not Span/Hispanic,10,Emergency,Skilled Nursing Home,2019,DIG016,PERITONITIS AND INTRA-ABDOMINAL ABSCESS,GIS006,PARACENTESIS,279,HEPATIC COMA & OTHER MAJOR ACUTE LIVER DISORDERS,07,DISEASES AND DISORDERS OF THE HEPATOBILIARY SYSTEM AND PANCREAS,3,Major,Moderate,Medical,Medicare,Blue Cross/Blue Shield,,,,true,122131.33,41405.8
New York City,Manhattan,7002053,001463,NYU Langone Hospitals,50 to 69,112,M,Other Race,Not Span/Hispanic,6,Emergency,Home or Self Care,2019,INJ036,"COMPLICATION OF TRANSPLANTED ORGANS OR TISSUE, INITIAL ENCOUNTER",HEP008,COMMON BILE DUCT SPHINCTEROTOMY AND STENTING,279,HEPATIC COMA & OTHER MAJOR ACUTE LIVER DISORDERS,07,DISEASES AND DISORDERS OF THE HEPATOBILIARY SYSTEM AND PANCREAS,3,Major,Major,Medical,Medicare,Blue Cross/Blue Shield,,,,false,161482.71,39947.23
New York City,Manhattan,7002053,001463,NYU Langone Hospitals,50 to 69,100,M,White,Not Span/Hispanic,6,Emergency,Home w/ Home Health Services,2019,INJ036,"COMPLICATION OF TRANSPLANTED ORGANS OR TISSUE, INITIAL ENCOUNTER",HEP010,HEPATOBILIARY AND PANCREATIC DRAINAGE,279,HEPATIC COMA & OTHER MAJOR ACUTE LIVER DISORDERS,07,DISEASES AND DISORDERS OF THE HEPATOBILIARY SYSTEM AND PANCREAS,4,Extreme,Major,Medical,Medicare,Medicare,,,,true,166844.09,37488.46
New York City,Manhattan,7002053,001463,NYU Langone Hospitals,50 to 69,103,M,White,Not Span/Hispanic,5,Emergency,Home w/ Home Health Services,2019,DIG018,HEPATIC FAILURE,ESA003,MECHANICAL VENTILATION,279,HEPATIC COMA & OTHER MAJOR ACUTE LIVER DISORDERS,07,DISEASES AND DISORDERS OF THE HEPATOBILIARY SYSTEM AND PANCREAS,2,Moderate,Moderate,Medical,Medicaid,,,,,false,108429.4,41103.48
New York City,Manhattan,7002053,001463,NYU Langone Hospitals,50 to 69,112,F,Other Race,Spanish/Hispanic,2,Emergency,Home w/ Home Health Services,2019,DIG018,HEPATIC FAILURE,,,279,HEPATIC COMA & OTHER MAJOR ACUTE LIVER DISORDERS,07,DISEASES AND DISORDERS OF THE HEPATOBILIARY SYSTEM AND PANCREAS,3,Major,Major,Medical,Private Health Insurance,Medicaid,,,,true,44424.28,10974.87
New York City,Manhattan,7002053,001463,NYU Langone Hospitals,30 to 49,,F,Other Race,Not Span/Hispanic,4,Emergency,Home or Self Care,2019,INJ036,"COMPLICATION OF TRANSPLANTED ORGANS OR TISSUE, INITIAL ENCOUNTER",,,279,HEPATIC COMA & OTHER MAJOR ACUTE LIVER DISORDERS,07,DISEASES AND DISORDERS OF THE HEPATOBILIARY SYSTEM AND PANCREAS,2,Moderate,Minor,Medical,Medicaid,,,,,true,61795.69,16735.28
New York City,Manhattan,7002053,001463,NYU Langone Hospitals,50 to 69,112,F,White,Not Span/Hispanic,9,Emergency,Home or Self Care,2019,INJ036,"COMPLICATION OF TRANSPLANTED ORGANS OR TISSUE, INITIAL ENCOUNTER",ESA001,HEMODIALYSIS,279,HEPATIC COMA & OTHER MAJOR ACUTE LIVER DISORDERS,07,DISEASES AND DISORDERS OF THE HEPATOBILIARY SYSTEM AND PANCREAS,4,Extreme,Major,Medical,Blue Cross/Blue Shield,,,,,false,183891.07,46502.43
New York City,Manhattan,7002053,001463,NYU Langone Hospitals,50 to 69,112,M,White,Not Span/Hispanic,1,Emergency,Home or Self Care,2019,DIG018,HEPATIC FAILURE,,,279,HEPATIC COMA & OTHER MAJOR ACUTE LIVER DISORDERS,07,DISEASES AND DISORDERS OF THE HEPATOBILIARY SYSTEM AND PANCREAS,2,Moderate,Minor,Medical,Medicare,Medicaid,,,,true,22896.88,5807.67
New York City,Manhattan,7002053,001463,NYU Langone Hospitals,70 or Older,111,M,White,Not Span/Hispanic,3,Emergency,Skilled Nursing Home,2019,DIG018,HEPATIC FAILURE,,,279,HEPATIC COMA & OTHER MAJOR ACUTE LIVER DISORDERS,07,DISEASES AND DISORDERS OF THE HEPATOBILIARY SYSTEM AND PANCREAS,3,Major,Major,Medical,Medicare,Medicare,,,,true,44506.06,13026.66
New York City,Manhattan,7002053,001463,NYU Langone Hospitals,70 or Older,100,M,White,Not Span/Hispanic,3,Emergency,Home w/ Home Health Services,2019,DIG018,HEPATIC FAILURE,,,279,HEPATIC COMA & OTHER MAJOR ACUTE LIVER DISORDERS,07,DISEASES AND DISORDERS OF THE HEPATOBILIARY SYSTEM AND PANCREAS,3,Major,Major,Medical,Medicare,Medicare,,,,true,43719.84,12885.7
New York City,Manhattan,7002053,001463,NYU Langone Hospitals,50 to 69,OOS,M,Other Race,Not Span/Hispanic,13,Emergency,Home w/ Home Health Services,2019,DIG018,HEPATIC FAILURE,GIS006,PARACENTESIS,279,HEPATIC COMA & OTHER MAJOR ACUTE LIVER DISORDERS,07,DISEASES AND DISORDERS OF THE HEPATOBILIARY SYSTEM AND PANCREAS,3,Major,Major,Medical,Blue Cross/Blue Shield,Medicare,,,,true,165393.98,52721.72
New York City,Manhattan,7002053,001463,NYU Langone Hospitals,70 or Older,100,M,Other Race,Spanish/Hispanic,3,Emergency,Home w/ Home Health Services,2019,DIG018,HEPATIC FAILURE,GIS006,PARACENTESIS,279,HEPATIC COMA & OTHER MAJOR ACUTE LIVER DISORDERS,07,DISEASES AND DISORDERS OF THE HEPATOBILIARY SYSTEM AND PANCREAS,3,Major,Major,Medical,Medicare,Medicaid,,,,true,40984.58,15547.1
New York City,Manhattan,7002053,001463,NYU Langone Hospitals,50 to 69,OOS,F,Black/African American,Not Span/Hispanic,11,Emergency,Home w/ Home Health Services,2019,DIG018,HEPATIC FAILURE,GIS006,PARACENTESIS,279,HEPATIC COMA & OTHER MAJOR ACUTE LIVER DISORDERS,07,DISEASES AND DISORDERS OF THE HEPATOBILIARY SYSTEM AND PANCREAS,4,Extreme,Major,Medical,Medicare,,,,,true,200842.09,60783.82
New York City,Manhattan,7002053,001463,NYU Langone Hospitals,70 or Older,100,M,Other Race,Not Span/Hispanic,4,Emergency,Expired,2019,DIG018,HEPATIC FAILURE,ADM001,TRANSFUSION OF BLOOD AND BLOOD PRODUCTS,279,HEPATIC COMA & OTHER MAJOR ACUTE LIVER DISORDERS,07,DISEASES AND DISORDERS OF THE HEPATOBILIARY SYSTEM AND PANCREAS,4,Extreme,Extreme,Medical,Medicare,,,,,true,340720.97,42694.66
New York City,Manhattan,7002053,001463,NYU Langone Hospitals,70 or Older,116,M,Multi-racial,Spanish/Hispanic,3,Emergency,Home w/ Home Health Services,2019,DIG018,HEPATIC FAILURE,GIS006,PARACENTESIS,279,HEPATIC COMA & OTHER MAJOR ACUTE LIVER DISORDERS,07,DISEASES AND DISORDERS OF THE HEPATOBILIARY SYSTEM AND PANCREAS,4,Extreme,Major,Medical,Blue Cross/Blue Shield,,,,,true,44938.42,12972.39
New York City,Manhattan,7002053,001463,NYU Langone Hospitals,70 or Older,100,M,White,Not Span/Hispanic,3,Emergency,Hospice - Home,2019,DIG018,HEPATIC FAILURE,,,279,HEPATIC COMA & OTHER MAJOR ACUTE LIVER DISORDERS,07,DISEASES AND DISORDERS OF THE HEPATOBILIARY SYSTEM AND PANCREAS,4,Extreme,Major,Medical,Medicare,,,,,true,45550.9,15627.3
New York City,Manhattan,7002053,001463,NYU Langone Hospitals,50 to 69,107,M,Black/African American,Not Span/Hispanic,10,Emergency,Home w/ Home Health Services,2019,INJ036,"COMPLICATION OF TRANSPLANTED ORGANS OR TISSUE, INITIAL ENCOUNTER",HEP010,HEPATOBILIARY AND PANCREATIC DRAINAGE,279,HEPATIC COMA & OTHER MAJOR ACUTE LIVER DISORDERS,07,DISEASES AND DISORDERS OF THE HEPATOBILIARY SYSTEM AND PANCREAS,4,Extreme,Major,Medical,Medicare,Blue Cross/Blue Shield,,,,false,222693.86,59475.08
New York City,Manhattan,7002053,001463,NYU Langone Hospitals,50 to 69,OOS,F,Black/African American,Not Span/Hispanic,2,Emergency,Home w/ Home Health Services,2019,INJ036,"COMPLICATION OF TRANSPLANTED ORGANS OR TISSUE, INITIAL ENCOUNTER",HEP001,LIVER BIOPSY,279,HEPATIC COMA & OTHER MAJOR ACUTE LIVER DISORDERS,07,DISEASES AND DISORDERS OF THE HEPATOBILIARY SYSTEM AND PANCREAS,4,Extreme,Major,Medical,Medicaid,,,,,false,73667,23550.12
New York City,Manhattan,7002053,001463,NYU Langone Hospitals,50 to 69,100,F,White,Not Span/Hispanic,1,Emergency,Home or Self Care,2019,DIG018,HEPATIC FAILURE,ADM001,TRANSFUSION OF BLOOD AND BLOOD PRODUCTS,279,HEPATIC COMA & OTHER MAJOR ACUTE LIVER DISORDERS,07,DISEASES AND DISORDERS OF THE HEPATOBILIARY SYSTEM AND PANCREAS,3,Major,Major,Medical,Private Health Insurance,,,,,true,51510.63,8880.34
New York City,Manhattan,7002053,001463,NYU Langone Hospitals,70 or Older,117,F,White,Not Span/Hispanic,8,Emergency,Home or Self Care,2019,INJ036,"COMPLICATION OF TRANSPLANTED ORGANS OR TISSUE, INITIAL ENCOUNTER",HEP008,COMMON BILE DUCT SPHINCTEROTOMY AND STENTING,279,HEPATIC COMA & OTHER MAJOR ACUTE LIVER DISORDERS,07,DISEASES AND DISORDERS OF THE HEPATOBILIARY SYSTEM AND PANCREAS,4,Extreme,Major,Medical,Medicare,Medicare,,,,false,239988.79,62540.47
New York City,Manhattan,7002053,001463,NYU Langone Hospitals,30 to 49,114,M,White,Not Span/Hispanic,7,Emergency,Psychiatric Hospital or Unit of Hosp,2019,CIR033,ACUTE PHLEBITIS; THROMBOPHLEBITIS AND THROMBOEMBOLISM,,,279,HEPATIC COMA & OTHER MAJOR ACUTE LIVER DISORDERS,07,DISEASES AND DISORDERS OF THE HEPATOBILIARY SYSTEM AND PANCREAS,3,Major,Moderate,Medical,Medicaid,,,,,true,69800.37,24202.38
New York City,Manhattan,7002053,001463,NYU Langone Hospitals,50 to 69,OOS,F,Black/African American,Not Span/Hispanic,5,Emergency,Home w/ Home Health Services,2019,DIG018,HEPATIC FAILURE,ADM021,"ADMINISTRATION OF THERAPEUTIC SUBSTANCES, NEC",279,HEPATIC COMA & OTHER MAJOR ACUTE LIVER DISORDERS,07,DISEASES AND DISORDERS OF THE HEPATOBILIARY SYSTEM AND PANCREAS,4,Extreme,Major,Medical,Medicare,,,,,true,121522.99,40026.09
New York City,Manhattan,7002053,001463,NYU Langone Hospitals,50 to 69,117,F,Other Race,Spanish/Hispanic,2,Emergency,Home or Self Care,2019,INJ036,"COMPLICATION OF TRANSPLANTED ORGANS OR TISSUE, INITIAL ENCOUNTER",,,279,HEPATIC COMA & OTHER MAJOR ACUTE LIVER DISORDERS,07,DISEASES AND DISORDERS OF THE HEPATOBILIARY SYSTEM AND PANCREAS,2,Moderate,Minor,Medical,Blue Cross/Blue Shield,,,,,false,36699.9,9270.18
New York City,Manhattan,7002053,001463,NYU Langone Hospitals,30 to 49,112,M,White,Not Span/Hispanic,5,Emergency,Short-term Hospital,2019,DIG018,HEPATIC FAILURE,,,279,HEPATIC COMA & OTHER MAJOR ACUTE LIVER DISORDERS,07,DISEASES AND DISORDERS OF THE HEPATOBILIARY SYSTEM AND PANCREAS,3,Major,Major,Medical,Private Health Insurance,,,,,false,94479.16,25249.65
New York City,Manhattan,7002053,001463,NYU Langone Hospitals,50 to 69,109,M,White,Not Span/Hispanic,2,Emergency,Home or Self Care,2019,CIR033,ACUTE PHLEBITIS; THROMBOPHLEBITIS AND THROMBOEMBOLISM,ADM001,TRANSFUSION OF BLOOD AND BLOOD PRODUCTS,279,HEPATIC COMA & OTHER MAJOR ACUTE LIVER DISORDERS,07,DISEASES AND DISORDERS OF THE HEPATOBILIARY SYSTEM AND PANCREAS,2,Moderate,Minor,Medical,Private Health Insurance,,,,,true,155723.81,12017.97
New York City,Manhattan,7002053,001463,NYU Langone Hospitals,50 to 69,100,M,Other Race,Unknown,4,Emergency,Home or Self Care,2019,INJ036,"COMPLICATION OF TRANSPLANTED ORGANS OR TISSUE, INITIAL ENCOUNTER",IMG008,ULTRASONOGRAPHY,279,HEPATIC COMA & OTHER MAJOR ACUTE LIVER DISORDERS,07,DISEASES AND DISORDERS OF THE HEPATOBILIARY SYSTEM AND PANCREAS,3,Major,Moderate,Medical,Medicaid,,,,,false,81757.79,23251.36
New York City,Manhattan,7002053,001463,NYU Langone Hospitals,30 to 49,117,M,Other Race,Not Span/Hispanic,5,Emergency,Short-term Hospital,2019,DIG018,HEPATIC FAILURE,URN006,BLADDER CATHETERIZATION AND DRAINAGE,279,HEPATIC COMA & OTHER MAJOR ACUTE LIVER DISORDERS,07,DISEASES AND DISORDERS OF THE HEPATOBILIARY SYSTEM AND PANCREAS,3,Major,Extreme,Medical,Medicaid,,,,,false,109177.54,25089.26
New York City,Manhattan,7002053,001463,NYU Langone Hospitals,50 to 69,112,F,Other Race,Not Span/Hispanic,5,Emergency,Home or Self Care,2019,DIG018,HEPATIC FAILURE,,,279,HEPATIC COMA & OTHER MAJOR ACUTE LIVER DISORDERS,07,DISEASES AND DISORDERS OF THE HEPATOBILIARY SYSTEM AND PANCREAS,3,Major,Moderate,Medical,Medicare,,,,,true,72916.99,20082.17
New York City,Manhattan,7002053,001463,NYU Langone Hospitals,50 to 69,100,M,Other Race,Spanish/Hispanic,6,Emergency,Home w/ Home Health Services,2019,DIG018,HEPATIC FAILURE,GIS006,PARACENTESIS,279,HEPATIC COMA & OTHER MAJOR ACUTE LIVER DISORDERS,07,DISEASES AND DISORDERS OF THE HEPATOBILIARY SYSTEM AND PANCREAS,3,Major,Major,Medical,Medicare,,,,,true,79697.94,24912.93
New York City,Manhattan,7002053,001463,NYU Langone Hospitals,30 to 49,OOS,F,Black/African American,Not Span/Hispanic,2,Emergency,Home or Self Care,2019,DIG016,PERITONITIS AND INTRA-ABDOMINAL ABSCESS,,,279,HEPATIC COMA & OTHER MAJOR ACUTE LIVER DISORDERS,07,DISEASES AND DISORDERS OF THE HEPATOBILIARY SYSTEM AND PANCREAS,3,Major,Minor,Medical,Private Health Insurance,,,,,false,18551.32,7117.78
New York City,Manhattan,7002053,001463,NYU Langone Hospitals,50 to 69,112,F,White,Not Span/Hispanic,3,Emergency,Home or Self Care,2019,INJ036,"COMPLICATION OF TRANSPLANTED ORGANS OR TISSUE, INITIAL ENCOUNTER",HEP001,LIVER BIOPSY,279,HEPATIC COMA & OTHER MAJOR ACUTE LIVER DISORDERS,07,DISEASES AND DISORDERS OF THE HEPATOBILIARY SYSTEM AND PANCREAS,3,Major,Moderate,Medical,Blue Cross/Blue Shield,,,,,false,85703.65,24123.36
New York City,Manhattan,7002053,001463,NYU Langone Hospitals,30 to 49,100,F,Other Race,Spanish/Hispanic,6,Emergency,Home w/ Home Health Services,2019,DIG018,HEPATIC FAILURE,,,279,HEPATIC COMA & OTHER MAJOR ACUTE LIVER DISORDERS,07,DISEASES AND DISORDERS OF THE HEPATOBILIARY SYSTEM AND PANCREAS,3,Major,Major,Medical,Medicare,Medicaid,,,,false,70166.22,22375.78
New York City,Manhattan,7002053,001463,NYU Langone Hospitals,50 to 69,112,F,Other Race,Spanish/Hispanic,3,Emergency,Home w/ Home Health Services,2019,DIG018,HEPATIC FAILURE,ESA001,HEMODIALYSIS,279,HEPATIC COMA & OTHER MAJOR ACUTE LIVER DISORDERS,07,DISEASES AND DISORDERS OF THE HEPATOBILIARY SYSTEM AND PANCREAS,3,Major,Major,Medical,Medicare,Medicaid,,,,true,60838.06,17341.86
New York City,Manhattan,7002053,001463,NYU Langone Hospitals,50 to 69,117,F,White,Spanish/Hispanic,4,Emergency,Home or Self Care,2019,INJ036,"COMPLICATION OF TRANSPLANTED ORGANS OR TISSUE, INITIAL ENCOUNTER",,,279,HEPATIC COMA & OTHER MAJOR ACUTE LIVER DISORDERS,07,DISEASES AND DISORDERS OF THE HEPATOBILIARY SYSTEM AND PANCREAS,2,Moderate,Minor,Medical,Medicaid,,,,,false,66099.58,15677.11
New York City,Manhattan,7002053,001463,NYU Langone Hospitals,50 to 69,100,F,White,Not Span/Hispanic,2,Emergency,Home or Self Care,2019,INJ036,"COMPLICATION OF TRANSPLANTED ORGANS OR TISSUE, INITIAL ENCOUNTER",GIS027,"UPPER GI THERAPEUTIC PROCEDURES, NEC (ENDOSCOPIC)",279,HEPATIC COMA & OTHER MAJOR ACUTE LIVER DISORDERS,07,DISEASES AND DISORDERS OF THE HEPATOBILIARY SYSTEM AND PANCREAS,3,Major,Major,Medical,Medicare,Medicaid,,,,true,55418.16,11939.77