Hospital Service Area,Hospital County,Operating Certificate Number,Permanent Facility Id,Facility Name,Age Group,Zip Code - 3 digits,Gender,Race,Ethnicity,Length of Stay,Type of Admission,Patient Disposition,Discharge Year,CCS Diagnosis Code,CCS Diagnosis Description,CCS Procedure Code,CCS Procedure Description,APR DRG Code,APR DRG Description,APR MDC Code,APR MDC Description,APR Severity of Illness Code,APR Severity of Illness Description,APR Risk of Mortality,APR Medical Surgical Description,Payment Typology 1,Payment Typology 2,Payment Typology 3,Birth Weight,Abortion Edit Indicator,Emergency Department Indicator,Total Charges,Total Costs
Long Island,Suffolk,5123000,000885,Long Island Community Hospital,30 to 49,117,F,Black/African American,Not Span/Hispanic,1,Emergency,Left Against Medical Advice,2020,DIG018,HEPATIC FAILURE,,,279,HEPATIC COMA & OTHER MAJOR ACUTE LIVER DISORDERS,07,DISEASES AND DISORDERS OF THE HEPATOBILIARY SYSTEM AND PANCREAS,3,Major,Moderate,Medical,Private Health Insurance,Medicaid,,,,Y,11297.93,1692.81
Long Island,Suffolk,5123000,000885,Long Island Community Hospital,70 or Older,119,F,Black/African American,Not Span/Hispanic,3,Emergency,Home or Self Care,2020,DIG018,HEPATIC FAILURE,,,279,HEPATIC COMA & OTHER MAJOR ACUTE LIVER DISORDERS,07,DISEASES AND DISORDERS OF THE HEPATOBILIARY SYSTEM AND PANCREAS,2,Moderate,Moderate,Medical,Medicare,Medicare,Medicaid,,,Y,42778.65,5216.03
Long Island,Suffolk,5123000,000885,Long Island Community Hospital,50 to 69,119,M,White,Not Span/Hispanic,5,Emergency,Home w/ Home Health Services,2020,DIG018,HEPATIC FAILURE,ADM001,TRANSFUSION OF BLOOD AND BLOOD PRODUCTS,279,HEPATIC COMA & OTHER MAJOR ACUTE LIVER DISORDERS,07,DISEASES AND DISORDERS OF THE HEPATOBILIARY SYSTEM AND PANCREAS,4,Extreme,Extreme,Medical,Private Health Insurance,Medicaid,,,,Y,73866.34,13036.82
Long Island,Suffolk,5123000,000885,Long Island Community Hospital,70 or Older,117,M,White,Not Span/Hispanic,2,Emergency,Home or Self Care,2020,DIG018,HEPATIC FAILURE,,,279,HEPATIC COMA & OTHER MAJOR ACUTE LIVER DISORDERS,07,DISEASES AND DISORDERS OF THE HEPATOBILIARY SYSTEM AND PANCREAS,3,Major,Major,Medical,Blue Cross/Blue Shield,Medicare,,,,Y,36632.18,3990.41
Long Island,Suffolk,5123000,000885,Long Island Community Hospital,50 to 69,119,F,Black/African American,Not Span/Hispanic,10,Emergency,Home w/ Home Health Services,2020,DIG018,HEPATIC FAILURE,GIS007,GI SYSTEM DRAINAGE (EXCLUDING PARACENTESIS),279,HEPATIC COMA & OTHER MAJOR ACUTE LIVER DISORDERS,07,DISEASES AND DISORDERS OF THE HEPATOBILIARY SYSTEM AND PANCREAS,4,Extreme,Major,Medical,Private Health Insurance,Medicaid,,,,Y,96757.98,29156.42
Long Island,Suffolk,5123000,000885,Long Island Community Hospital,50 to 69,119,F,Black/African American,Not Span/Hispanic,2,Emergency,Home or Self Care,2020,DIG018,HEPATIC FAILURE,,,279,HEPATIC COMA & OTHER MAJOR ACUTE LIVER DISORDERS,07,DISEASES AND DISORDERS OF THE HEPATOBILIARY SYSTEM AND PANCREAS,2,Moderate,Minor,Medical,Private Health Insurance,Medicaid,,,,Y,31927.96,5457.17
Long Island,Suffolk,5123000,000885,Long Island Community Hospital,50 to 69,119,F,Black/African American,Not Span/Hispanic,1,Emergency,Home or Self Care,2020,DIG018,HEPATIC FAILURE,,,279,HEPATIC COMA & OTHER MAJOR ACUTE LIVER DISORDERS,07,DISEASES AND DISORDERS OF THE HEPATOBILIARY SYSTEM AND PANCREAS,3,Major,Moderate,Medical,Private Health Insurance,Medicaid,,,,Y,14604.06,2003.21
Long Island,Suffolk,5123000,000885,Long Island Community Hospital,50 to 69,117,F,White,Not Span/Hispanic,5,Emergency,Home w/ Home Health Services,2020,DIG018,HEPATIC FAILURE,,,279,HEPATIC COMA & OTHER MAJOR ACUTE LIVER DISORDERS,07,DISEASES AND DISORDERS OF THE HEPATOBILIARY SYSTEM AND PANCREAS,2,Moderate,Minor,Medical,Private Health Insurance,Medicaid,,,,Y,83940.38,11007.74
Long Island,Suffolk,5123000,000885,Long Island Community Hospital,30 to 49,119,M,White,Not Span/Hispanic,4,Emergency,Left Against Medical Advice,2020,DIG018,HEPATIC FAILURE,GIS006,PARACENTESIS,279,HEPATIC COMA & OTHER MAJOR ACUTE LIVER DISORDERS,07,DISEASES AND DISORDERS OF THE HEPATOBILIARY SYSTEM AND PANCREAS,3,Major,Moderate,Medical,Private Health Insurance,Medicaid,,,,Y,77546.7,9232.89
Long Island,Suffolk,5123000,000885,Long Island Community Hospital,70 or Older,117,M,White,Not Span/Hispanic,5,Emergency,Home w/ Home Health Services,2020,DIG018,HEPATIC FAILURE,ADM003,ADMINISTRATION OF ALBUMIN AND GLOBULIN,279,HEPATIC COMA & OTHER MAJOR ACUTE LIVER DISORDERS,07,DISEASES AND DISORDERS OF THE HEPATOBILIARY SYSTEM AND PANCREAS,3,Major,Major,Medical,Blue Cross/Blue Shield,Medicare,,,,Y,48618.33,9051.47
Long Island,Suffolk,5123000,000885,Long Island Community Hospital,30 to 49,117,M,Other Race,Not Span/Hispanic,14,Emergency,Home w/ Home Health Services,2020,DIG018,HEPATIC FAILURE,GIS006,PARACENTESIS,279,HEPATIC COMA & OTHER MAJOR ACUTE LIVER DISORDERS,07,DISEASES AND DISORDERS OF THE HEPATOBILIARY SYSTEM AND PANCREAS,3,Major,Extreme,Medical,Medicaid,,,,,Y,189881.66,35170.19
Long Island,Suffolk,5123000,000885,Long Island Community Hospital,70 or Older,117,M,White,Not Span/Hispanic,2,Emergency,Home w/ Home Health Services,2020,DIG018,HEPATIC FAILURE,SUD002,PHARMACOTHERAPY FOR SUBSTANCE USE,279,HEPATIC COMA & OTHER MAJOR ACUTE LIVER DISORDERS,07,DISEASES AND DISORDERS OF THE HEPATOBILIARY SYSTEM AND PANCREAS,3,Major,Major,Medical,Blue Cross/Blue Shield,Medicare,,,,Y,24694.95,3757.71
Long Island,Suffolk,5123000,000885,Long Island Community Hospital,50 to 69,119,F,Black/African American,Not Span/Hispanic,1,Emergency,Home or Self Care,2020,DIG018,HEPATIC FAILURE,SUD001,SUBSTANCE USE DETOXIFICATION,279,HEPATIC COMA & OTHER MAJOR ACUTE LIVER DISORDERS,07,DISEASES AND DISORDERS OF THE HEPATOBILIARY SYSTEM AND PANCREAS,2,Moderate,Minor,Medical,Private Health Insurance,Medicaid,,,,Y,13076.84,2120.84
Long Island,Suffolk,5123000,000885,Long Island Community Hospital,30 to 49,119,M,White,Not Span/Hispanic,2,Emergency,Home or Self Care,2020,DIG018,HEPATIC FAILURE,GIS006,PARACENTESIS,279,HEPATIC COMA & OTHER MAJOR ACUTE LIVER DISORDERS,07,DISEASES AND DISORDERS OF THE HEPATOBILIARY SYSTEM AND PANCREAS,3,Major,Moderate,Medical,Private Health Insurance,Medicaid,,,,Y,46905.99,4608.41
Long Island,Suffolk,5123000,000885,Long Island Community Hospital,70 or Older,117,M,White,Not Span/Hispanic,8,Emergency,Home or Self Care,2020,DIG018,HEPATIC FAILURE,GIS001,ESOPHAGOGASTRODUODENOSCOPY (EGD) WITH BIOPSY,279,HEPATIC COMA & OTHER MAJOR ACUTE LIVER DISORDERS,07,DISEASES AND DISORDERS OF THE HEPATOBILIARY SYSTEM AND PANCREAS,4,Extreme,Major,Medical,Medicare,Medicare,Blue Cross/Blue Shield,,,Y,87902.69,16725.23
Long Island,Suffolk,5123000,000885,Long Island Community Hospital,70 or Older,117,M,White,Not Span/Hispanic,1,Emergency,Short-term Hospital,2020,DIG018,HEPATIC FAILURE,ADM003,ADMINISTRATION OF ALBUMIN AND GLOBULIN,279,HEPATIC COMA & OTHER MAJOR ACUTE LIVER DISORDERS,07,DISEASES AND DISORDERS OF THE HEPATOBILIARY SYSTEM AND PANCREAS,3,Major,Major,Medical,Medicare,,,,,Y,19444.43,2667.23
Long Island,Suffolk,5123000,000885,Long Island Community Hospital,50 to 69,117,M,White,Not Span/Hispanic,9,Emergency,Home or Self Care,2020,CIR033,ACUTE PHLEBITIS; THROMBOPHLEBITIS AND THROMBOEMBOLISM,GIS004,GI SYSTEM ENDOSCOPY WITHOUT BIOPSY (DIAGNOSTIC),279,HEPATIC COMA & OTHER MAJOR ACUTE LIVER DISORDERS,07,DISEASES AND DISORDERS OF THE HEPATOBILIARY SYSTEM AND PANCREAS,2,Moderate,Moderate,Medical,Blue Cross/Blue Shield,,,,,Y,84674.1,17124.32
Long Island,Suffolk,5123000,000885,Long Island Community Hospital,30 to 49,119,M,White,Not Span/Hispanic,2,Emergency,Home or Self Care,2020,DIG018,HEPATIC FAILURE,,,279,HEPATIC COMA & OTHER MAJOR ACUTE LIVER DISORDERS,07,DISEASES AND DISORDERS OF THE HEPATOBILIARY SYSTEM AND PANCREAS,2,Moderate,Minor,Medical,Medicare,Medicare,Medicaid,,,Y,17720.57,3279.58
Long Island,Suffolk,5123000,000885,Long Island Community Hospital,30 to 49,119,M,White,Not Span/Hispanic,1,Emergency,Cancer Center or Children's Hospital,2020,DIG018,HEPATIC FAILURE,ADM003,ADMINISTRATION OF ALBUMIN AND GLOBULIN,279,HEPATIC COMA & OTHER MAJOR ACUTE LIVER DISORDERS,07,DISEASES AND DISORDERS OF THE HEPATOBILIARY SYSTEM AND PANCREAS,3,Major,Extreme,Medical,Medicare,Medicare,Medicaid,,,Y,35918.76,3995.58
Long Island,Suffolk,5123000,000885,Long Island Community Hospital,30 to 49,117,F,White,Not Span/Hispanic,6,Emergency,Short-term Hospital,2020,DIG018,HEPATIC FAILURE,ADM003,ADMINISTRATION OF ALBUMIN AND GLOBULIN,279,HEPATIC COMA & OTHER MAJOR ACUTE LIVER DISORDERS,07,DISEASES AND DISORDERS OF THE HEPATOBILIARY SYSTEM AND PANCREAS,4,Extreme,Extreme,Medical,Private Health Insurance,Medicaid,,,,Y,74187.97,13581.24
Long Island,Suffolk,5123000,000885,Long Island Community Hospital,50 to 69,117,F,White,Not Span/Hispanic,9,Emergency,Home w/ Home Health Services,2020,DIG018,HEPATIC FAILURE,,,279,HEPATIC COMA & OTHER MAJOR ACUTE LIVER DISORDERS,07,DISEASES AND DISORDERS OF THE HEPATOBILIARY SYSTEM AND PANCREAS,3,Major,Moderate,Medical,Medicare,,,,,Y,87425.98,13985.26
Long Island,Suffolk,5123000,000885,Long Island Community Hospital,50 to 69,117,F,White,Not Span/Hispanic,11,Emergency,Expired,2020,DIG019,OTHER SPECIFIED AND UNSPECIFIED LIVER DISEASE,ADM006,INFUSION OF VASOPRESSOR,279,HEPATIC COMA & OTHER MAJOR ACUTE LIVER DISORDERS,07,DISEASES AND DISORDERS OF THE HEPATOBILIARY SYSTEM AND PANCREAS,4,Extreme,Extreme,Medical,Private Health Insurance,Medicaid,,,,Y,133624.2,24677.88
Long Island,Suffolk,5123000,000885,Long Island Community Hospital,70 or Older,117,F,White,Not Span/Hispanic,3,Emergency,Home w/ Home Health Services,2020,DIG018,HEPATIC FAILURE,,,279,HEPATIC COMA & OTHER MAJOR ACUTE LIVER DISORDERS,07,DISEASES AND DISORDERS OF THE HEPATOBILIARY SYSTEM AND PANCREAS,2,Moderate,Moderate,Medical,Medicare,Medicare,Blue Cross/Blue Shield,,,Y,48836.16,5944.2
Long Island,Suffolk,5123000,000885,Long Island Community Hospital,50 to 69,117,F,Other Race,Not Span/Hispanic,6,Emergency,Home w/ Home Health Services,2020,DIG018,HEPATIC FAILURE,,,279,HEPATIC COMA & OTHER MAJOR ACUTE LIVER DISORDERS,07,DISEASES AND DISORDERS OF THE HEPATOBILIARY SYSTEM AND PANCREAS,2,Moderate,Moderate,Medical,Medicaid,,,,,Y,65482.26,10187.54
Long Island,Suffolk,5123000,000885,Long Island Community Hospital,50 to 69,117,M,White,Not Span/Hispanic,4,Emergency,Short-term Hospital,2020,DIG018,HEPATIC FAILURE,ESA001,HEMODIALYSIS,279,HEPATIC COMA & OTHER MAJOR ACUTE LIVER DISORDERS,07,DISEASES AND DISORDERS OF THE HEPATOBILIARY SYSTEM AND PANCREAS,4,Extreme,Extreme,Medical,Blue Cross/Blue Shield,,,,,Y,49078.73,9117.59
