Hospital Service Area,Hospital County,Operating Certificate Number,Permanent Facility Id,Facility Name,Age Group,Zip Code - 3 digits,Gender,Race,Ethnicity,Length of Stay,Type of Admission,Patient Disposition,Discharge Year,CCS Diagnosis Code,CCS Diagnosis Description,CCS Procedure Code,CCS Procedure Description,APR DRG Code,APR DRG Description,APR MDC Code,APR MDC Description,APR Severity of Illness Code,APR Severity of Illness Description,APR Risk of Mortality,APR Medical Surgical Description,Payment Typology 1,Payment Typology 2,Payment Typology 3,Birth Weight,Abortion Edit Indicator,Emergency Department Indicator,Total Charges,Total Costs
Long Island,Nassau,2908000,000511,NYU Winthrop Hospital,50 to 69,115,M,White,Not Span/Hispanic,6,Emergency,Home or Self Care,2017,660,Alcohol-related disorders,088,ABDOMINAL PARACENTESIS,280,Alcoholic liver disease,07,Diseases and Disorders of the Hepatobiliary System and Pancreas,3,Major,Moderate,Medical,Blue Cross/Blue Shield,,,,N,Y,85541.66,21821.37
Long Island,Nassau,2908000,000511,NYU Winthrop Hospital,50 to 69,110,M,White,Not Span/Hispanic,5,Emergency,Home or Self Care,2017,660,Alcohol-related disorders,098,OT NON-OR GI THER PRCS,280,Alcoholic liver disease,07,Diseases and Disorders of the Hepatobiliary System and Pancreas,3,Major,Major,Medical,Medicare,Medicare,Blue Cross/Blue Shield,,N,Y,77172.62,14710.91
Long Island,Nassau,2908000,000511,NYU Winthrop Hospital,50 to 69,110,F,White,Not Span/Hispanic,1,Emergency,Left Against Medical Advice,2017,660,Alcohol-related disorders,088,ABDOMINAL PARACENTESIS,280,Alcoholic liver disease,07,Diseases and Disorders of the Hepatobiliary System and Pancreas,1,Minor,Moderate,Medical,Medicaid,Medicaid,,,N,Y,22494.89,4618.74
Long Island,Nassau,2908000,000511,NYU Winthrop Hospital,50 to 69,115,M,Black/African American,Spanish/Hispanic,2,Emergency,Home or Self Care,2017,660,Alcohol-related disorders,000,NO PROC,280,Alcoholic liver disease,07,Diseases and Disorders of the Hepatobiliary System and Pancreas,4,Extreme,Major,Medical,Medicare,Medicare,Blue Cross/Blue Shield,,N,Y,29994.18,4981.65
Long Island,Nassau,2908000,000511,NYU Winthrop Hospital,30 to 49,115,M,Other Race,Spanish/Hispanic,4,Emergency,Home or Self Care,2017,660,Alcohol-related disorders,219,ALCO/DRUG REHAB/DETOX,280,Alcoholic liver disease,07,Diseases and Disorders of the Hepatobiliary System and Pancreas,2,Moderate,Moderate,Medical,Medicaid,,,,N,Y,52033.11,9158.72
Long Island,Nassau,2908000,000511,NYU Winthrop Hospital,30 to 49,115,M,Other Race,Spanish/Hispanic,13,Emergency,Short-term Hospital,2017,660,Alcohol-related disorders,088,ABDOMINAL PARACENTESIS,280,Alcoholic liver disease,07,Diseases and Disorders of the Hepatobiliary System and Pancreas,3,Major,Moderate,Medical,Medicaid,,,,N,Y,100779.47,22448.91
Long Island,Nassau,2908000,000511,NYU Winthrop Hospital,50 to 69,115,M,White,Not Span/Hispanic,4,Emergency,Home or Self Care,2017,660,Alcohol-related disorders,098,OT NON-OR GI THER PRCS,280,Alcoholic liver disease,07,Diseases and Disorders of the Hepatobiliary System and Pancreas,3,Major,Major,Medical,Blue Cross/Blue Shield,,,,N,Y,45046.81,9529.24
Long Island,Nassau,2908000,000511,NYU Winthrop Hospital,50 to 69,115,M,Black/African American,Not Span/Hispanic,3,Emergency,Home or Self Care,2017,660,Alcohol-related disorders,000,NO PROC,280,Alcoholic liver disease,07,Diseases and Disorders of the Hepatobiliary System and Pancreas,2,Moderate,Minor,Medical,Blue Cross/Blue Shield,,,,N,Y,59381.09,11165.15
Long Island,Nassau,2908000,000511,NYU Winthrop Hospital,30 to 49,110,M,Other Race,Spanish/Hispanic,2,Emergency,Home or Self Care,2017,660,Alcohol-related disorders,000,NO PROC,280,Alcoholic liver disease,07,Diseases and Disorders of the Hepatobiliary System and Pancreas,2,Moderate,Moderate,Medical,Medicaid,,,,N,Y,28399.94,5143.06
Long Island,Nassau,2908000,000511,NYU Winthrop Hospital,30 to 49,110,M,White,Spanish/Hispanic,5,Emergency,Home or Self Care,2017,660,Alcohol-related disorders,092,OTHER BOWEL DX PRCS,280,Alcoholic liver disease,07,Diseases and Disorders of the Hepatobiliary System and Pancreas,2,Moderate,Moderate,Medical,Medicaid,,,,N,Y,86278.72,16838.24
Long Island,Nassau,2908000,000511,NYU Winthrop Hospital,50 to 69,115,F,White,Not Span/Hispanic,3,Emergency,Home or Self Care,2017,660,Alcohol-related disorders,000,NO PROC,280,Alcoholic liver disease,07,Diseases and Disorders of the Hepatobiliary System and Pancreas,2,Moderate,Moderate,Medical,Private Health Insurance,,,,N,Y,42244.15,7667.50
Long Island,Nassau,2908000,000511,NYU Winthrop Hospital,50 to 69,115,M,White,Not Span/Hispanic,3,Emergency,Home or Self Care,2017,660,Alcohol-related disorders,000,NO PROC,280,Alcoholic liver disease,07,Diseases and Disorders of the Hepatobiliary System and Pancreas,2,Moderate,Minor,Medical,Blue Cross/Blue Shield,,,,N,Y,35335.98,6239.57
Long Island,Nassau,2908000,000511,NYU Winthrop Hospital,50 to 69,115,M,Black/African American,Not Span/Hispanic,13,Emergency,Court/Law Enforcement,2017,660,Alcohol-related disorders,070,UP GASTRO ENDOSC/BIOPSY,280,Alcoholic liver disease,07,Diseases and Disorders of the Hepatobiliary System and Pancreas,3,Major,Moderate,Medical,Medicaid,,,,N,Y,115375.22,22851.37
Long Island,Nassau,2908000,000511,NYU Winthrop Hospital,50 to 69,115,M,White,Not Span/Hispanic,9,Emergency,Short-term Hospital,2017,660,Alcohol-related disorders,000,NO PROC,280,Alcoholic liver disease,07,Diseases and Disorders of the Hepatobiliary System and Pancreas,3,Major,Moderate,Medical,Blue Cross/Blue Shield,Private Health Insurance,,,N,Y,128824.30,22387.19
Long Island,Nassau,2908000,000511,NYU Winthrop Hospital,50 to 69,117,M,White,Not Span/Hispanic,3,Emergency,Home or Self Care,2017,660,Alcohol-related disorders,088,ABDOMINAL PARACENTESIS,280,Alcoholic liver disease,07,Diseases and Disorders of the Hepatobiliary System and Pancreas,3,Major,Moderate,Medical,Medicaid,,,,N,Y,53174.39,13805.49
Long Island,Nassau,2908000,000511,NYU Winthrop Hospital,50 to 69,117,M,White,Not Span/Hispanic,2,Emergency,Home or Self Care,2017,660,Alcohol-related disorders,088,ABDOMINAL PARACENTESIS,280,Alcoholic liver disease,07,Diseases and Disorders of the Hepatobiliary System and Pancreas,2,Moderate,Moderate,Medical,Medicaid,,,,N,Y,39644.15,9965.57
Long Island,Nassau,2908000,000511,NYU Winthrop Hospital,50 to 69,117,M,White,Spanish/Hispanic,6,Emergency,Home or Self Care,2017,660,Alcohol-related disorders,088,ABDOMINAL PARACENTESIS,280,Alcoholic liver disease,07,Diseases and Disorders of the Hepatobiliary System and Pancreas,3,Major,Moderate,Medical,Medicaid,Medicaid,,,N,Y,146408.19,31587.27
Long Island,Nassau,2908000,000511,NYU Winthrop Hospital,50 to 69,115,M,White,Not Span/Hispanic,4,Emergency,Home or Self Care,2017,660,Alcohol-related disorders,000,NO PROC,280,Alcoholic liver disease,07,Diseases and Disorders of the Hepatobiliary System and Pancreas,3,Major,Moderate,Medical,Private Health Insurance,,,,N,Y,46406.42,9169.17
Long Island,Nassau,2908000,000511,NYU Winthrop Hospital,30 to 49,110,M,White,Spanish/Hispanic,2,Emergency,Home or Self Care,2017,660,Alcohol-related disorders,000,NO PROC,280,Alcoholic liver disease,07,Diseases and Disorders of the Hepatobiliary System and Pancreas,1,Minor,Minor,Medical,Medicaid,,,,N,Y,39195.11,6921.85
Long Island,Nassau,2908000,000511,NYU Winthrop Hospital,50 to 69,117,M,White,Spanish/Hispanic,17,Emergency,Home or Self Care,2017,660,Alcohol-related disorders,070,UP GASTRO ENDOSC/BIOPSY,280,Alcoholic liver disease,07,Diseases and Disorders of the Hepatobiliary System and Pancreas,3,Major,Major,Medical,Blue Cross/Blue Shield,,,,N,Y,359484.71,85853.62
Long Island,Nassau,2908000,000511,NYU Winthrop Hospital,30 to 49,115,M,White,Spanish/Hispanic,6,Emergency,Home or Self Care,2017,660,Alcohol-related disorders,222,BLOOD TRANSFUSION,280,Alcoholic liver disease,07,Diseases and Disorders of the Hepatobiliary System and Pancreas,3,Major,Moderate,Medical,Medicaid,Medicaid,,,N,Y,115618.36,26553.13
Long Island,Nassau,2908000,000511,NYU Winthrop Hospital,50 to 69,115,M,Other Race,Not Span/Hispanic,4,Emergency,Home or Self Care,2017,660,Alcohol-related disorders,088,ABDOMINAL PARACENTESIS,280,Alcoholic liver disease,07,Diseases and Disorders of the Hepatobiliary System and Pancreas,2,Moderate,Moderate,Medical,Medicaid,Medicaid,,,N,Y,47232.87,10638.92
Long Island,Nassau,2908000,000511,NYU Winthrop Hospital,30 to 49,115,M,White,Spanish/Hispanic,9,Emergency,Home w/ Home Health Services,2017,660,Alcohol-related disorders,070,UP GASTRO ENDOSC/BIOPSY,280,Alcoholic liver disease,07,Diseases and Disorders of the Hepatobiliary System and Pancreas,3,Major,Moderate,Medical,Medicaid,Medicaid,,,N,Y,177075.25,40303.36
Long Island,Nassau,2908000,000511,NYU Winthrop Hospital,30 to 49,117,F,White,Not Span/Hispanic,4,Emergency,Home or Self Care,2017,660,Alcohol-related disorders,219,ALCO/DRUG REHAB/DETOX,280,Alcoholic liver disease,07,Diseases and Disorders of the Hepatobiliary System and Pancreas,1,Minor,Minor,Medical,Private Health Insurance,,,,N,Y,47841.79,8680.88
Long Island,Nassau,2908000,000511,NYU Winthrop Hospital,50 to 69,118,M,White,Not Span/Hispanic,1,Emergency,Hospice - Home,2017,660,Alcohol-related disorders,000,NO PROC,280,Alcoholic liver disease,07,Diseases and Disorders of the Hepatobiliary System and Pancreas,2,Moderate,Minor,Medical,Medicare,Medicare,Private Health Insurance,,N,Y,16140.27,3133.73
Long Island,Nassau,2908000,000511,NYU Winthrop Hospital,70 or Older,117,M,White,Not Span/Hispanic,6,Emergency,Home w/ Home Health Services,2017,660,Alcohol-related disorders,088,ABDOMINAL PARACENTESIS,280,Alcoholic liver disease,07,Diseases and Disorders of the Hepatobiliary System and Pancreas,3,Major,Moderate,Medical,Medicare,Medicare,Private Health Insurance,,N,Y,104730.91,20874.61
Long Island,Nassau,2908000,000511,NYU Winthrop Hospital,30 to 49,115,M,White,Spanish/Hispanic,3,Emergency,Short-term Hospital,2017,660,Alcohol-related disorders,098,OT NON-OR GI THER PRCS,280,Alcoholic liver disease,07,Diseases and Disorders of the Hepatobiliary System and Pancreas,3,Major,Major,Medical,Private Health Insurance,,,,N,Y,91110.52,15304.78
Long Island,Nassau,2908000,000511,NYU Winthrop Hospital,50 to 69,117,M,White,Not Span/Hispanic,4,Emergency,Home w/ Home Health Services,2017,660,Alcohol-related disorders,088,ABDOMINAL PARACENTESIS,280,Alcoholic liver disease,07,Diseases and Disorders of the Hepatobiliary System and Pancreas,3,Major,Major,Medical,Medicare,Medicare,Private Health Insurance,,N,Y,74914.01,13711.45
Long Island,Nassau,2908000,000511,NYU Winthrop Hospital,30 to 49,115,M,White,Spanish/Hispanic,5,Emergency,Home or Self Care,2017,660,Alcohol-related disorders,222,BLOOD TRANSFUSION,280,Alcoholic liver disease,07,Diseases and Disorders of the Hepatobiliary System and Pancreas,3,Major,Major,Medical,Medicaid,Medicaid,,,N,Y,69472.53,13306.24
Long Island,Nassau,2908000,000511,NYU Winthrop Hospital,50 to 69,115,M,White,Not Span/Hispanic,7,Emergency,Home or Self Care,2017,660,Alcohol-related disorders,201,CARDIAC STRESS TESTS,280,Alcoholic liver disease,07,Diseases and Disorders of the Hepatobiliary System and Pancreas,4,Extreme,Major,Medical,Medicare,Medicare,,,N,Y,129312.92,29352.93
Long Island,Nassau,2908000,000511,NYU Winthrop Hospital,30 to 49,115,M,White,Spanish/Hispanic,5,Emergency,Home or Self Care,2017,660,Alcohol-related disorders,088,ABDOMINAL PARACENTESIS,280,Alcoholic liver disease,07,Diseases and Disorders of the Hepatobiliary System and Pancreas,2,Moderate,Moderate,Medical,Federal/State/Local/VA,,,,N,Y,62744.95,15017.74
Long Island,Nassau,2908000,000511,NYU Winthrop Hospital,30 to 49,115,M,White,Not Span/Hispanic,16,Emergency,Skilled Nursing Home,2017,660,Alcohol-related disorders,088,ABDOMINAL PARACENTESIS,280,Alcoholic liver disease,07,Diseases and Disorders of the Hepatobiliary System and Pancreas,3,Major,Major,Medical,Federal/State/Local/VA,,,,N,Y,395951.74,75386.26
Long Island,Nassau,2908000,000511,NYU Winthrop Hospital,30 to 49,117,F,White,Not Span/Hispanic,5,Emergency,Home or Self Care,2017,660,Alcohol-related disorders,070,UP GASTRO ENDOSC/BIOPSY,280,Alcoholic liver disease,07,Diseases and Disorders of the Hepatobiliary System and Pancreas,3,Major,Minor,Medical,Federal/State/Local/VA,,,,N,Y,98508.96,22709.75
Long Island,Nassau,2908000,000511,NYU Winthrop Hospital,30 to 49,115,M,White,Spanish/Hispanic,14,Emergency,Home w/ Home Health Services,2017,660,Alcohol-related disorders,088,ABDOMINAL PARACENTESIS,280,Alcoholic liver disease,07,Diseases and Disorders of the Hepatobiliary System and Pancreas,3,Major,Extreme,Medical,Federal/State/Local/VA,,,,N,Y,283995.58,74444.84
Long Island,Nassau,2908000,000511,NYU Winthrop Hospital,30 to 49,115,M,White,Not Span/Hispanic,2,Emergency,Left Against Medical Advice,2017,660,Alcohol-related disorders,219,ALCO/DRUG REHAB/DETOX,280,Alcoholic liver disease,07,Diseases and Disorders of the Hepatobiliary System and Pancreas,3,Major,Major,Medical,Self-Pay,,,,N,Y,88239.49,15203.45
Long Island,Nassau,2908000,000511,NYU Winthrop Hospital,70 or Older,115,M,White,Not Span/Hispanic,6,Emergency,Hospice - Home,2017,660,Alcohol-related disorders,088,ABDOMINAL PARACENTESIS,280,Alcoholic liver disease,07,Diseases and Disorders of the Hepatobiliary System and Pancreas,3,Major,Major,Medical,Medicare,Medicare,,,N,Y,90512.00,25234.33
Long Island,Nassau,2908000,000511,NYU Winthrop Hospital,50 to 69,115,M,White,Not Span/Hispanic,11,Emergency,Home w/ Home Health Services,2017,660,Alcohol-related disorders,088,ABDOMINAL PARACENTESIS,280,Alcoholic liver disease,07,Diseases and Disorders of the Hepatobiliary System and Pancreas,3,Major,Major,Medical,Medicaid,Medicaid,,,N,Y,189209.93,43267.96
Long Island,Nassau,2908000,000511,NYU Winthrop Hospital,50 to 69,115,M,White,Not Span/Hispanic,9,Emergency,Home or Self Care,2017,660,Alcohol-related disorders,077,PROCTOSCOPY & AR BIOPSY,280,Alcoholic liver disease,07,Diseases and Disorders of the Hepatobiliary System and Pancreas,2,Moderate,Moderate,Medical,Medicaid,Medicaid,,,N,Y,158340.80,34622.71
Long Island,Nassau,2908000,000511,NYU Winthrop Hospital,30 to 49,117,M,White,Not Span/Hispanic,7,Emergency,Home or Self Care,2017,660,Alcohol-related disorders,000,NO PROC,280,Alcoholic liver disease,07,Diseases and Disorders of the Hepatobiliary System and Pancreas,2,Moderate,Minor,Medical,Blue Cross/Blue Shield,Medicaid,,,N,Y,48941.39,10489.78
Long Island,Nassau,2908000,000511,NYU Winthrop Hospital,30 to 49,115,M,White,Spanish/Hispanic,6,Emergency,Home or Self Care,2017,660,Alcohol-related disorders,088,ABDOMINAL PARACENTESIS,280,Alcoholic liver disease,07,Diseases and Disorders of the Hepatobiliary System and Pancreas,3,Major,Moderate,Medical,Medicaid,Medicaid,,,N,Y,93356.27,17127.64
