Hospital Service Area,Hospital County,Operating Certificate Number,Permanent Facility Id,Facility Name,Age Group,Zip Code - 3 digits,Gender,Race,Ethnicity,Length of Stay,Type of Admission,Patient Disposition,Discharge Year,CCS Diagnosis Code,CCS Diagnosis Description,CCS Procedure Code,CCS Procedure Description,APR DRG Code,APR DRG Description,APR MDC Code,APR MDC Description,APR Severity of Illness Code,APR Severity of Illness Description,APR Risk of Mortality,APR Medical Surgical Description,Payment Typology 1,Payment Typology 2,Payment Typology 3,Birth Weight,Abortion Edit Indicator,Emergency Department Indicator,Total Charges,Total Costs
Long Island,Suffolk,5123000,000885,Brookhaven Memorial Hospital Medical Center Inc,50 to 69,117,M,White,Not Span/Hispanic,20,Emergency,Home w/ Home Health Services,2017,660,Alcohol-related disorders,219,ALCO/DRUG REHAB/DETOX,280,Alcoholic liver disease,07,Diseases and Disorders of the Hepatobiliary System and Pancreas,3,Major,Major,Medical,Medicaid,,,,N,Y,138467.08,31764.69
Long Island,Suffolk,5123000,000885,Brookhaven Memorial Hospital Medical Center Inc,50 to 69,117,F,White,Not Span/Hispanic,7,Emergency,Home w/ Home Health Services,2017,660,Alcohol-related disorders,222,BLOOD TRANSFUSION,280,Alcoholic liver disease,07,Diseases and Disorders of the Hepatobiliary System and Pancreas,3,Major,Major,Medical,Private Health Insurance,,,,N,Y,91859.01,20003.33
Long Island,Suffolk,5123000,000885,Brookhaven Memorial Hospital Medical Center Inc,70 or Older,119,F,White,Not Span/Hispanic,6,Emergency,Home w/ Home Health Services,2017,660,Alcohol-related disorders,219,ALCO/DRUG REHAB/DETOX,280,Alcoholic liver disease,07,Diseases and Disorders of the Hepatobiliary System and Pancreas,2,Moderate,Moderate,Medical,Medicare,Medicare,Medicaid,,N,Y,36998.60,7735.61
Long Island,Suffolk,5123000,000885,Brookhaven Memorial Hospital Medical Center Inc,50 to 69,119,M,White,Not Span/Hispanic,3,Emergency,Home or Self Care,2017,660,Alcohol-related disorders,000,NO PROC,280,Alcoholic liver disease,07,Diseases and Disorders of the Hepatobiliary System and Pancreas,3,Major,Major,Medical,Private Health Insurance,Medicaid,,,N,Y,43245.18,5792.85
Long Island,Suffolk,5123000,000885,Brookhaven Memorial Hospital Medical Center Inc,50 to 69,117,F,White,Not Span/Hispanic,3,Emergency,Home or Self Care,2017,660,Alcohol-related disorders,070,UP GASTRO ENDOSC/BIOPSY,280,Alcoholic liver disease,07,Diseases and Disorders of the Hepatobiliary System and Pancreas,3,Major,Moderate,Medical,Self-Pay,,,,N,Y,54479.29,9424.58
Long Island,Suffolk,5123000,000885,Brookhaven Memorial Hospital Medical Center Inc,50 to 69,119,M,White,Not Span/Hispanic,2,Emergency,Home or Self Care,2017,660,Alcohol-related disorders,000,NO PROC,280,Alcoholic liver disease,07,Diseases and Disorders of the Hepatobiliary System and Pancreas,3,Major,Moderate,Medical,Medicaid,,,,N,Y,47026.48,4557.95
Long Island,Suffolk,5123000,000885,Brookhaven Memorial Hospital Medical Center Inc,50 to 69,117,F,White,Not Span/Hispanic,2,Emergency,Home or Self Care,2017,660,Alcohol-related disorders,000,NO PROC,280,Alcoholic liver disease,07,Diseases and Disorders of the Hepatobiliary System and Pancreas,3,Major,Moderate,Medical,Medicare,Medicare,Medicaid,,N,Y,22223.48,3579.91
Long Island,Suffolk,5123000,000885,Brookhaven Memorial Hospital Medical Center Inc,30 to 49,117,F,Other Race,Not Span/Hispanic,5,Emergency,Home or Self Care,2017,660,Alcohol-related disorders,219,ALCO/DRUG REHAB/DETOX,280,Alcoholic liver disease,07,Diseases and Disorders of the Hepatobiliary System and Pancreas,2,Moderate,Minor,Medical,Private Health Insurance,,,,N,Y,32221.32,6358.83
Long Island,Suffolk,5123000,000885,Brookhaven Memorial Hospital Medical Center Inc,50 to 69,117,F,White,Not Span/Hispanic,3,Emergency,Home or Self Care,2017,660,Alcohol-related disorders,000,NO PROC,280,Alcoholic liver disease,07,Diseases and Disorders of the Hepatobiliary System and Pancreas,3,Major,Moderate,Medical,Medicare,Medicare,Medicaid,,N,Y,20402.22,4283.99
Long Island,Suffolk,5123000,000885,Brookhaven Memorial Hospital Medical Center Inc,50 to 69,117,M,Black/African American,Not Span/Hispanic,5,Emergency,Home or Self Care,2017,660,Alcohol-related disorders,222,BLOOD TRANSFUSION,280,Alcoholic liver disease,07,Diseases and Disorders of the Hepatobiliary System and Pancreas,3,Major,Major,Medical,Private Health Insurance,Medicaid,,,N,Y,115198.52,17414.02
Long Island,Suffolk,5123000,000885,Brookhaven Memorial Hospital Medical Center Inc,18 to 29,119,F,White,Not Span/Hispanic,1,Emergency,Left Against Medical Advice,2017,660,Alcohol-related disorders,219,ALCO/DRUG REHAB/DETOX,280,Alcoholic liver disease,07,Diseases and Disorders of the Hepatobiliary System and Pancreas,1,Minor,Minor,Medical,Private Health Insurance,,,,N,Y,13532.86,2138.00
Long Island,Suffolk,5123000,000885,Brookhaven Memorial Hospital Medical Center Inc,50 to 69,117,M,White,Not Span/Hispanic,3,Emergency,Home or Self Care,2017,660,Alcohol-related disorders,088,ABDOMINAL PARACENTESIS,280,Alcoholic liver disease,07,Diseases and Disorders of the Hepatobiliary System and Pancreas,3,Major,Moderate,Medical,Medicare,Medicare,Medicaid,,N,Y,50467.07,5315.87
Long Island,Suffolk,5123000,000885,Brookhaven Memorial Hospital Medical Center Inc,50 to 69,119,M,White,Not Span/Hispanic,3,Emergency,Home w/ Home Health Services,2017,660,Alcohol-related disorders,222,BLOOD TRANSFUSION,280,Alcoholic liver disease,07,Diseases and Disorders of the Hepatobiliary System and Pancreas,3,Major,Extreme,Medical,Medicare,Medicare,Private Health Insurance,,N,Y,48211.11,6995.77
Long Island,Suffolk,5123000,000885,Brookhaven Memorial Hospital Medical Center Inc,50 to 69,119,M,White,Not Span/Hispanic,2,Emergency,Home or Self Care,2017,660,Alcohol-related disorders,088,ABDOMINAL PARACENTESIS,280,Alcoholic liver disease,07,Diseases and Disorders of the Hepatobiliary System and Pancreas,3,Major,Major,Medical,Medicare,Medicare,Private Health Insurance,,N,Y,20294.49,3798.58
Long Island,Suffolk,5123000,000885,Brookhaven Memorial Hospital Medical Center Inc,50 to 69,119,F,White,Not Span/Hispanic,3,Emergency,Short-term Hospital,2017,660,Alcohol-related disorders,000,NO PROC,280,Alcoholic liver disease,07,Diseases and Disorders of the Hepatobiliary System and Pancreas,3,Major,Moderate,Medical,Medicare,,,,N,Y,60517.18,7809.35
Long Island,Suffolk,5123000,000885,Brookhaven Memorial Hospital Medical Center Inc,30 to 49,117,M,Other Race,Not Span/Hispanic,5,Emergency,Home or Self Care,2017,660,Alcohol-related disorders,070,UP GASTRO ENDOSC/BIOPSY,280,Alcoholic liver disease,07,Diseases and Disorders of the Hepatobiliary System and Pancreas,3,Major,Major,Medical,Medicaid,,,,N,Y,70471.11,14601.10
Long Island,Suffolk,5123000,000885,Brookhaven Memorial Hospital Medical Center Inc,50 to 69,117,M,White,Not Span/Hispanic,3,Emergency,Skilled Nursing Home,2017,660,Alcohol-related disorders,000,NO PROC,280,Alcoholic liver disease,07,Diseases and Disorders of the Hepatobiliary System and Pancreas,3,Major,Moderate,Medical,Medicare,Medicare,Private Health Insurance,,N,Y,33747.69,5030.75
Long Island,Suffolk,5123000,000885,Brookhaven Memorial Hospital Medical Center Inc,30 to 49,117,M,Black/African American,Not Span/Hispanic,9,Emergency,Home or Self Care,2017,660,Alcohol-related disorders,047,DX CARDIAC CATHETERIZTN,280,Alcoholic liver disease,07,Diseases and Disorders of the Hepatobiliary System and Pancreas,3,Major,Major,Medical,Private Health Insurance,,,,N,Y,94219.76,17555.11
Long Island,Suffolk,5123000,000885,Brookhaven Memorial Hospital Medical Center Inc,50 to 69,117,M,White,Not Span/Hispanic,1,Emergency,Home or Self Care,2017,660,Alcohol-related disorders,000,NO PROC,280,Alcoholic liver disease,07,Diseases and Disorders of the Hepatobiliary System and Pancreas,2,Moderate,Moderate,Medical,Medicare,Medicare,Medicaid,,N,Y,13657.09,2243.02
Long Island,Suffolk,5123000,000885,Brookhaven Memorial Hospital Medical Center Inc,50 to 69,117,M,White,Not Span/Hispanic,4,Emergency,Home or Self Care,2017,660,Alcohol-related disorders,070,UP GASTRO ENDOSC/BIOPSY,280,Alcoholic liver disease,07,Diseases and Disorders of the Hepatobiliary System and Pancreas,3,Major,Moderate,Medical,Private Health Insurance,,,,N,Y,61071.74,8801.02
Long Island,Suffolk,5123000,000885,Brookhaven Memorial Hospital Medical Center Inc,50 to 69,117,M,White,Not Span/Hispanic,2,Emergency,Home or Self Care,2017,660,Alcohol-related disorders,088,ABDOMINAL PARACENTESIS,280,Alcoholic liver disease,07,Diseases and Disorders of the Hepatobiliary System and Pancreas,2,Moderate,Moderate,Medical,Medicare,Medicare,Medicaid,,N,Y,26612.84,3928.03
Long Island,Suffolk,5123000,000885,Brookhaven Memorial Hospital Medical Center Inc,30 to 49,117,F,Other Race,Not Span/Hispanic,4,Emergency,Home or Self Care,2017,660,Alcohol-related disorders,219,ALCO/DRUG REHAB/DETOX,280,Alcoholic liver disease,07,Diseases and Disorders of the Hepatobiliary System and Pancreas,3,Major,Moderate,Medical,Private Health Insurance,Medicaid,,,N,Y,50976.26,6976.24
Long Island,Suffolk,5123000,000885,Brookhaven Memorial Hospital Medical Center Inc,50 to 69,117,F,Black/African American,Not Span/Hispanic,2,Emergency,Home or Self Care,2017,660,Alcohol-related disorders,000,NO PROC,280,Alcoholic liver disease,07,Diseases and Disorders of the Hepatobiliary System and Pancreas,2,Moderate,Moderate,Medical,Medicare,Private Health Insurance,,,N,Y,21695.57,3371.52
Long Island,Suffolk,5123000,000885,Brookhaven Memorial Hospital Medical Center Inc,18 to 29,117,M,Other Race,Not Span/Hispanic,4,Emergency,Home or Self Care,2017,660,Alcohol-related disorders,219,ALCO/DRUG REHAB/DETOX,280,Alcoholic liver disease,07,Diseases and Disorders of the Hepatobiliary System and Pancreas,3,Major,Minor,Medical,Blue Cross/Blue Shield,,,,N,Y,64778.68,7168.62
Long Island,Suffolk,5123000,000885,Brookhaven Memorial Hospital Medical Center Inc,50 to 69,117,M,White,Not Span/Hispanic,8,Emergency,Skilled Nursing Home,2017,660,Alcohol-related disorders,088,ABDOMINAL PARACENTESIS,280,Alcoholic liver disease,07,Diseases and Disorders of the Hepatobiliary System and Pancreas,3,Major,Moderate,Medical,Medicare,Medicare,Private Health Insurance,,N,Y,56485.15,10319.48
Long Island,Suffolk,5123000,000885,Brookhaven Memorial Hospital Medical Center Inc,50 to 69,117,M,White,Not Span/Hispanic,15,Emergency,Federal Health Care Facility,2017,660,Alcohol-related disorders,088,ABDOMINAL PARACENTESIS,280,Alcoholic liver disease,07,Diseases and Disorders of the Hepatobiliary System and Pancreas,3,Major,Major,Medical,Private Health Insurance,,,,N,Y,141569.66,23005.79
Long Island,Suffolk,5123000,000885,Brookhaven Memorial Hospital Medical Center Inc,50 to 69,117,M,White,Not Span/Hispanic,9,Emergency,Expired,2017,660,Alcohol-related disorders,219,ALCO/DRUG REHAB/DETOX,280,Alcoholic liver disease,07,Diseases and Disorders of the Hepatobiliary System and Pancreas,3,Major,Extreme,Medical,Private Health Insurance,Medicaid,,,N,Y,98886.97,14875.61
Long Island,Suffolk,5123000,000885,Brookhaven Memorial Hospital Medical Center Inc,50 to 69,117,M,White,Not Span/Hispanic,5,Emergency,Home or Self Care,2017,660,Alcohol-related disorders,219,ALCO/DRUG REHAB/DETOX,280,Alcoholic liver disease,07,Diseases and Disorders of the Hepatobiliary System and Pancreas,2,Moderate,Moderate,Medical,Blue Cross/Blue Shield,,,,N,Y,52805.49,7640.46
Long Island,Suffolk,5123000,000885,Brookhaven Memorial Hospital Medical Center Inc,50 to 69,117,F,White,Not Span/Hispanic,2,Emergency,Home or Self Care,2017,660,Alcohol-related disorders,222,BLOOD TRANSFUSION,280,Alcoholic liver disease,07,Diseases and Disorders of the Hepatobiliary System and Pancreas,2,Moderate,Moderate,Medical,Medicare,Medicare,Private Health Insurance,,N,Y,28545.74,6066.23
Long Island,Suffolk,5123000,000885,Brookhaven Memorial Hospital Medical Center Inc,50 to 69,117,M,White,Not Span/Hispanic,13,Emergency,Skilled Nursing Home,2017,660,Alcohol-related disorders,088,ABDOMINAL PARACENTESIS,280,Alcoholic liver disease,07,Diseases and Disorders of the Hepatobiliary System and Pancreas,3,Major,Moderate,Medical,Medicare,Medicare,,,N,Y,73481.94,16871.28
