Hospital Service Area,Hospital County,Operating Certificate Number,Permanent Facility Id,Facility Name,Age Group,Zip Code - 3 digits,Gender,Race,Ethnicity,Length of Stay,Type of Admission,Patient Disposition,Discharge Year,CCS Diagnosis Code,CCS Diagnosis Description,CCS Procedure Code,CCS Procedure Description,APR DRG Code,APR DRG Description,APR MDC Code,APR MDC Description,APR Severity of Illness Code,APR Severity of Illness Description,APR Risk of Mortality,APR Medical Surgical Description,Payment Typology 1,Payment Typology 2,Payment Typology 3,Birth Weight,Abortion Edit Indicator,Emergency Department Indicator,Total Charges,Total Costs
New York City,Kings,7002053,001304,NYU Langone Hospital-Brooklyn,50 to 69,112,M,Other Race,Not Span/Hispanic,5,Emergency,Home or Self Care,2019,DIG018,HEPATIC FAILURE,,,280,ALCOHOLIC LIVER DISEASE,07,DISEASES AND DISORDERS OF THE HEPATOBILIARY SYSTEM AND PANCREAS,3,Major,Major,Medical,Medicare,Blue Cross/Blue Shield,,,,true,62032.76,22823.52
New York City,Kings,7002053,001304,NYU Langone Hospital-Brooklyn,30 to 49,112,F,Black/African American,Not Span/Hispanic,4,Emergency,Home or Self Care,2019,INF007,HEPATITIS,,,280,ALCOHOLIC LIVER DISEASE,07,DISEASES AND DISORDERS OF THE HEPATOBILIARY SYSTEM AND PANCREAS,3,Major,Moderate,Medical,Medicaid,,,,,true,58233.47,16940.49
New York City,Kings,7002053,001304,NYU Langone Hospital-Brooklyn,30 to 49,112,F,White,Unknown,1,Emergency,Home or Self Care,2019,INF007,HEPATITIS,,,280,ALCOHOLIC LIVER DISEASE,07,DISEASES AND DISORDERS OF THE HEPATOBILIARY SYSTEM AND PANCREAS,3,Major,Major,Medical,Medicaid,,,,,true,34828.44,7354.27
New York City,Kings,7002053,001304,NYU Langone Hospital-Brooklyn,30 to 49,112,M,Other Race,Spanish/Hispanic,17,Emergency,Home or Self Care,2019,DIG019,OTHER SPECIFIED AND UNSPECIFIED LIVER DISEASE,GIS013,PROCTECTOMY OR ANAL RESECTION,280,ALCOHOLIC LIVER DISEASE,07,DISEASES AND DISORDERS OF THE HEPATOBILIARY SYSTEM AND PANCREAS,3,Major,Major,Medical,Medicaid,,,,,true,216906.52,67709.84
New York City,Kings,7002053,001304,NYU Langone Hospital-Brooklyn,30 to 49,OOS,M,Other Race,Spanish/Hispanic,2,Emergency,Home or Self Care,2019,INF007,HEPATITIS,GIS006,PARACENTESIS,280,ALCOHOLIC LIVER DISEASE,07,DISEASES AND DISORDERS OF THE HEPATOBILIARY SYSTEM AND PANCREAS,3,Major,Moderate,Medical,Private Health Insurance,,,,,true,46809.84,10931.02
New York City,Kings,7002053,001304,NYU Langone Hospital-Brooklyn,30 to 49,112,M,Other Race,Spanish/Hispanic,15,Emergency,Hospice - Medical Facility,2019,DIG019,OTHER SPECIFIED AND UNSPECIFIED LIVER DISEASE,RES005,CHEST TUBE PLACEMENT AND THERAPEUTIC THORACENTESIS,280,ALCOHOLIC LIVER DISEASE,07,DISEASES AND DISORDERS OF THE HEPATOBILIARY SYSTEM AND PANCREAS,4,Extreme,Extreme,Medical,Medicaid,,,,,true,207407.9,64821.98
New York City,Kings,7002053,001304,NYU Langone Hospital-Brooklyn,30 to 49,112,F,Other Race,Not Span/Hispanic,4,Emergency,Home or Self Care,2019,INF007,HEPATITIS,SUD002,PHARMACOTHERAPY FOR SUBSTANCE USE,280,ALCOHOLIC LIVER DISEASE,07,DISEASES AND DISORDERS OF THE HEPATOBILIARY SYSTEM AND PANCREAS,2,Moderate,Minor,Medical,Medicare,Medicaid,,,,true,86365.16,23621.97
New York City,Kings,7002053,001304,NYU Langone Hospital-Brooklyn,50 to 69,112,M,Other Race,Spanish/Hispanic,4,Emergency,Hospice - Medical Facility,2019,DIG019,OTHER SPECIFIED AND UNSPECIFIED LIVER DISEASE,GIS027,"UPPER GI THERAPEUTIC PROCEDURES, NEC (ENDOSCOPIC)",280,ALCOHOLIC LIVER DISEASE,07,DISEASES AND DISORDERS OF THE HEPATOBILIARY SYSTEM AND PANCREAS,4,Extreme,Extreme,Medical,Medicaid,,,,,true,107384.07,26683.73
New York City,Kings,7002053,001304,NYU Langone Hospital-Brooklyn,30 to 49,112,M,Other Race,Spanish/Hispanic,12,Emergency,Left Against Medical Advice,2019,DIG019,OTHER SPECIFIED AND UNSPECIFIED LIVER DISEASE,GIS027,"UPPER GI THERAPEUTIC PROCEDURES, NEC (ENDOSCOPIC)",280,ALCOHOLIC LIVER DISEASE,07,DISEASES AND DISORDERS OF THE HEPATOBILIARY SYSTEM AND PANCREAS,3,Major,Major,Medical,Medicaid,,,,,true,290047.04,72453.04
New York City,Kings,7002053,001304,NYU Langone Hospital-Brooklyn,30 to 49,112,M,Other Race,Spanish/Hispanic,2,Emergency,Home or Self Care,2019,INF007,HEPATITIS,,,280,ALCOHOLIC LIVER DISEASE,07,DISEASES AND DISORDERS OF THE HEPATOBILIARY SYSTEM AND PANCREAS,2,Moderate,Minor,Medical,Medicaid,,,,,true,25086.9,8137.23
New York City,Kings,7002053,001304,NYU Langone Hospital-Brooklyn,50 to 69,112,M,White,Not Span/Hispanic,4,Emergency,Skilled Nursing Home,2019,DIG019,OTHER SPECIFIED AND UNSPECIFIED LIVER DISEASE,GIS006,PARACENTESIS,280,ALCOHOLIC LIVER DISEASE,07,DISEASES AND DISORDERS OF THE HEPATOBILIARY SYSTEM AND PANCREAS,3,Major,Moderate,Medical,Medicaid,,,,,true,84447.61,27892.17
New York City,Kings,7002053,001304,NYU Langone Hospital-Brooklyn,30 to 49,112,M,White,Not Span/Hispanic,3,Emergency,Home or Self Care,2019,INF007,HEPATITIS,SUD001,SUBSTANCE USE DETOXIFICATION,280,ALCOHOLIC LIVER DISEASE,07,DISEASES AND DISORDERS OF THE HEPATOBILIARY SYSTEM AND PANCREAS,3,Major,Moderate,Medical,Medicare,,,,,true,40103.38,11815.84
New York City,Kings,7002053,001304,NYU Langone Hospital-Brooklyn,50 to 69,112,M,Other Race,Spanish/Hispanic,5,Emergency,Home or Self Care,2019,DIG018,HEPATIC FAILURE,GIS004,GI SYSTEM ENDOSCOPY WITHOUT BIOPSY (DIAGNOSTIC),280,ALCOHOLIC LIVER DISEASE,07,DISEASES AND DISORDERS OF THE HEPATOBILIARY SYSTEM AND PANCREAS,4,Extreme,Major,Medical,Medicaid,,,,,true,76402.54,22956.45
New York City,Kings,7002053,001304,NYU Langone Hospital-Brooklyn,50 to 69,112,M,Other Race,Not Span/Hispanic,5,Emergency,Home or Self Care,2019,DIG018,HEPATIC FAILURE,,,280,ALCOHOLIC LIVER DISEASE,07,DISEASES AND DISORDERS OF THE HEPATOBILIARY SYSTEM AND PANCREAS,2,Moderate,Moderate,Medical,Medicare,Blue Cross/Blue Shield,,,,true,61271.41,18836.62
New York City,Kings,7002053,001304,NYU Langone Hospital-Brooklyn,30 to 49,112,M,White,Spanish/Hispanic,4,Emergency,Home or Self Care,2019,INF007,HEPATITIS,,,280,ALCOHOLIC LIVER DISEASE,07,DISEASES AND DISORDERS OF THE HEPATOBILIARY SYSTEM AND PANCREAS,3,Major,Minor,Medical,Medicaid,,,,,true,56575.4,16287.34
New York City,Kings,7002053,001304,NYU Langone Hospital-Brooklyn,30 to 49,112,M,Multi-racial,Spanish/Hispanic,3,Emergency,Home or Self Care,2019,DIG018,HEPATIC FAILURE,,,280,ALCOHOLIC LIVER DISEASE,07,DISEASES AND DISORDERS OF THE HEPATOBILIARY SYSTEM AND PANCREAS,3,Major,Moderate,Medical,Medicaid,,,,,true,38243.63,12373.24
New York City,Kings,7002053,001304,NYU Langone Hospital-Brooklyn,70 or Older,112,M,Other Race,Spanish/Hispanic,3,Emergency,Expired,2019,DIG018,HEPATIC FAILURE,GIS006,PARACENTESIS,280,ALCOHOLIC LIVER DISEASE,07,DISEASES AND DISORDERS OF THE HEPATOBILIARY SYSTEM AND PANCREAS,4,Extreme,Major,Medical,Medicare,Medicare,,,,true,65095.45,15764.82
New York City,Kings,7002053,001304,NYU Langone Hospital-Brooklyn,18 to 29,112,M,Other Race,Not Span/Hispanic,4,Emergency,Home or Self Care,2019,INF007,HEPATITIS,,,280,ALCOHOLIC LIVER DISEASE,07,DISEASES AND DISORDERS OF THE HEPATOBILIARY SYSTEM AND PANCREAS,3,Major,Moderate,Medical,Medicaid,,,,,true,62308.38,17287.26
New York City,Kings,7002053,001304,NYU Langone Hospital-Brooklyn,30 to 49,114,M,Other Race,Not Span/Hispanic,1,Emergency,Left Against Medical Advice,2019,DIG019,OTHER SPECIFIED AND UNSPECIFIED LIVER DISEASE,GIS006,PARACENTESIS,280,ALCOHOLIC LIVER DISEASE,07,DISEASES AND DISORDERS OF THE HEPATOBILIARY SYSTEM AND PANCREAS,3,Major,Major,Medical,Medicare,Medicaid,,,,true,16657.85,4777.83
New York City,Kings,7002053,001304,NYU Langone Hospital-Brooklyn,50 to 69,112,M,Other Race,Spanish/Hispanic,4,Emergency,Home or Self Care,2019,INF007,HEPATITIS,GIS006,PARACENTESIS,280,ALCOHOLIC LIVER DISEASE,07,DISEASES AND DISORDERS OF THE HEPATOBILIARY SYSTEM AND PANCREAS,3,Major,Major,Medical,Medicaid,,,,,true,108170.06,31493.09
New York City,Kings,7002053,001304,NYU Langone Hospital-Brooklyn,50 to 69,112,M,White,Not Span/Hispanic,7,Emergency,Left Against Medical Advice,2019,DIG019,OTHER SPECIFIED AND UNSPECIFIED LIVER DISEASE,GIS006,PARACENTESIS,280,ALCOHOLIC LIVER DISEASE,07,DISEASES AND DISORDERS OF THE HEPATOBILIARY SYSTEM AND PANCREAS,3,Major,Extreme,Medical,Medicare,Medicaid,,,,true,121995.5,34991.24
New York City,Kings,7002053,001304,NYU Langone Hospital-Brooklyn,30 to 49,112,M,Other Race,Spanish/Hispanic,3,Emergency,Home or Self Care,2019,DIG019,OTHER SPECIFIED AND UNSPECIFIED LIVER DISEASE,GIS006,PARACENTESIS,280,ALCOHOLIC LIVER DISEASE,07,DISEASES AND DISORDERS OF THE HEPATOBILIARY SYSTEM AND PANCREAS,3,Major,Major,Medical,Blue Cross/Blue Shield,,,,,true,48583.78,12842.27
New York City,Kings,7002053,001304,NYU Langone Hospital-Brooklyn,50 to 69,112,M,Other Race,Not Span/Hispanic,3,Emergency,Left Against Medical Advice,2019,DIG019,OTHER SPECIFIED AND UNSPECIFIED LIVER DISEASE,GIS006,PARACENTESIS,280,ALCOHOLIC LIVER DISEASE,07,DISEASES AND DISORDERS OF THE HEPATOBILIARY SYSTEM AND PANCREAS,4,Extreme,Major,Medical,Medicaid,,,,,true,105732.19,31565.78
New York City,Kings,7002053,001304,NYU Langone Hospital-Brooklyn,50 to 69,112,M,White,Not Span/Hispanic,5,Emergency,Left Against Medical Advice,2019,DIG019,OTHER SPECIFIED AND UNSPECIFIED LIVER DISEASE,GIS006,PARACENTESIS,280,ALCOHOLIC LIVER DISEASE,07,DISEASES AND DISORDERS OF THE HEPATOBILIARY SYSTEM AND PANCREAS,3,Major,Major,Medical,Medicaid,,,,,true,90241.92,23367.96
New York City,Kings,7002053,001304,NYU Langone Hospital-Brooklyn,50 to 69,112,M,White,Not Span/Hispanic,3,Emergency,Home or Self Care,2019,INF007,HEPATITIS,,,280,ALCOHOLIC LIVER DISEASE,07,DISEASES AND DISORDERS OF THE HEPATOBILIARY SYSTEM AND PANCREAS,1,Minor,Minor,Medical,Medicaid,,,,,true,45055.45,12197.43
New York City,Kings,7002053,001304,NYU Langone Hospital-Brooklyn,50 to 69,112,M,White,Not Span/Hispanic,1,Emergency,Short-term Hospital,2019,DIG019,OTHER SPECIFIED AND UNSPECIFIED LIVER DISEASE,GIS006,PARACENTESIS,280,ALCOHOLIC LIVER DISEASE,07,DISEASES AND DISORDERS OF THE HEPATOBILIARY SYSTEM AND PANCREAS,3,Major,Moderate,Medical,Blue Cross/Blue Shield,,,,,true,28299.1,6555.03
New York City,Kings,7002053,001304,NYU Langone Hospital-Brooklyn,30 to 49,112,M,White,Not Span/Hispanic,2,Emergency,Left Against Medical Advice,2019,INF007,HEPATITIS,ADM015,ADMINISTRATION OF ANTIBIOTICS,280,ALCOHOLIC LIVER DISEASE,07,DISEASES AND DISORDERS OF THE HEPATOBILIARY SYSTEM AND PANCREAS,3,Major,Moderate,Medical,Private Health Insurance,,,,,true,56247,18122.81
New York City,Kings,7002053,001304,NYU Langone Hospital-Brooklyn,50 to 69,112,M,White,Not Span/Hispanic,5,Emergency,Skilled Nursing Home,2019,DIG019,OTHER SPECIFIED AND UNSPECIFIED LIVER DISEASE,GIS006,PARACENTESIS,280,ALCOHOLIC LIVER DISEASE,07,DISEASES AND DISORDERS OF THE HEPATOBILIARY SYSTEM AND PANCREAS,4,Extreme,Extreme,Medical,Medicare,Medicaid,,,,true,82340.04,21025.05
New York City,Kings,7002053,001304,NYU Langone Hospital-Brooklyn,30 to 49,112,M,Other Race,Spanish/Hispanic,4,Emergency,Home or Self Care,2019,INF007,HEPATITIS,GIS004,GI SYSTEM ENDOSCOPY WITHOUT BIOPSY (DIAGNOSTIC),280,ALCOHOLIC LIVER DISEASE,07,DISEASES AND DISORDERS OF THE HEPATOBILIARY SYSTEM AND PANCREAS,3,Major,Major,Medical,Medicaid,,,,,true,83928.07,20226.53
New York City,Kings,7002053,001304,NYU Langone Hospital-Brooklyn,30 to 49,112,M,Black/African American,Not Span/Hispanic,3,Emergency,Home or Self Care,2019,DIG019,OTHER SPECIFIED AND UNSPECIFIED LIVER DISEASE,,,280,ALCOHOLIC LIVER DISEASE,07,DISEASES AND DISORDERS OF THE HEPATOBILIARY SYSTEM AND PANCREAS,2,Moderate,Moderate,Medical,Medicaid,,,,,true,39574.3,12177.15
New York City,Kings,7002053,001304,NYU Langone Hospital-Brooklyn,30 to 49,112,M,Other Race,Spanish/Hispanic,2,Emergency,Home or Self Care,2019,INF007,HEPATITIS,,,280,ALCOHOLIC LIVER DISEASE,07,DISEASES AND DISORDERS OF THE HEPATOBILIARY SYSTEM AND PANCREAS,3,Major,Moderate,Medical,Medicaid,,,,,true,41442.97,9311.37
New York City,Kings,7002053,001304,NYU Langone Hospital-Brooklyn,50 to 69,112,M,Other Race,Not Span/Hispanic,4,Emergency,Home or Self Care,2019,DIG019,OTHER SPECIFIED AND UNSPECIFIED LIVER DISEASE,GIS006,PARACENTESIS,280,ALCOHOLIC LIVER DISEASE,07,DISEASES AND DISORDERS OF THE HEPATOBILIARY SYSTEM AND PANCREAS,2,Moderate,Moderate,Medical,Medicaid,,,,,true,64160.51,17034.74
New York City,Kings,7002053,001304,NYU Langone Hospital-Brooklyn,30 to 49,112,M,Other Race,Spanish/Hispanic,10,Emergency,Home or Self Care,2019,INF007,HEPATITIS,,,280,ALCOHOLIC LIVER DISEASE,07,DISEASES AND DISORDERS OF THE HEPATOBILIARY SYSTEM AND PANCREAS,2,Moderate,Minor,Medical,Medicaid,,,,,true,108651.15,36531.29
New York City,Kings,7002053,001304,NYU Langone Hospital-Brooklyn,50 to 69,112,M,White,Spanish/Hispanic,3,Emergency,Home or Self Care,2019,INF007,HEPATITIS,,,280,ALCOHOLIC LIVER DISEASE,07,DISEASES AND DISORDERS OF THE HEPATOBILIARY SYSTEM AND PANCREAS,3,Major,Moderate,Medical,Medicaid,,,,,true,73776.82,14106.85
New York City,Kings,7002053,001304,NYU Langone Hospital-Brooklyn,50 to 69,100,M,Other Race,Not Span/Hispanic,4,Emergency,Left Against Medical Advice,2019,DIG019,OTHER SPECIFIED AND UNSPECIFIED LIVER DISEASE,,,280,ALCOHOLIC LIVER DISEASE,07,DISEASES AND DISORDERS OF THE HEPATOBILIARY SYSTEM AND PANCREAS,3,Major,Moderate,Medical,Medicaid,,,,,true,53187.23,15872.05
New York City,Kings,7002053,001304,NYU Langone Hospital-Brooklyn,50 to 69,112,F,White,Not Span/Hispanic,7,Emergency,Skilled Nursing Home,2019,INF007,HEPATITIS,GIS004,GI SYSTEM ENDOSCOPY WITHOUT BIOPSY (DIAGNOSTIC),280,ALCOHOLIC LIVER DISEASE,07,DISEASES AND DISORDERS OF THE HEPATOBILIARY SYSTEM AND PANCREAS,4,Extreme,Major,Medical,Medicare,Blue Cross/Blue Shield,,,,true,102433.69,29495.8
New York City,Kings,7002053,001304,NYU Langone Hospital-Brooklyn,30 to 49,112,M,Other Race,Spanish/Hispanic,7,Emergency,Home or Self Care,2019,INF007,HEPATITIS,,,280,ALCOHOLIC LIVER DISEASE,07,DISEASES AND DISORDERS OF THE HEPATOBILIARY SYSTEM AND PANCREAS,3,Major,Major,Medical,Medicaid,,,,,true,130188.62,29239.32
New York City,Kings,7002053,001304,NYU Langone Hospital-Brooklyn,70 or Older,112,M,Black/African American,Not Span/Hispanic,3,Emergency,Home w/ Home Health Services,2019,DIG019,OTHER SPECIFIED AND UNSPECIFIED LIVER DISEASE,,,280,ALCOHOLIC LIVER DISEASE,07,DISEASES AND DISORDERS OF THE HEPATOBILIARY SYSTEM AND PANCREAS,3,Major,Major,Medical,Medicare,,,,,true,51568.27,13492.97
New York City,Kings,7002053,001304,NYU Langone Hospital-Brooklyn,30 to 49,115,M,Other Race,Not Span/Hispanic,1,Emergency,Home or Self Care,2019,INF007,HEPATITIS,,,280,ALCOHOLIC LIVER DISEASE,07,DISEASES AND DISORDERS OF THE HEPATOBILIARY SYSTEM AND PANCREAS,3,Major,Major,Medical,Medicaid,,,,,true,28001.31,6441.51
New York City,Kings,7002053,001304,NYU Langone Hospital-Brooklyn,30 to 49,112,M,White,Spanish/Hispanic,4,Emergency,Home or Self Care,2019,DIG019,OTHER SPECIFIED AND UNSPECIFIED LIVER DISEASE,,,280,ALCOHOLIC LIVER DISEASE,07,DISEASES AND DISORDERS OF THE HEPATOBILIARY SYSTEM AND PANCREAS,3,Major,Moderate,Medical,Medicaid,,,,,true,59578.54,15756.53
New York City,Kings,7002053,001304,NYU Langone Hospital-Brooklyn,30 to 49,112,M,Other Race,Spanish/Hispanic,7,Emergency,Home or Self Care,2019,DIG019,OTHER SPECIFIED AND UNSPECIFIED LIVER DISEASE,GIS006,PARACENTESIS,280,ALCOHOLIC LIVER DISEASE,07,DISEASES AND DISORDERS OF THE HEPATOBILIARY SYSTEM AND PANCREAS,2,Moderate,Moderate,Medical,Medicaid,,,,,true,109391.9,25804.26
New York City,Kings,7002053,001304,NYU Langone Hospital-Brooklyn,30 to 49,112,M,Other Race,Spanish/Hispanic,1,Emergency,Home or Self Care,2019,INF007,HEPATITIS,ADM015,ADMINISTRATION OF ANTIBIOTICS,280,ALCOHOLIC LIVER DISEASE,07,DISEASES AND DISORDERS OF THE HEPATOBILIARY SYSTEM AND PANCREAS,2,Moderate,Minor,Medical,Blue Cross/Blue Shield,,,,,true,21130.48,5326.37
New York City,Kings,7002053,001304,NYU Langone Hospital-Brooklyn,70 or Older,112,F,White,Unknown,6,Emergency,Skilled Nursing Home,2019,DIG019,OTHER SPECIFIED AND UNSPECIFIED LIVER DISEASE,,,280,ALCOHOLIC LIVER DISEASE,07,DISEASES AND DISORDERS OF THE HEPATOBILIARY SYSTEM AND PANCREAS,3,Major,Major,Medical,Medicare,Blue Cross/Blue Shield,,,,true,80075.02,24199.86
New York City,Kings,7002053,001304,NYU Langone Hospital-Brooklyn,70 or Older,112,M,Other Race,Spanish/Hispanic,7,Emergency,Home or Self Care,2019,DIG019,OTHER SPECIFIED AND UNSPECIFIED LIVER DISEASE,GIS006,PARACENTESIS,280,ALCOHOLIC LIVER DISEASE,07,DISEASES AND DISORDERS OF THE HEPATOBILIARY SYSTEM AND PANCREAS,4,Extreme,Extreme,Medical,Medicare,,,,,true,112868.19,31589.84
New York City,Kings,7002053,001304,NYU Langone Hospital-Brooklyn,30 to 49,112,M,Other Race,Spanish/Hispanic,4,Emergency,Home or Self Care,2019,DIG019,OTHER SPECIFIED AND UNSPECIFIED LIVER DISEASE,GIS027,"UPPER GI THERAPEUTIC PROCEDURES, NEC (ENDOSCOPIC)",280,ALCOHOLIC LIVER DISEASE,07,DISEASES AND DISORDERS OF THE HEPATOBILIARY SYSTEM AND PANCREAS,3,Major,Major,Medical,Medicaid,,,,,true,112962.09,26933.84
New York City,Kings,7002053,001304,NYU Langone Hospital-Brooklyn,50 to 69,112,M,Other Race,Spanish/Hispanic,7,Emergency,Home or Self Care,2019,DIG019,OTHER SPECIFIED AND UNSPECIFIED LIVER DISEASE,,,280,ALCOHOLIC LIVER DISEASE,07,DISEASES AND DISORDERS OF THE HEPATOBILIARY SYSTEM AND PANCREAS,4,Extreme,Major,Medical,Medicaid,,,,,true,107856.48,29209.16
New York City,Kings,7002053,001304,NYU Langone Hospital-Brooklyn,30 to 49,112,M,Other Race,Spanish/Hispanic,7,Emergency,Home or Self Care,2019,DIG019,OTHER SPECIFIED AND UNSPECIFIED LIVER DISEASE,ADM001,TRANSFUSION OF BLOOD AND BLOOD PRODUCTS,280,ALCOHOLIC LIVER DISEASE,07,DISEASES AND DISORDERS OF THE HEPATOBILIARY SYSTEM AND PANCREAS,3,Major,Major,Medical,Medicaid,,,,,true,113411.82,30643.45
New York City,Kings,7002053,001304,NYU Langone Hospital-Brooklyn,30 to 49,112,M,White,Spanish/Hispanic,2,Emergency,Home or Self Care,2019,DIG019,OTHER SPECIFIED AND UNSPECIFIED LIVER DISEASE,ADM001,TRANSFUSION OF BLOOD AND BLOOD PRODUCTS,280,ALCOHOLIC LIVER DISEASE,07,DISEASES AND DISORDERS OF THE HEPATOBILIARY SYSTEM AND PANCREAS,3,Major,Moderate,Medical,Medicaid,,,,,true,67964.02,17536.47
New York City,Kings,7002053,001304,NYU Langone Hospital-Brooklyn,50 to 69,112,M,Other Race,Spanish/Hispanic,8,Emergency,Home or Self Care,2019,DIG018,HEPATIC FAILURE,SUD001,SUBSTANCE USE DETOXIFICATION,280,ALCOHOLIC LIVER DISEASE,07,DISEASES AND DISORDERS OF THE HEPATOBILIARY SYSTEM AND PANCREAS,2,Moderate,Moderate,Medical,Private Health Insurance,Medicaid,,,,true,83293.28,29075.54
New York City,Kings,7002053,001304,NYU Langone Hospital-Brooklyn,50 to 69,112,M,Other Race,Spanish/Hispanic,6,Emergency,Home w/ Home Health Services,2019,DIG019,OTHER SPECIFIED AND UNSPECIFIED LIVER DISEASE,GIS027,"UPPER GI THERAPEUTIC PROCEDURES, NEC (ENDOSCOPIC)",280,ALCOHOLIC LIVER DISEASE,07,DISEASES AND DISORDERS OF THE HEPATOBILIARY SYSTEM AND PANCREAS,3,Major,Major,Medical,Self-Pay,,,,,true,133808.61,27691.65
New York City,Kings,7002053,001304,NYU Langone Hospital-Brooklyn,30 to 49,112,M,Other Race,Spanish/Hispanic,4,Emergency,Home or Self Care,2019,DIG019,OTHER SPECIFIED AND UNSPECIFIED LIVER DISEASE,GIS001,ESOPHAGOGASTRODUODENOSCOPY (EGD) WITH BIOPSY,280,ALCOHOLIC LIVER DISEASE,07,DISEASES AND DISORDERS OF THE HEPATOBILIARY SYSTEM AND PANCREAS,3,Major,Major,Medical,Medicaid,,,,,true,109902.2,23166.89
New York City,Kings,7002053,001304,NYU Langone Hospital-Brooklyn,30 to 49,112,M,Other Race,Spanish/Hispanic,3,Emergency,Left Against Medical Advice,2019,INF007,HEPATITIS,,,280,ALCOHOLIC LIVER DISEASE,07,DISEASES AND DISORDERS OF THE HEPATOBILIARY SYSTEM AND PANCREAS,2,Moderate,Moderate,Medical,Medicaid,,,,,true,37654.03,12266.74
New York City,Kings,7002053,001304,NYU Langone Hospital-Brooklyn,50 to 69,112,M,Other Race,Not Span/Hispanic,2,Emergency,Home or Self Care,2019,INF007,HEPATITIS,,,280,ALCOHOLIC LIVER DISEASE,07,DISEASES AND DISORDERS OF THE HEPATOBILIARY SYSTEM AND PANCREAS,2,Moderate,Moderate,Medical,Private Health Insurance,,,,,true,25377.83,8234.49
New York City,Kings,7002053,001304,NYU Langone Hospital-Brooklyn,50 to 69,112,F,White,Not Span/Hispanic,4,Emergency,Home or Self Care,2019,DIG019,OTHER SPECIFIED AND UNSPECIFIED LIVER DISEASE,GIS027,"UPPER GI THERAPEUTIC PROCEDURES, NEC (ENDOSCOPIC)",280,ALCOHOLIC LIVER DISEASE,07,DISEASES AND DISORDERS OF THE HEPATOBILIARY SYSTEM AND PANCREAS,3,Major,Moderate,Medical,Medicaid,,,,,true,121542.24,28432.14
New York City,Kings,7002053,001304,NYU Langone Hospital-Brooklyn,30 to 49,112,M,White,Not Span/Hispanic,6,Emergency,Home or Self Care,2019,DIG018,HEPATIC FAILURE,ADM021,"ADMINISTRATION OF THERAPEUTIC SUBSTANCES, NEC",280,ALCOHOLIC LIVER DISEASE,07,DISEASES AND DISORDERS OF THE HEPATOBILIARY SYSTEM AND PANCREAS,3,Major,Major,Medical,Private Health Insurance,,,,,true,103268.99,35600.81
New York City,Kings,7002053,001304,NYU Langone Hospital-Brooklyn,30 to 49,112,M,Other Race,Spanish/Hispanic,5,Emergency,Home or Self Care,2019,INF007,HEPATITIS,GIS006,PARACENTESIS,280,ALCOHOLIC LIVER DISEASE,07,DISEASES AND DISORDERS OF THE HEPATOBILIARY SYSTEM AND PANCREAS,2,Moderate,Moderate,Medical,Medicaid,,,,,true,74906.7,20785.11
New York City,Kings,7002053,001304,NYU Langone Hospital-Brooklyn,30 to 49,112,M,Other Race,Spanish/Hispanic,1,Emergency,Home or Self Care,2019,DIG018,HEPATIC FAILURE,,,280,ALCOHOLIC LIVER DISEASE,07,DISEASES AND DISORDERS OF THE HEPATOBILIARY SYSTEM AND PANCREAS,3,Major,Moderate,Medical,Medicaid,,,,,true,19071.08,5290.62
New York City,Kings,7002053,001304,NYU Langone Hospital-Brooklyn,50 to 69,,M,White,Spanish/Hispanic,2,Emergency,Home or Self Care,2019,DIG019,OTHER SPECIFIED AND UNSPECIFIED LIVER DISEASE,GIS006,PARACENTESIS,280,ALCOHOLIC LIVER DISEASE,07,DISEASES AND DISORDERS OF THE HEPATOBILIARY SYSTEM AND PANCREAS,3,Major,Moderate,Medical,Medicare,,,,,true,47060.64,10248.45
New York City,Kings,7002053,001304,NYU Langone Hospital-Brooklyn,50 to 69,112,M,White,Not Span/Hispanic,3,Emergency,Home or Self Care,2019,INF007,HEPATITIS,,,280,ALCOHOLIC LIVER DISEASE,07,DISEASES AND DISORDERS OF THE HEPATOBILIARY SYSTEM AND PANCREAS,2,Moderate,Moderate,Medical,Medicare,,,,,true,38860.21,12107.39
New York City,Kings,7002053,001304,NYU Langone Hospital-Brooklyn,50 to 69,112,M,Black/African American,Not Span/Hispanic,13,Emergency,Home w/ Home Health Services,2019,DIG019,OTHER SPECIFIED AND UNSPECIFIED LIVER DISEASE,GIS006,PARACENTESIS,280,ALCOHOLIC LIVER DISEASE,07,DISEASES AND DISORDERS OF THE HEPATOBILIARY SYSTEM AND PANCREAS,3,Major,Major,Medical,Medicaid,,,,,true,202540.81,53136.63
New York City,Kings,7002053,001304,NYU Langone Hospital-Brooklyn,30 to 49,112,M,Other Race,Not Span/Hispanic,4,Emergency,Home or Self Care,2019,DIG019,OTHER SPECIFIED AND UNSPECIFIED LIVER DISEASE,ADM001,TRANSFUSION OF BLOOD AND BLOOD PRODUCTS,280,ALCOHOLIC LIVER DISEASE,07,DISEASES AND DISORDERS OF THE HEPATOBILIARY SYSTEM AND PANCREAS,3,Major,Moderate,Medical,Medicaid,,,,,true,58725.09,16158.7
New York City,Kings,7002053,001304,NYU Langone Hospital-Brooklyn,30 to 49,112,M,Other Race,Spanish/Hispanic,3,Emergency,Home or Self Care,2019,DIG019,OTHER SPECIFIED AND UNSPECIFIED LIVER DISEASE,,,280,ALCOHOLIC LIVER DISEASE,07,DISEASES AND DISORDERS OF THE HEPATOBILIARY SYSTEM AND PANCREAS,2,Moderate,Moderate,Medical,Medicaid,,,,,true,48561.92,12899.72
New York City,Kings,7002053,001304,NYU Langone Hospital-Brooklyn,30 to 49,112,M,Other Race,Spanish/Hispanic,6,Emergency,Home or Self Care,2019,DIG019,OTHER SPECIFIED AND UNSPECIFIED LIVER DISEASE,GIS006,PARACENTESIS,280,ALCOHOLIC LIVER DISEASE,07,DISEASES AND DISORDERS OF THE HEPATOBILIARY SYSTEM AND PANCREAS,3,Major,Moderate,Medical,Medicaid,,,,,true,72846.46,21929.32
New York City,Kings,7002053,001304,NYU Langone Hospital-Brooklyn,30 to 49,112,M,Other Race,Not Span/Hispanic,2,Emergency,Home or Self Care,2019,DIG019,OTHER SPECIFIED AND UNSPECIFIED LIVER DISEASE,GIS027,"UPPER GI THERAPEUTIC PROCEDURES, NEC (ENDOSCOPIC)",280,ALCOHOLIC LIVER DISEASE,07,DISEASES AND DISORDERS OF THE HEPATOBILIARY SYSTEM AND PANCREAS,3,Major,Major,Medical,Medicaid,,,,,true,58989.18,11856.78