Hospital Service Area,Hospital County,Operating Certificate Number,Permanent Facility Id,Facility Name,Age Group,Zip Code - 3 digits,Gender,Race,Ethnicity,Length of Stay,Type of Admission,Patient Disposition,Discharge Year,CCS Diagnosis Code,CCS Diagnosis Description,CCS Procedure Code,CCS Procedure Description,APR DRG Code,APR DRG Description,APR MDC Code,APR MDC Description,APR Severity of Illness Code,APR Severity of Illness Description,APR Risk of Mortality,APR Medical Surgical Description,Payment Typology 1,Payment Typology 2,Payment Typology 3,Birth Weight,Abortion Edit Indicator,Emergency Department Indicator,Total Charges,Total Costs
New York City,Manhattan,7002001,001438,Bellevue Hospital Center,30 to 49,104,M,Other Race,Spanish/Hispanic,4,Emergency,Home or Self Care,2019,DIG019,OTHER SPECIFIED AND UNSPECIFIED LIVER DISEASE,GIS006,PARACENTESIS,280,ALCOHOLIC LIVER DISEASE,07,DISEASES AND DISORDERS OF THE HEPATOBILIARY SYSTEM AND PANCREAS,3,Major,Moderate,Medical,Medicaid,,,,,true,31172.88,20717.5
New York City,Manhattan,7002001,001438,Bellevue Hospital Center,50 to 69,100,F,White,Not Span/Hispanic,22,Elective,Home or Self Care,2019,DIG019,OTHER SPECIFIED AND UNSPECIFIED LIVER DISEASE,ADM021,"ADMINISTRATION OF THERAPEUTIC SUBSTANCES, NEC",280,ALCOHOLIC LIVER DISEASE,07,DISEASES AND DISORDERS OF THE HEPATOBILIARY SYSTEM AND PANCREAS,3,Major,Moderate,Medical,Medicare,,,,,true,117766.8,78267.82
New York City,Manhattan,7002001,001438,Bellevue Hospital Center,50 to 69,114,M,Other Race,Spanish/Hispanic,7,Emergency,Home or Self Care,2019,DIG019,OTHER SPECIFIED AND UNSPECIFIED LIVER DISEASE,GIS006,PARACENTESIS,280,ALCOHOLIC LIVER DISEASE,07,DISEASES AND DISORDERS OF THE HEPATOBILIARY SYSTEM AND PANCREAS,3,Major,Major,Medical,Self-Pay,,,,,true,42028.91,27932.41
New York City,Manhattan,7002001,001438,Bellevue Hospital Center,30 to 49,100,M,Other Race,Not Span/Hispanic,14,Emergency,Skilled Nursing Home,2019,DIG019,OTHER SPECIFIED AND UNSPECIFIED LIVER DISEASE,GIS006,PARACENTESIS,280,ALCOHOLIC LIVER DISEASE,07,DISEASES AND DISORDERS OF THE HEPATOBILIARY SYSTEM AND PANCREAS,2,Moderate,Moderate,Medical,Medicaid,Medicaid,,,,true,74246.18,49344.01
New York City,Manhattan,7002001,001438,Bellevue Hospital Center,50 to 69,114,M,Black/African American,Not Span/Hispanic,34,Emergency,Skilled Nursing Home,2019,DIG019,OTHER SPECIFIED AND UNSPECIFIED LIVER DISEASE,GIS006,PARACENTESIS,280,ALCOHOLIC LIVER DISEASE,07,DISEASES AND DISORDERS OF THE HEPATOBILIARY SYSTEM AND PANCREAS,4,Extreme,Extreme,Medical,Private Health Insurance,Medicaid,,,,false,208062.05,138278.04
New York City,Manhattan,7002001,001438,Bellevue Hospital Center,50 to 69,113,M,Other Race,Not Span/Hispanic,2,Elective,Home or Self Care,2019,DIG019,OTHER SPECIFIED AND UNSPECIFIED LIVER DISEASE,GNR004,ENDOSCOPIC CONTROL OF BLEEDING,280,ALCOHOLIC LIVER DISEASE,07,DISEASES AND DISORDERS OF THE HEPATOBILIARY SYSTEM AND PANCREAS,3,Major,Moderate,Medical,Medicaid,,,,,false,12461.11,8281.65
New York City,Manhattan,7002001,001438,Bellevue Hospital Center,50 to 69,112,M,Other Race,Spanish/Hispanic,2,Emergency,Home or Self Care,2019,DIG019,OTHER SPECIFIED AND UNSPECIFIED LIVER DISEASE,IMG008,ULTRASONOGRAPHY,280,ALCOHOLIC LIVER DISEASE,07,DISEASES AND DISORDERS OF THE HEPATOBILIARY SYSTEM AND PANCREAS,3,Major,Major,Medical,Medicaid,Medicaid,,,,true,15224,10117.87
New York City,Manhattan,7002001,001438,Bellevue Hospital Center,50 to 69,100,M,Other Race,Spanish/Hispanic,22,Emergency,Home or Self Care,2019,DIG019,OTHER SPECIFIED AND UNSPECIFIED LIVER DISEASE,GIS006,PARACENTESIS,280,ALCOHOLIC LIVER DISEASE,07,DISEASES AND DISORDERS OF THE HEPATOBILIARY SYSTEM AND PANCREAS,3,Major,Moderate,Medical,Medicaid,Medicaid,,,,true,114504.71,76099.83
New York City,Manhattan,7002001,001438,Bellevue Hospital Center,50 to 69,111,M,Other Race,Spanish/Hispanic,1,Emergency,Home or Self Care,2019,DIG019,OTHER SPECIFIED AND UNSPECIFIED LIVER DISEASE,ADM015,ADMINISTRATION OF ANTIBIOTICS,280,ALCOHOLIC LIVER DISEASE,07,DISEASES AND DISORDERS OF THE HEPATOBILIARY SYSTEM AND PANCREAS,2,Moderate,Moderate,Medical,Medicaid,,,,,false,7262.01,4826.33
New York City,Manhattan,7002001,001438,Bellevue Hospital Center,30 to 49,100,M,Other Race,Not Span/Hispanic,9,Emergency,Home or Self Care,2019,DIG019,OTHER SPECIFIED AND UNSPECIFIED LIVER DISEASE,GIS006,PARACENTESIS,280,ALCOHOLIC LIVER DISEASE,07,DISEASES AND DISORDERS OF THE HEPATOBILIARY SYSTEM AND PANCREAS,3,Major,Moderate,Medical,Medicaid,Medicaid,,,,true,48852.87,32467.62
New York City,Manhattan,7002001,001438,Bellevue Hospital Center,30 to 49,112,M,Other Race,Spanish/Hispanic,6,Emergency,Home or Self Care,2019,INF007,HEPATITIS,GIS006,PARACENTESIS,280,ALCOHOLIC LIVER DISEASE,07,DISEASES AND DISORDERS OF THE HEPATOBILIARY SYSTEM AND PANCREAS,4,Extreme,Major,Medical,Medicaid,,,,,true,40665.12,27026.04
New York City,Manhattan,7002001,001438,Bellevue Hospital Center,30 to 49,114,M,Other Race,Not Span/Hispanic,4,Emergency,Home or Self Care,2019,DIG019,OTHER SPECIFIED AND UNSPECIFIED LIVER DISEASE,IMG008,ULTRASONOGRAPHY,280,ALCOHOLIC LIVER DISEASE,07,DISEASES AND DISORDERS OF THE HEPATOBILIARY SYSTEM AND PANCREAS,3,Major,Moderate,Medical,Medicaid,,,,,false,30556.42,20307.8
New York City,Manhattan,7002001,001438,Bellevue Hospital Center,18 to 29,100,M,White,Not Span/Hispanic,3,Emergency,Home or Self Care,2019,INF007,HEPATITIS,ADM017,ADMINISTRATION OF NUTRITIONAL AND ELECTROLYTIC SUBSTANCES,280,ALCOHOLIC LIVER DISEASE,07,DISEASES AND DISORDERS OF THE HEPATOBILIARY SYSTEM AND PANCREAS,2,Moderate,Minor,Medical,Private Health Insurance,,,,,true,23869.56,15863.71
New York City,Manhattan,7002001,001438,Bellevue Hospital Center,30 to 49,100,M,Other Race,Spanish/Hispanic,5,Emergency,Home or Self Care,2019,DIG019,OTHER SPECIFIED AND UNSPECIFIED LIVER DISEASE,GIS005,EXPLORATION OF PERITONEAL CAVITY,280,ALCOHOLIC LIVER DISEASE,07,DISEASES AND DISORDERS OF THE HEPATOBILIARY SYSTEM AND PANCREAS,3,Major,Moderate,Medical,Medicaid,,,,,true,30209.92,20077.51
New York City,Manhattan,7002001,001438,Bellevue Hospital Center,30 to 49,112,M,Other Race,Spanish/Hispanic,6,Emergency,Home or Self Care,2019,INF007,HEPATITIS,NCM002,TOMOGRAPHIC NUCLEAR MEDICINE IMAGING,280,ALCOHOLIC LIVER DISEASE,07,DISEASES AND DISORDERS OF THE HEPATOBILIARY SYSTEM AND PANCREAS,3,Major,Moderate,Medical,Medicaid,,,,,true,39857.41,26489.23
New York City,Manhattan,7002001,001438,Bellevue Hospital Center,30 to 49,,M,Other Race,Spanish/Hispanic,18,Emergency,Home or Self Care,2019,INF007,HEPATITIS,ADM021,"ADMINISTRATION OF THERAPEUTIC SUBSTANCES, NEC",280,ALCOHOLIC LIVER DISEASE,07,DISEASES AND DISORDERS OF THE HEPATOBILIARY SYSTEM AND PANCREAS,4,Extreme,Extreme,Medical,Medicaid,,,,,true,106587.63,70838.14
New York City,Manhattan,7002001,001438,Bellevue Hospital Center,70 or Older,112,M,Other Race,Spanish/Hispanic,31,Emergency,Home or Self Care,2019,DIG019,OTHER SPECIFIED AND UNSPECIFIED LIVER DISEASE,GIS006,PARACENTESIS,280,ALCOHOLIC LIVER DISEASE,07,DISEASES AND DISORDERS OF THE HEPATOBILIARY SYSTEM AND PANCREAS,3,Major,Extreme,Medical,Medicare,Medicare,Medicaid,,,true,164831.17,109546.8
New York City,Manhattan,7002001,001438,Bellevue Hospital Center,50 to 69,100,M,White,Not Span/Hispanic,23,Emergency,Home or Self Care,2019,DIG019,OTHER SPECIFIED AND UNSPECIFIED LIVER DISEASE,ADM021,"ADMINISTRATION OF THERAPEUTIC SUBSTANCES, NEC",280,ALCOHOLIC LIVER DISEASE,07,DISEASES AND DISORDERS OF THE HEPATOBILIARY SYSTEM AND PANCREAS,3,Major,Moderate,Medical,Medicaid,Medicaid,,,,true,114182.86,75885.93
New York City,Manhattan,7002001,001438,Bellevue Hospital Center,30 to 49,113,M,Other Race,Spanish/Hispanic,10,Emergency,Home or Self Care,2019,INF007,HEPATITIS,GIS006,PARACENTESIS,280,ALCOHOLIC LIVER DISEASE,07,DISEASES AND DISORDERS OF THE HEPATOBILIARY SYSTEM AND PANCREAS,3,Major,Moderate,Medical,Self-Pay,,,,,true,59145.31,39307.97
New York City,Manhattan,7002001,001438,Bellevue Hospital Center,50 to 69,100,F,White,Not Span/Hispanic,10,Emergency,Home or Self Care,2019,DIG019,OTHER SPECIFIED AND UNSPECIFIED LIVER DISEASE,IMG007,COMPUTERIZED TOMOGRAPHY (CT) WITHOUT CONTRAST,280,ALCOHOLIC LIVER DISEASE,07,DISEASES AND DISORDERS OF THE HEPATOBILIARY SYSTEM AND PANCREAS,3,Major,Major,Medical,Medicare,Medicare,Medicaid,,,true,65006.94,43203.61
New York City,Manhattan,7002001,001438,Bellevue Hospital Center,50 to 69,114,M,Other Race,Spanish/Hispanic,7,Emergency,Home or Self Care,2019,DIG019,OTHER SPECIFIED AND UNSPECIFIED LIVER DISEASE,IMG009,PLAIN RADIOGRAPHY,280,ALCOHOLIC LIVER DISEASE,07,DISEASES AND DISORDERS OF THE HEPATOBILIARY SYSTEM AND PANCREAS,3,Major,Moderate,Medical,Self-Pay,,,,,true,36800.71,24457.75
New York City,Manhattan,7002001,001438,Bellevue Hospital Center,30 to 49,100,F,White,Not Span/Hispanic,3,Emergency,Home or Self Care,2019,INF007,HEPATITIS,ADM017,ADMINISTRATION OF NUTRITIONAL AND ELECTROLYTIC SUBSTANCES,280,ALCOHOLIC LIVER DISEASE,07,DISEASES AND DISORDERS OF THE HEPATOBILIARY SYSTEM AND PANCREAS,2,Moderate,Minor,Medical,Self-Pay,,,,,true,21332.95,14177.88
New York City,Manhattan,7002001,001438,Bellevue Hospital Center,30 to 49,112,M,Multi-racial,Spanish/Hispanic,7,Emergency,Home or Self Care,2019,INF007,HEPATITIS,ADM021,"ADMINISTRATION OF THERAPEUTIC SUBSTANCES, NEC",280,ALCOHOLIC LIVER DISEASE,07,DISEASES AND DISORDERS OF THE HEPATOBILIARY SYSTEM AND PANCREAS,3,Major,Minor,Medical,Medicaid,,,,,true,53607.19,35627.34
New York City,Manhattan,7002001,001438,Bellevue Hospital Center,50 to 69,112,M,White,Not Span/Hispanic,1,Emergency,Home or Self Care,2019,DIG019,OTHER SPECIFIED AND UNSPECIFIED LIVER DISEASE,IMG006,COMPUTERIZED TOMOGRAPHY (CT) WITH CONTRAST,280,ALCOHOLIC LIVER DISEASE,07,DISEASES AND DISORDERS OF THE HEPATOBILIARY SYSTEM AND PANCREAS,2,Moderate,Moderate,Medical,Medicaid,,,,,true,9731.78,6467.74
New York City,Manhattan,7002001,001438,Bellevue Hospital Center,50 to 69,100,M,Other Race,Spanish/Hispanic,7,Emergency,Home or Self Care,2019,INF007,HEPATITIS,ADM021,"ADMINISTRATION OF THERAPEUTIC SUBSTANCES, NEC",280,ALCOHOLIC LIVER DISEASE,07,DISEASES AND DISORDERS OF THE HEPATOBILIARY SYSTEM AND PANCREAS,2,Moderate,Minor,Medical,Self-Pay,,,,,true,53011.27,35231.29
New York City,Manhattan,7002001,001438,Bellevue Hospital Center,30 to 49,100,M,White,Not Span/Hispanic,3,Emergency,Home or Self Care,2019,INF007,HEPATITIS,ADM021,"ADMINISTRATION OF THERAPEUTIC SUBSTANCES, NEC",280,ALCOHOLIC LIVER DISEASE,07,DISEASES AND DISORDERS OF THE HEPATOBILIARY SYSTEM AND PANCREAS,1,Minor,Minor,Medical,Medicaid,,,,,true,26951.19,17911.76
New York City,Manhattan,7002001,001438,Bellevue Hospital Center,30 to 49,104,M,Other Race,Unknown,50,Urgent,Expired,2019,DIG019,OTHER SPECIFIED AND UNSPECIFIED LIVER DISEASE,ADM015,ADMINISTRATION OF ANTIBIOTICS,280,ALCOHOLIC LIVER DISEASE,07,DISEASES AND DISORDERS OF THE HEPATOBILIARY SYSTEM AND PANCREAS,4,Extreme,Extreme,Medical,Medicaid,,,,,false,344521.21,228968.8
New York City,Manhattan,7002001,001438,Bellevue Hospital Center,50 to 69,100,F,Other Race,Spanish/Hispanic,4,Emergency,Home or Self Care,2019,INF007,HEPATITIS,IMG004,FLUOROSCOPY OF NON-CIRCULATORY ORGANS,280,ALCOHOLIC LIVER DISEASE,07,DISEASES AND DISORDERS OF THE HEPATOBILIARY SYSTEM AND PANCREAS,3,Major,Minor,Medical,Medicaid,,,,,true,31093.59,20664.8
New York City,Manhattan,7002001,001438,Bellevue Hospital Center,50 to 69,100,M,Other Race,Spanish/Hispanic,12,Emergency,Home w/ Home Health Services,2019,DIG019,OTHER SPECIFIED AND UNSPECIFIED LIVER DISEASE,ESA003,MECHANICAL VENTILATION,280,ALCOHOLIC LIVER DISEASE,07,DISEASES AND DISORDERS OF THE HEPATOBILIARY SYSTEM AND PANCREAS,4,Extreme,Extreme,Medical,Medicaid,,,,,true,110334.75,73328.47
New York City,Manhattan,7002001,001438,Bellevue Hospital Center,30 to 49,104,M,Multi-racial,Not Span/Hispanic,2,Emergency,Left Against Medical Advice,2019,INF007,HEPATITIS,SUD001,SUBSTANCE USE DETOXIFICATION,280,ALCOHOLIC LIVER DISEASE,07,DISEASES AND DISORDERS OF THE HEPATOBILIARY SYSTEM AND PANCREAS,1,Minor,Minor,Medical,Self-Pay,,,,,true,18359.44,12201.68
New York City,Manhattan,7002001,001438,Bellevue Hospital Center,30 to 49,113,F,Other Race,Unknown,1,Emergency,Home or Self Care,2019,DIG019,OTHER SPECIFIED AND UNSPECIFIED LIVER DISEASE,ADM021,"ADMINISTRATION OF THERAPEUTIC SUBSTANCES, NEC",280,ALCOHOLIC LIVER DISEASE,07,DISEASES AND DISORDERS OF THE HEPATOBILIARY SYSTEM AND PANCREAS,3,Major,Moderate,Medical,Medicaid,,,,,true,12986.01,8630.5
New York City,Manhattan,7002001,001438,Bellevue Hospital Center,30 to 49,113,M,Other Race,Not Span/Hispanic,2,Emergency,Home or Self Care,2019,INF007,HEPATITIS,IMG008,ULTRASONOGRAPHY,280,ALCOHOLIC LIVER DISEASE,07,DISEASES AND DISORDERS OF THE HEPATOBILIARY SYSTEM AND PANCREAS,2,Moderate,Minor,Medical,Private Health Insurance,,,,,true,19868.22,13204.42
New York City,Manhattan,7002001,001438,Bellevue Hospital Center,50 to 69,100,M,Other Race,Spanish/Hispanic,4,Emergency,Home or Self Care,2019,INF007,HEPATITIS,GNR004,ENDOSCOPIC CONTROL OF BLEEDING,280,ALCOHOLIC LIVER DISEASE,07,DISEASES AND DISORDERS OF THE HEPATOBILIARY SYSTEM AND PANCREAS,3,Major,Major,Medical,Medicare,,,,,true,47106.24,31306.81
New York City,Manhattan,7002001,001438,Bellevue Hospital Center,30 to 49,112,M,Other Race,Spanish/Hispanic,4,Emergency,Home or Self Care,2019,DIG019,OTHER SPECIFIED AND UNSPECIFIED LIVER DISEASE,GIS006,PARACENTESIS,280,ALCOHOLIC LIVER DISEASE,07,DISEASES AND DISORDERS OF THE HEPATOBILIARY SYSTEM AND PANCREAS,3,Major,Moderate,Medical,Self-Pay,,,,,true,35975.81,23909.52
New York City,Manhattan,7002001,001438,Bellevue Hospital Center,30 to 49,104,M,Multi-racial,Spanish/Hispanic,5,Emergency,Home or Self Care,2019,DIG019,OTHER SPECIFIED AND UNSPECIFIED LIVER DISEASE,SUD001,SUBSTANCE USE DETOXIFICATION,280,ALCOHOLIC LIVER DISEASE,07,DISEASES AND DISORDERS OF THE HEPATOBILIARY SYSTEM AND PANCREAS,3,Major,Moderate,Medical,Self-Pay,,,,,true,39816.64,26462.14
New York City,Manhattan,7002001,001438,Bellevue Hospital Center,30 to 49,112,F,Other Race,Spanish/Hispanic,3,Emergency,Home or Self Care,2019,INF007,HEPATITIS,,,280,ALCOHOLIC LIVER DISEASE,07,DISEASES AND DISORDERS OF THE HEPATOBILIARY SYSTEM AND PANCREAS,2,Moderate,Minor,Medical,Medicaid,,,,,true,23941.42,15911.47
New York City,Manhattan,7002001,001438,Bellevue Hospital Center,30 to 49,100,M,Other Race,Spanish/Hispanic,3,Emergency,Home or Self Care,2019,DIG019,OTHER SPECIFIED AND UNSPECIFIED LIVER DISEASE,IMG006,COMPUTERIZED TOMOGRAPHY (CT) WITH CONTRAST,280,ALCOHOLIC LIVER DISEASE,07,DISEASES AND DISORDERS OF THE HEPATOBILIARY SYSTEM AND PANCREAS,3,Major,Moderate,Medical,Private Health Insurance,,,,,true,24639.06,16375.12
New York City,Manhattan,7002001,001438,Bellevue Hospital Center,30 to 49,113,F,Other Race,Spanish/Hispanic,12,Emergency,Home or Self Care,2019,DIG019,OTHER SPECIFIED AND UNSPECIFIED LIVER DISEASE,HEP001,LIVER BIOPSY,280,ALCOHOLIC LIVER DISEASE,07,DISEASES AND DISORDERS OF THE HEPATOBILIARY SYSTEM AND PANCREAS,3,Major,Major,Medical,Medicaid,,,,,true,99809.48,66333.38
New York City,Manhattan,7002001,001438,Bellevue Hospital Center,50 to 69,100,M,Other Race,Spanish/Hispanic,4,Emergency,Psychiatric Hospital or Unit of Hosp,2019,DIG019,OTHER SPECIFIED AND UNSPECIFIED LIVER DISEASE,IMG008,ULTRASONOGRAPHY,280,ALCOHOLIC LIVER DISEASE,07,DISEASES AND DISORDERS OF THE HEPATOBILIARY SYSTEM AND PANCREAS,3,Major,Moderate,Medical,Medicaid,,,,,true,28823.91,19156.37
New York City,Manhattan,7002001,001438,Bellevue Hospital Center,30 to 49,OOS,M,White,Not Span/Hispanic,5,Emergency,Home or Self Care,2019,INF007,HEPATITIS,ADM017,ADMINISTRATION OF NUTRITIONAL AND ELECTROLYTIC SUBSTANCES,280,ALCOHOLIC LIVER DISEASE,07,DISEASES AND DISORDERS OF THE HEPATOBILIARY SYSTEM AND PANCREAS,2,Moderate,Minor,Medical,Medicare,Medicaid,,,,true,37073.52,24639.06
New York City,Manhattan,7002001,001438,Bellevue Hospital Center,30 to 49,104,F,White,Not Span/Hispanic,4,Emergency,Home or Self Care,2019,INF007,HEPATITIS,SUD001,SUBSTANCE USE DETOXIFICATION,280,ALCOHOLIC LIVER DISEASE,07,DISEASES AND DISORDERS OF THE HEPATOBILIARY SYSTEM AND PANCREAS,3,Major,Minor,Medical,Medicaid,,,,,true,33367.85,22176.27
New York City,Manhattan,7002001,001438,Bellevue Hospital Center,70 or Older,112,M,Other Race,Spanish/Hispanic,1,Emergency,Home or Self Care,2019,DIG019,OTHER SPECIFIED AND UNSPECIFIED LIVER DISEASE,IMG006,COMPUTERIZED TOMOGRAPHY (CT) WITH CONTRAST,280,ALCOHOLIC LIVER DISEASE,07,DISEASES AND DISORDERS OF THE HEPATOBILIARY SYSTEM AND PANCREAS,3,Major,Major,Medical,Medicare,,,,,true,15346.28,10199.14
New York City,Manhattan,7002001,001438,Bellevue Hospital Center,50 to 69,100,M,Other Race,Not Span/Hispanic,4,Emergency,Home or Self Care,2019,DIG019,OTHER SPECIFIED AND UNSPECIFIED LIVER DISEASE,GIS006,PARACENTESIS,280,ALCOHOLIC LIVER DISEASE,07,DISEASES AND DISORDERS OF THE HEPATOBILIARY SYSTEM AND PANCREAS,3,Major,Moderate,Medical,Medicaid,,,,,true,35970.46,23905.97
New York City,Manhattan,7002001,001438,Bellevue Hospital Center,30 to 49,112,M,Other Race,Spanish/Hispanic,2,Urgent,Home or Self Care,2019,DIG019,OTHER SPECIFIED AND UNSPECIFIED LIVER DISEASE,IMG006,COMPUTERIZED TOMOGRAPHY (CT) WITH CONTRAST,280,ALCOHOLIC LIVER DISEASE,07,DISEASES AND DISORDERS OF THE HEPATOBILIARY SYSTEM AND PANCREAS,3,Major,Moderate,Medical,Medicaid,,,,,false,15839.8,10527.13
New York City,Manhattan,7002001,001438,Bellevue Hospital Center,30 to 49,114,M,Other Race,Spanish/Hispanic,18,Emergency,Home or Self Care,2019,DIG019,OTHER SPECIFIED AND UNSPECIFIED LIVER DISEASE,ESA001,HEMODIALYSIS,280,ALCOHOLIC LIVER DISEASE,07,DISEASES AND DISORDERS OF THE HEPATOBILIARY SYSTEM AND PANCREAS,3,Major,Major,Medical,Medicaid,,,,,true,125796.51,83604.36
New York City,Manhattan,7002001,001438,Bellevue Hospital Center,50 to 69,112,F,Other Race,Spanish/Hispanic,8,Emergency,Home or Self Care,2019,DIG019,OTHER SPECIFIED AND UNSPECIFIED LIVER DISEASE,IMG008,ULTRASONOGRAPHY,280,ALCOHOLIC LIVER DISEASE,07,DISEASES AND DISORDERS OF THE HEPATOBILIARY SYSTEM AND PANCREAS,3,Major,Moderate,Medical,Medicaid,,,,,true,70616.8,46931.93
New York City,Manhattan,7002001,001438,Bellevue Hospital Center,30 to 49,104,M,Multi-racial,Not Span/Hispanic,8,Emergency,Home or Self Care,2019,INF007,HEPATITIS,MHT001,PHARMACOTHERAPY FOR MENTAL HEALTH (EXCLUDING SUBSTANCE USE),280,ALCOHOLIC LIVER DISEASE,07,DISEASES AND DISORDERS OF THE HEPATOBILIARY SYSTEM AND PANCREAS,2,Moderate,Moderate,Medical,Medicaid,Medicaid,,,,true,53244.7,35386.43
New York City,Manhattan,7002001,001438,Bellevue Hospital Center,30 to 49,104,M,Other Race,Spanish/Hispanic,5,Emergency,Home or Self Care,2019,INF007,HEPATITIS,IMG006,COMPUTERIZED TOMOGRAPHY (CT) WITH CONTRAST,280,ALCOHOLIC LIVER DISEASE,07,DISEASES AND DISORDERS OF THE HEPATOBILIARY SYSTEM AND PANCREAS,2,Moderate,Moderate,Medical,Medicaid,,,,,true,39158.54,26024.77
New York City,Manhattan,7002001,001438,Bellevue Hospital Center,50 to 69,116,M,Black/African American,Not Span/Hispanic,4,Emergency,Home or Self Care,2019,DIG019,OTHER SPECIFIED AND UNSPECIFIED LIVER DISEASE,GIS006,PARACENTESIS,280,ALCOHOLIC LIVER DISEASE,07,DISEASES AND DISORDERS OF THE HEPATOBILIARY SYSTEM AND PANCREAS,3,Major,Moderate,Medical,Medicaid,,,,,true,37074.93,24640
New York City,Manhattan,7002001,001438,Bellevue Hospital Center,30 to 49,112,M,White,Not Span/Hispanic,4,Emergency,Home or Self Care,2019,INF007,HEPATITIS,SUD001,SUBSTANCE USE DETOXIFICATION,280,ALCOHOLIC LIVER DISEASE,07,DISEASES AND DISORDERS OF THE HEPATOBILIARY SYSTEM AND PANCREAS,2,Moderate,Minor,Medical,Private Health Insurance,,,,,true,32215.37,21410.33
New York City,Manhattan,7002001,001438,Bellevue Hospital Center,50 to 69,100,F,Other Race,Unknown,2,Emergency,Home or Self Care,2019,INF007,HEPATITIS,SUD001,SUBSTANCE USE DETOXIFICATION,280,ALCOHOLIC LIVER DISEASE,07,DISEASES AND DISORDERS OF THE HEPATOBILIARY SYSTEM AND PANCREAS,3,Major,Moderate,Medical,Medicaid,,,,,true,13997.79,9302.93
New York City,Manhattan,7002001,001438,Bellevue Hospital Center,18 to 29,100,M,Black/African American,Not Span/Hispanic,3,Emergency,Home or Self Care,2019,INF007,HEPATITIS,IMG008,ULTRASONOGRAPHY,280,ALCOHOLIC LIVER DISEASE,07,DISEASES AND DISORDERS OF THE HEPATOBILIARY SYSTEM AND PANCREAS,3,Major,Moderate,Medical,Self-Pay,,,,,true,28289.39,18801.13
New York City,Manhattan,7002001,001438,Bellevue Hospital Center,30 to 49,104,M,Other Race,Spanish/Hispanic,3,Emergency,Home or Self Care,2019,INF007,HEPATITIS,IMG008,ULTRASONOGRAPHY,280,ALCOHOLIC LIVER DISEASE,07,DISEASES AND DISORDERS OF THE HEPATOBILIARY SYSTEM AND PANCREAS,3,Major,Moderate,Medical,Private Health Insurance,,,,,true,17256.76,11468.84
New York City,Manhattan,7002001,001438,Bellevue Hospital Center,30 to 49,100,M,Other Race,Spanish/Hispanic,4,Emergency,Court/Law Enforcement,2019,INF007,HEPATITIS,IMG008,ULTRASONOGRAPHY,280,ALCOHOLIC LIVER DISEASE,07,DISEASES AND DISORDERS OF THE HEPATOBILIARY SYSTEM AND PANCREAS,1,Minor,Minor,Medical,Self-Pay,,,,,true,27918.08,18554.36
New York City,Manhattan,7002001,001438,Bellevue Hospital Center,50 to 69,112,M,White,Spanish/Hispanic,7,Emergency,Home or Self Care,2019,DIG019,OTHER SPECIFIED AND UNSPECIFIED LIVER DISEASE,GIS006,PARACENTESIS,280,ALCOHOLIC LIVER DISEASE,07,DISEASES AND DISORDERS OF THE HEPATOBILIARY SYSTEM AND PANCREAS,3,Major,Major,Medical,Medicaid,,,,,true,53427.58,35507.97
New York City,Manhattan,7002001,001438,Bellevue Hospital Center,30 to 49,100,F,Other Race,Not Span/Hispanic,26,Emergency,Home or Self Care,2019,DIG019,OTHER SPECIFIED AND UNSPECIFIED LIVER DISEASE,RES007,AIRWAY INTUBATION,280,ALCOHOLIC LIVER DISEASE,07,DISEASES AND DISORDERS OF THE HEPATOBILIARY SYSTEM AND PANCREAS,4,Extreme,Extreme,Medical,Self-Pay,,,,,true,253637.9,168567.75
New York City,Manhattan,7002001,001438,Bellevue Hospital Center,50 to 69,104,M,Other Race,Spanish/Hispanic,8,Emergency,Short-term Hospital,2019,DIG019,OTHER SPECIFIED AND UNSPECIFIED LIVER DISEASE,IMG005,MAGNETIC RESONANCE IMAGING (MRI),280,ALCOHOLIC LIVER DISEASE,07,DISEASES AND DISORDERS OF THE HEPATOBILIARY SYSTEM AND PANCREAS,3,Major,Moderate,Medical,Medicaid,,,,,true,56163.58,37326.32
New York City,Manhattan,7002001,001438,Bellevue Hospital Center,50 to 69,114,M,Other Race,Not Span/Hispanic,1,Urgent,Short-term Hospital,2019,DIG019,OTHER SPECIFIED AND UNSPECIFIED LIVER DISEASE,GIS006,PARACENTESIS,280,ALCOHOLIC LIVER DISEASE,07,DISEASES AND DISORDERS OF THE HEPATOBILIARY SYSTEM AND PANCREAS,4,Extreme,Extreme,Medical,Medicaid,,,,,false,15148.6,10067.76
New York City,Manhattan,7002001,001438,Bellevue Hospital Center,50 to 69,100,F,Other Race,Unknown,20,Emergency,Home or Self Care,2019,INF007,HEPATITIS,IMG007,COMPUTERIZED TOMOGRAPHY (CT) WITHOUT CONTRAST,280,ALCOHOLIC LIVER DISEASE,07,DISEASES AND DISORDERS OF THE HEPATOBILIARY SYSTEM AND PANCREAS,4,Extreme,Major,Medical,Self-Pay,,,,,true,144831.38,96254.94
New York City,Manhattan,7002001,001438,Bellevue Hospital Center,30 to 49,100,F,White,Unknown,3,Emergency,Left Against Medical Advice,2019,INF007,HEPATITIS,IMG008,ULTRASONOGRAPHY,280,ALCOHOLIC LIVER DISEASE,07,DISEASES AND DISORDERS OF THE HEPATOBILIARY SYSTEM AND PANCREAS,2,Moderate,Minor,Medical,Medicaid,,,,,true,22494.53,14949.86
New York City,Manhattan,7002001,001438,Bellevue Hospital Center,30 to 49,114,M,Other Race,Spanish/Hispanic,6,Emergency,Home or Self Care,2019,INF007,HEPATITIS,SUD001,SUBSTANCE USE DETOXIFICATION,280,ALCOHOLIC LIVER DISEASE,07,DISEASES AND DISORDERS OF THE HEPATOBILIARY SYSTEM AND PANCREAS,3,Major,Moderate,Medical,Private Health Insurance,,,,,true,42308.48,28118.22
New York City,Manhattan,7002001,001438,Bellevue Hospital Center,18 to 29,113,M,Other Race,Spanish/Hispanic,4,Emergency,Home or Self Care,2019,DIG019,OTHER SPECIFIED AND UNSPECIFIED LIVER DISEASE,GIS027,"UPPER GI THERAPEUTIC PROCEDURES, NEC (ENDOSCOPIC)",280,ALCOHOLIC LIVER DISEASE,07,DISEASES AND DISORDERS OF THE HEPATOBILIARY SYSTEM AND PANCREAS,3,Major,Moderate,Medical,Medicaid,,,,,true,35615.15,23669.83