Hospital Service Area,Hospital County,Operating Certificate Number,Permanent Facility Id,Facility Name,Age Group,Zip Code - 3 digits,Gender,Race,Ethnicity,Length of Stay,Type of Admission,Patient Disposition,Discharge Year,CCS Diagnosis Code,CCS Diagnosis Description,CCS Procedure Code,CCS Procedure Description,APR DRG Code,APR DRG Description,APR MDC Code,APR MDC Description,APR Severity of Illness Code,APR Severity of Illness Description,APR Risk of Mortality,APR Medical Surgical Description,Payment Typology 1,Payment Typology 2,Payment Typology 3,Birth Weight,Abortion Edit Indicator,Emergency Department Indicator,Total Charges,Total Costs
Long Island,Nassau,2908000,000511,NYU Winthrop Hospital,70 or Older,117,F,White,Not Span/Hispanic,19,Emergency,Hospice - Home,2017,017,Cancer of pancreas,071,GASTROSTOMY; TEMP/PERM,281,Malignancy of hepatobiliary system & pancreas,07,Diseases and Disorders of the Hepatobiliary System and Pancreas,3,Major,Major,Medical,Medicare,Medicare,Private Health Insurance,,N,Y,173597.13,37650.94
Long Island,Nassau,2908000,000511,NYU Winthrop Hospital,70 or Older,115,F,Black/African American,Not Span/Hispanic,5,Emergency,Home or Self Care,2017,017,Cancer of pancreas,083,BIOPSY OF LIVER,281,Malignancy of hepatobiliary system & pancreas,07,Diseases and Disorders of the Hepatobiliary System and Pancreas,3,Major,Moderate,Medical,Medicare,Medicaid,,,N,Y,51494.86,9787.47
Long Island,Nassau,2908000,000511,NYU Winthrop Hospital,70 or Older,115,F,White,Not Span/Hispanic,6,Emergency,Hospice - Medical Facility,2017,016,Cancer of liver and intrahepatic bile duct,000,NO PROC,281,Malignancy of hepatobiliary system & pancreas,07,Diseases and Disorders of the Hepatobiliary System and Pancreas,3,Major,Major,Medical,Medicare,Medicare,Medicaid,,N,Y,94604.96,22547.48
Long Island,Nassau,2908000,000511,NYU Winthrop Hospital,50 to 69,110,F,White,Not Span/Hispanic,4,Emergency,Home or Self Care,2017,017,Cancer of pancreas,097,OTHER GI DX PRCS,281,Malignancy of hepatobiliary system & pancreas,07,Diseases and Disorders of the Hepatobiliary System and Pancreas,1,Minor,Minor,Medical,Blue Cross/Blue Shield,,,,N,Y,64066.72,11107.50
Long Island,Nassau,2908000,000511,NYU Winthrop Hospital,70 or Older,110,M,White,Not Span/Hispanic,27,Emergency,Home or Self Care,2017,016,Cancer of liver and intrahepatic bile duct,159,OT DX PRCS ON MUSC/SKEL,281,Malignancy of hepatobiliary system & pancreas,07,Diseases and Disorders of the Hepatobiliary System and Pancreas,3,Major,Moderate,Medical,Medicare,Medicare,Medicaid,,N,Y,228810.23,47797.92
Long Island,Nassau,2908000,000511,NYU Winthrop Hospital,70 or Older,115,M,Black/African American,Not Span/Hispanic,5,Emergency,Hospice - Home,2017,017,Cancer of pancreas,088,ABDOMINAL PARACENTESIS,281,Malignancy of hepatobiliary system & pancreas,07,Diseases and Disorders of the Hepatobiliary System and Pancreas,4,Extreme,Extreme,Medical,Medicare,Medicare,,,N,Y,57989.91,15993.82
Long Island,Nassau,2908000,000511,NYU Winthrop Hospital,50 to 69,115,M,White,Not Span/Hispanic,14,Emergency,Hospice - Home,2017,017,Cancer of pancreas,088,ABDOMINAL PARACENTESIS,281,Malignancy of hepatobiliary system & pancreas,07,Diseases and Disorders of the Hepatobiliary System and Pancreas,4,Extreme,Major,Medical,Medicare,Medicare,Private Health Insurance,,N,Y,122164.01,30370.96
Long Island,Nassau,2908000,000511,NYU Winthrop Hospital,70 or Older,116,F,Black/African American,Not Span/Hispanic,17,Emergency,Hospice - Home,2017,042,Secondary malignancies,222,BLOOD TRANSFUSION,281,Malignancy of hepatobiliary system & pancreas,07,Diseases and Disorders of the Hepatobiliary System and Pancreas,3,Major,Major,Medical,Medicare,Medicare,Medicaid,,N,Y,135663.47,30238.70
Long Island,Nassau,2908000,000511,NYU Winthrop Hospital,70 or Older,110,F,White,Not Span/Hispanic,11,Emergency,Home w/ Home Health Services,2017,017,Cancer of pancreas,070,UP GASTRO ENDOSC/BIOPSY,281,Malignancy of hepatobiliary system & pancreas,07,Diseases and Disorders of the Hepatobiliary System and Pancreas,3,Major,Major,Medical,Medicare,Medicare,Blue Cross/Blue Shield,,N,Y,170613.91,27304.45
Long Island,Nassau,2908000,000511,NYU Winthrop Hospital,50 to 69,117,M,White,Not Span/Hispanic,6,Emergency,Home w/ Home Health Services,2017,042,Secondary malignancies,000,NO PROC,281,Malignancy of hepatobiliary system & pancreas,07,Diseases and Disorders of the Hepatobiliary System and Pancreas,2,Moderate,Moderate,Medical,Medicare,Medicare,Private Health Insurance,,N,Y,72445.28,14298.49
Long Island,Nassau,2908000,000511,NYU Winthrop Hospital,70 or Older,113,F,White,Not Span/Hispanic,2,Emergency,Home or Self Care,2017,016,Cancer of liver and intrahepatic bile duct,000,NO PROC,281,Malignancy of hepatobiliary system & pancreas,07,Diseases and Disorders of the Hepatobiliary System and Pancreas,2,Moderate,Major,Medical,Medicare,Medicare,Medicaid,,N,Y,45791.20,6567.77
Long Island,Nassau,2908000,000511,NYU Winthrop Hospital,50 to 69,115,M,Black/African American,Not Span/Hispanic,13,Emergency,Expired,2017,042,Secondary malignancies,083,BIOPSY OF LIVER,281,Malignancy of hepatobiliary system & pancreas,07,Diseases and Disorders of the Hepatobiliary System and Pancreas,4,Extreme,Major,Medical,Blue Cross/Blue Shield,Medicare,,,N,Y,241224.50,59050.43
Long Island,Nassau,2908000,000511,NYU Winthrop Hospital,50 to 69,117,M,White,Not Span/Hispanic,5,Emergency,Inpatient Rehabilitation Facility,2017,016,Cancer of liver and intrahepatic bile duct,000,NO PROC,281,Malignancy of hepatobiliary system & pancreas,07,Diseases and Disorders of the Hepatobiliary System and Pancreas,4,Extreme,Major,Medical,Blue Cross/Blue Shield,,,,N,Y,43451.15,9107.23
Long Island,Nassau,2908000,000511,NYU Winthrop Hospital,70 or Older,112,M,Black/African American,Not Span/Hispanic,1,Emergency,Expired,2017,017,Cancer of pancreas,222,BLOOD TRANSFUSION,281,Malignancy of hepatobiliary system & pancreas,07,Diseases and Disorders of the Hepatobiliary System and Pancreas,3,Major,Major,Medical,Private Health Insurance,Medicare,Medicare,,N,Y,33629.13,5280.57
Long Island,Nassau,2908000,000511,NYU Winthrop Hospital,50 to 69,115,F,White,Not Span/Hispanic,4,Emergency,Home or Self Care,2017,018,Cancer of other GI organs; peritoneum,097,OTHER GI DX PRCS,281,Malignancy of hepatobiliary system & pancreas,07,Diseases and Disorders of the Hepatobiliary System and Pancreas,1,Minor,Minor,Medical,Medicare,Medicare,,,N,Y,54944.88,9830.50
Long Island,Nassau,2908000,000511,NYU Winthrop Hospital,30 to 49,116,M,White,Spanish/Hispanic,10,Emergency,Hospice - Home,2017,042,Secondary malignancies,061,OT OR PRCS VES NOT HEAD,281,Malignancy of hepatobiliary system & pancreas,07,Diseases and Disorders of the Hepatobiliary System and Pancreas,3,Major,Moderate,Medical,Medicaid,,,,N,Y,84850.83,20154.74
Long Island,Nassau,2908000,000511,NYU Winthrop Hospital,70 or Older,115,M,White,Not Span/Hispanic,5,Emergency,Expired,2017,017,Cancer of pancreas,000,NO PROC,281,Malignancy of hepatobiliary system & pancreas,07,Diseases and Disorders of the Hepatobiliary System and Pancreas,2,Moderate,Major,Medical,Medicare,Medicare,Blue Cross/Blue Shield,,N,Y,122985.33,26898.25
Long Island,Nassau,2908000,000511,NYU Winthrop Hospital,50 to 69,115,F,White,Spanish/Hispanic,5,Emergency,Expired,2017,017,Cancer of pancreas,039,INCISION OF PLEURA,281,Malignancy of hepatobiliary system & pancreas,07,Diseases and Disorders of the Hepatobiliary System and Pancreas,4,Extreme,Major,Medical,Medicare,Medicare,,,N,Y,93460.58,19350.76
Long Island,Nassau,2908000,000511,NYU Winthrop Hospital,50 to 69,118,F,Other Race,Not Span/Hispanic,3,Emergency,Expired,2017,042,Secondary malignancies,000,NO PROC,281,Malignancy of hepatobiliary system & pancreas,07,Diseases and Disorders of the Hepatobiliary System and Pancreas,4,Extreme,Major,Medical,Private Health Insurance,,,,N,Y,17754.17,4308.23
Long Island,Nassau,2908000,000511,NYU Winthrop Hospital,70 or Older,119,F,White,Not Span/Hispanic,8,Emergency,Hospice - Medical Facility,2017,042,Secondary malignancies,083,BIOPSY OF LIVER,281,Malignancy of hepatobiliary system & pancreas,07,Diseases and Disorders of the Hepatobiliary System and Pancreas,3,Major,Extreme,Medical,Medicare,Medicare,Private Health Insurance,,N,Y,118536.52,18952.30
Long Island,Nassau,2908000,000511,NYU Winthrop Hospital,50 to 69,110,M,Black/African American,Not Span/Hispanic,3,Emergency,Home or Self Care,2017,017,Cancer of pancreas,097,OTHER GI DX PRCS,281,Malignancy of hepatobiliary system & pancreas,07,Diseases and Disorders of the Hepatobiliary System and Pancreas,3,Major,Moderate,Medical,Private Health Insurance,,,,N,Y,53080.78,9356.29
Long Island,Nassau,2908000,000511,NYU Winthrop Hospital,50 to 69,115,F,White,Not Span/Hispanic,3,Emergency,Home or Self Care,2017,017,Cancer of pancreas,097,OTHER GI DX PRCS,281,Malignancy of hepatobiliary system & pancreas,07,Diseases and Disorders of the Hepatobiliary System and Pancreas,2,Moderate,Moderate,Medical,Medicare,Medicare,Blue Cross/Blue Shield,,N,Y,44074.43,7539.05
Long Island,Nassau,2908000,000511,NYU Winthrop Hospital,70 or Older,115,M,White,Spanish/Hispanic,4,Emergency,Home w/ Home Health Services,2017,016,Cancer of liver and intrahepatic bile duct,000,NO PROC,281,Malignancy of hepatobiliary system & pancreas,07,Diseases and Disorders of the Hepatobiliary System and Pancreas,3,Major,Major,Medical,Medicare,Medicare,Medicaid,,N,Y,48988.98,9200.80
Long Island,Nassau,2908000,000511,NYU Winthrop Hospital,70 or Older,118,M,White,Not Span/Hispanic,20,Emergency,Skilled Nursing Home,2017,017,Cancer of pancreas,097,OTHER GI DX PRCS,281,Malignancy of hepatobiliary system & pancreas,07,Diseases and Disorders of the Hepatobiliary System and Pancreas,3,Major,Moderate,Medical,Medicare,Medicare,,,N,Y,253195.35,54232.65
Long Island,Nassau,2908000,000511,NYU Winthrop Hospital,30 to 49,117,M,White,Not Span/Hispanic,7,Emergency,Home w/ Home Health Services,2017,017,Cancer of pancreas,097,OTHER GI DX PRCS,281,Malignancy of hepatobiliary system & pancreas,07,Diseases and Disorders of the Hepatobiliary System and Pancreas,2,Moderate,Minor,Medical,Medicare,Medicare,Medicaid,,N,Y,112671.78,22000.58
Long Island,Nassau,2908000,000511,NYU Winthrop Hospital,70 or Older,117,M,White,Not Span/Hispanic,1,Emergency,Home or Self Care,2017,018,Cancer of other GI organs; peritoneum,098,OT NON-OR GI THER PRCS,281,Malignancy of hepatobiliary system & pancreas,07,Diseases and Disorders of the Hepatobiliary System and Pancreas,3,Major,Moderate,Medical,Medicare,Medicare,,,N,Y,59702.98,10959.27
Long Island,Nassau,2908000,000511,NYU Winthrop Hospital,50 to 69,115,F,White,Not Span/Hispanic,13,Emergency,Hospice - Medical Facility,2017,042,Secondary malignancies,222,BLOOD TRANSFUSION,281,Malignancy of hepatobiliary system & pancreas,07,Diseases and Disorders of the Hepatobiliary System and Pancreas,4,Extreme,Extreme,Medical,Medicare,Medicare,Private Health Insurance,,N,Y,255212.60,41438.55
Long Island,Nassau,2908000,000511,NYU Winthrop Hospital,50 to 69,OOS,M,White,Not Span/Hispanic,4,Urgent,Home or Self Care,2017,016,Cancer of liver and intrahepatic bile duct,092,OTHER BOWEL DX PRCS,281,Malignancy of hepatobiliary system & pancreas,07,Diseases and Disorders of the Hepatobiliary System and Pancreas,3,Major,Major,Medical,Medicare,Medicare,Blue Cross/Blue Shield,,N,N,125783.88,19102.25
Long Island,Nassau,2908000,000511,NYU Winthrop Hospital,70 or Older,115,M,White,Not Span/Hispanic,4,Emergency,Home w/ Home Health Services,2017,017,Cancer of pancreas,098,OT NON-OR GI THER PRCS,281,Malignancy of hepatobiliary system & pancreas,07,Diseases and Disorders of the Hepatobiliary System and Pancreas,3,Major,Major,Medical,Medicare,Medicare,Private Health Insurance,,N,Y,130395.38,29147.96
Long Island,Nassau,2908000,000511,NYU Winthrop Hospital,70 or Older,115,F,Other Race,Not Span/Hispanic,10,Emergency,Home or Self Care,2017,017,Cancer of pancreas,097,OTHER GI DX PRCS,281,Malignancy of hepatobiliary system & pancreas,07,Diseases and Disorders of the Hepatobiliary System and Pancreas,3,Major,Major,Medical,Medicare,Medicare,,,N,Y,175422.18,38962.03
Long Island,Nassau,2908000,000511,NYU Winthrop Hospital,70 or Older,115,M,White,Not Span/Hispanic,5,Emergency,Home or Self Care,2017,042,Secondary malignancies,083,BIOPSY OF LIVER,281,Malignancy of hepatobiliary system & pancreas,07,Diseases and Disorders of the Hepatobiliary System and Pancreas,3,Major,Major,Medical,Medicare,Medicare,Blue Cross/Blue Shield,,N,Y,79010.27,13885.18
Long Island,Nassau,2908000,000511,NYU Winthrop Hospital,50 to 69,115,F,Black/African American,Not Span/Hispanic,5,Emergency,Home or Self Care,2017,017,Cancer of pancreas,097,OTHER GI DX PRCS,281,Malignancy of hepatobiliary system & pancreas,07,Diseases and Disorders of the Hepatobiliary System and Pancreas,3,Major,Moderate,Medical,Medicare,Medicare,Private Health Insurance,,N,Y,116740.26,21441.13
Long Island,Nassau,2908000,000511,NYU Winthrop Hospital,70 or Older,115,F,Black/African American,Not Span/Hispanic,1,Emergency,Skilled Nursing Home,2017,017,Cancer of pancreas,222,BLOOD TRANSFUSION,281,Malignancy of hepatobiliary system & pancreas,07,Diseases and Disorders of the Hepatobiliary System and Pancreas,2,Moderate,Moderate,Medical,Medicare,Medicare,Blue Cross/Blue Shield,,N,Y,38425.52,6840.82
Long Island,Nassau,2908000,000511,NYU Winthrop Hospital,50 to 69,115,F,Black/African American,Spanish/Hispanic,3,Emergency,Home or Self Care,2017,017,Cancer of pancreas,000,NO PROC,281,Malignancy of hepatobiliary system & pancreas,07,Diseases and Disorders of the Hepatobiliary System and Pancreas,1,Minor,Minor,Medical,Medicaid,Medicaid,,,N,Y,35042.31,6611.05
Long Island,Nassau,2908000,000511,NYU Winthrop Hospital,50 to 69,117,M,White,Not Span/Hispanic,7,Emergency,Home or Self Care,2017,017,Cancer of pancreas,008,OT NON-OR THER NERV SYS,281,Malignancy of hepatobiliary system & pancreas,07,Diseases and Disorders of the Hepatobiliary System and Pancreas,2,Moderate,Moderate,Medical,Medicare,Medicare,Private Health Insurance,,N,Y,87210.82,15647.79
Long Island,Nassau,2908000,000511,NYU Winthrop Hospital,70 or Older,115,M,Black/African American,Not Span/Hispanic,2,Emergency,Home w/ Home Health Services,2017,017,Cancer of pancreas,000,NO PROC,281,Malignancy of hepatobiliary system & pancreas,07,Diseases and Disorders of the Hepatobiliary System and Pancreas,2,Moderate,Minor,Medical,Medicare,Medicare,Medicaid,,N,Y,29594.38,5188.88
Long Island,Nassau,2908000,000511,NYU Winthrop Hospital,70 or Older,118,F,White,Not Span/Hispanic,3,Elective,Home or Self Care,2017,017,Cancer of pancreas,097,OTHER GI DX PRCS,281,Malignancy of hepatobiliary system & pancreas,07,Diseases and Disorders of the Hepatobiliary System and Pancreas,2,Moderate,Minor,Medical,Medicare,Medicare,Private Health Insurance,,N,N,160511.66,37621.92
Long Island,Nassau,2908000,000511,NYU Winthrop Hospital,70 or Older,118,F,White,Not Span/Hispanic,5,Emergency,Home w/ Home Health Services,2017,042,Secondary malignancies,083,BIOPSY OF LIVER,281,Malignancy of hepatobiliary system & pancreas,07,Diseases and Disorders of the Hepatobiliary System and Pancreas,2,Moderate,Moderate,Medical,Medicare,Medicaid,Medicare,,N,Y,85704.78,14653.43
Long Island,Nassau,2908000,000511,NYU Winthrop Hospital,70 or Older,115,F,Black/African American,Not Span/Hispanic,5,Emergency,Home or Self Care,2017,017,Cancer of pancreas,097,OTHER GI DX PRCS,281,Malignancy of hepatobiliary system & pancreas,07,Diseases and Disorders of the Hepatobiliary System and Pancreas,2,Moderate,Moderate,Medical,Medicare,Medicare,,,N,Y,79965.38,15459.70
Long Island,Nassau,2908000,000511,NYU Winthrop Hospital,70 or Older,115,F,Black/African American,Not Span/Hispanic,10,Emergency,Skilled Nursing Home,2017,042,Secondary malignancies,224,CANCER CHEMOTHERAPY,281,Malignancy of hepatobiliary system & pancreas,07,Diseases and Disorders of the Hepatobiliary System and Pancreas,3,Major,Major,Medical,Medicare,Medicare,,,N,Y,153658.08,34702.64
Long Island,Nassau,2908000,000511,NYU Winthrop Hospital,70 or Older,117,F,White,Not Span/Hispanic,7,Emergency,Hospice - Home,2017,042,Secondary malignancies,222,BLOOD TRANSFUSION,281,Malignancy of hepatobiliary system & pancreas,07,Diseases and Disorders of the Hepatobiliary System and Pancreas,3,Major,Major,Medical,Medicare,Medicare,Blue Cross/Blue Shield,,N,Y,80753.37,14495.53
Long Island,Nassau,2908000,000511,NYU Winthrop Hospital,70 or Older,112,F,Black/African American,Not Span/Hispanic,14,Emergency,Hospice - Medical Facility,2017,042,Secondary malignancies,083,BIOPSY OF LIVER,281,Malignancy of hepatobiliary system & pancreas,07,Diseases and Disorders of the Hepatobiliary System and Pancreas,4,Extreme,Extreme,Medical,Medicare,Medicare,,,N,Y,209744.43,47561.26
Long Island,Nassau,2908000,000511,NYU Winthrop Hospital,50 to 69,115,F,White,Not Span/Hispanic,11,Emergency,Home w/ Home Health Services,2017,042,Secondary malignancies,224,CANCER CHEMOTHERAPY,281,Malignancy of hepatobiliary system & pancreas,07,Diseases and Disorders of the Hepatobiliary System and Pancreas,3,Major,Major,Medical,Medicare,Medicare,Private Health Insurance,,N,Y,139552.28,29631.93
Long Island,Nassau,2908000,000511,NYU Winthrop Hospital,70 or Older,119,F,White,Not Span/Hispanic,6,Emergency,Home or Self Care,2017,017,Cancer of pancreas,097,OTHER GI DX PRCS,281,Malignancy of hepatobiliary system & pancreas,07,Diseases and Disorders of the Hepatobiliary System and Pancreas,3,Major,Major,Medical,Medicare,Medicare,Blue Cross/Blue Shield,,N,Y,168794.85,33359.93
Long Island,Nassau,2908000,000511,NYU Winthrop Hospital,50 to 69,115,M,White,Spanish/Hispanic,6,Emergency,Home or Self Care,2017,017,Cancer of pancreas,097,OTHER GI DX PRCS,281,Malignancy of hepatobiliary system & pancreas,07,Diseases and Disorders of the Hepatobiliary System and Pancreas,4,Extreme,Major,Medical,Medicaid,,,,N,Y,125330.47,23654.24
Long Island,Nassau,2908000,000511,NYU Winthrop Hospital,50 to 69,115,F,Black/African American,Not Span/Hispanic,6,Emergency,Hospice - Home,2017,042,Secondary malignancies,088,ABDOMINAL PARACENTESIS,281,Malignancy of hepatobiliary system & pancreas,07,Diseases and Disorders of the Hepatobiliary System and Pancreas,4,Extreme,Major,Medical,Medicaid,,,,N,Y,104436.99,24259.61
Long Island,Nassau,2908000,000511,NYU Winthrop Hospital,50 to 69,115,M,Black/African American,Not Span/Hispanic,9,Emergency,Home or Self Care,2017,016,Cancer of liver and intrahepatic bile duct,076,COLONOSCOPY AND BIOPSY,281,Malignancy of hepatobiliary system & pancreas,07,Diseases and Disorders of the Hepatobiliary System and Pancreas,2,Moderate,Moderate,Medical,Medicare,Medicaid,Medicare,,N,Y,118960.48,19789.56
Long Island,Nassau,2908000,000511,NYU Winthrop Hospital,70 or Older,110,M,White,Not Span/Hispanic,5,Emergency,Home or Self Care,2017,017,Cancer of pancreas,098,OT NON-OR GI THER PRCS,281,Malignancy of hepatobiliary system & pancreas,07,Diseases and Disorders of the Hepatobiliary System and Pancreas,3,Major,Moderate,Medical,Medicare,Medicare,Private Health Insurance,,N,Y,85728.67,15643.70
Long Island,Nassau,2908000,000511,NYU Winthrop Hospital,50 to 69,114,F,Black/African American,Not Span/Hispanic,4,Emergency,Home w/ Home Health Services,2017,042,Secondary malignancies,058,HEMODIALYSIS,281,Malignancy of hepatobiliary system & pancreas,07,Diseases and Disorders of the Hepatobiliary System and Pancreas,3,Major,Major,Medical,Medicare,Medicare,,,N,Y,47011.94,9180.94
Long Island,Nassau,2908000,000511,NYU Winthrop Hospital,50 to 69,115,F,Other Race,Spanish/Hispanic,5,Emergency,Home or Self Care,2017,017,Cancer of pancreas,097,OTHER GI DX PRCS,281,Malignancy of hepatobiliary system & pancreas,07,Diseases and Disorders of the Hepatobiliary System and Pancreas,2,Moderate,Minor,Medical,Medicaid,Medicaid,,,N,Y,96531.33,17743.97
Long Island,Nassau,2908000,000511,NYU Winthrop Hospital,50 to 69,117,M,White,Not Span/Hispanic,2,Emergency,Home or Self Care,2017,017,Cancer of pancreas,098,OT NON-OR GI THER PRCS,281,Malignancy of hepatobiliary system & pancreas,07,Diseases and Disorders of the Hepatobiliary System and Pancreas,2,Moderate,Minor,Medical,Blue Cross/Blue Shield,,,,N,Y,87228.76,15171.42
Long Island,Nassau,2908000,000511,NYU Winthrop Hospital,70 or Older,115,F,Black/African American,Spanish/Hispanic,7,Emergency,Home w/ Home Health Services,2017,017,Cancer of pancreas,093,OT NON-OR UP GI THER PR,281,Malignancy of hepatobiliary system & pancreas,07,Diseases and Disorders of the Hepatobiliary System and Pancreas,3,Major,Moderate,Medical,Medicare,Medicare,,,N,Y,157320.95,36228.74
Long Island,Nassau,2908000,000511,NYU Winthrop Hospital,30 to 49,115,F,White,Spanish/Hispanic,2,Emergency,Home or Self Care,2017,016,Cancer of liver and intrahepatic bile duct,083,BIOPSY OF LIVER,281,Malignancy of hepatobiliary system & pancreas,07,Diseases and Disorders of the Hepatobiliary System and Pancreas,2,Moderate,Minor,Medical,Medicaid,,,,N,Y,58295.84,9691.02
Long Island,Nassau,2908000,000511,NYU Winthrop Hospital,70 or Older,OOS,F,White,Not Span/Hispanic,9,Emergency,Skilled Nursing Home,2017,042,Secondary malignancies,083,BIOPSY OF LIVER,281,Malignancy of hepatobiliary system & pancreas,07,Diseases and Disorders of the Hepatobiliary System and Pancreas,3,Major,Major,Medical,Medicare,Medicare,,,N,Y,123647.28,25237.94
Long Island,Nassau,2908000,000511,NYU Winthrop Hospital,70 or Older,114,M,White,Not Span/Hispanic,5,Emergency,Home w/ Home Health Services,2017,017,Cancer of pancreas,098,OT NON-OR GI THER PRCS,281,Malignancy of hepatobiliary system & pancreas,07,Diseases and Disorders of the Hepatobiliary System and Pancreas,3,Major,Major,Medical,Medicare,Medicare,Self-Pay,,N,Y,120908.29,23698.44
Long Island,Nassau,2908000,000511,NYU Winthrop Hospital,70 or Older,115,F,Black/African American,Not Span/Hispanic,10,Emergency,Hospice - Home,2017,016,Cancer of liver and intrahepatic bile duct,226,OT DX RADIO & RELATED,281,Malignancy of hepatobiliary system & pancreas,07,Diseases and Disorders of the Hepatobiliary System and Pancreas,3,Major,Major,Medical,Medicare,Medicare,Private Health Insurance,,N,Y,73545.02,14246.20
Long Island,Nassau,2908000,000511,NYU Winthrop Hospital,70 or Older,115,M,White,Not Span/Hispanic,4,Emergency,Home or Self Care,2017,017,Cancer of pancreas,000,NO PROC,281,Malignancy of hepatobiliary system & pancreas,07,Diseases and Disorders of the Hepatobiliary System and Pancreas,2,Moderate,Moderate,Medical,Medicare,Medicare,Private Health Insurance,,N,Y,150582.63,33921.71
Long Island,Nassau,2908000,000511,NYU Winthrop Hospital,70 or Older,115,M,White,Not Span/Hispanic,10,Emergency,Home w/ Home Health Services,2017,017,Cancer of pancreas,000,NO PROC,281,Malignancy of hepatobiliary system & pancreas,07,Diseases and Disorders of the Hepatobiliary System and Pancreas,3,Major,Major,Medical,Medicare,Medicare,,,N,Y,149887.48,28228.43
Long Island,Nassau,2908000,000511,NYU Winthrop Hospital,50 to 69,115,M,White,Not Span/Hispanic,6,Emergency,Home or Self Care,2017,016,Cancer of liver and intrahepatic bile duct,011,DX ENDOCRINE PRCS,281,Malignancy of hepatobiliary system & pancreas,07,Diseases and Disorders of the Hepatobiliary System and Pancreas,3,Major,Moderate,Medical,Medicaid,Medicaid,,,N,Y,108203.47,19601.13
Long Island,Nassau,2908000,000511,NYU Winthrop Hospital,70 or Older,115,M,White,Not Span/Hispanic,4,Emergency,Home or Self Care,2017,017,Cancer of pancreas,097,OTHER GI DX PRCS,281,Malignancy of hepatobiliary system & pancreas,07,Diseases and Disorders of the Hepatobiliary System and Pancreas,3,Major,Moderate,Medical,Medicare,Medicare,Blue Cross/Blue Shield,,N,Y,126237.37,24193.01