Hospital Service Area,Hospital County,Operating Certificate Number,Permanent Facility Id,Facility Name,Age Group,Zip Code - 3 digits,Gender,Race,Ethnicity,Length of Stay,Type of Admission,Patient Disposition,Discharge Year,CCS Diagnosis Code,CCS Diagnosis Description,CCS Procedure Code,CCS Procedure Description,APR DRG Code,APR DRG Description,APR MDC Code,APR MDC Description,APR Severity of Illness Code,APR Severity of Illness Description,APR Risk of Mortality,APR Medical Surgical Description,Payment Typology 1,Payment Typology 2,Payment Typology 3,Birth Weight,Abortion Edit Indicator,Emergency Department Indicator,Total Charges,Total Costs
Hudson Valley,Westchester,5920000,001117,Northern Westchester Hospital,70 or Older,105,F,White,Not Span/Hispanic,7,Emergency,Home w/ Home Health Services,2018,NEO051,ENDOCRINE SYSTEM CANCERS - PANCREAS,RES005,CHEST TUBE PLACEMENT AND THERAPEUTIC THORACENTESIS,281,MALIGNANCY OF HEPATOBILIARY SYSTEM & PANCREAS,07,DISEASES AND DISORDERS OF THE HEPATOBILIARY SYSTEM AND PANCREAS,4,Extreme,Extreme,Medical,Medicare,Private Health Insurance,,,,true,72829.03,35950.35
New York City,Manhattan,7002054,001464,New York-Presbyterian Hospital - Columbia Presbyterian Center,50 to 69,125,M,White,Not Span/Hispanic,13,Emergency,Hospice - Home,2018,NEO051,ENDOCRINE SYSTEM CANCERS - PANCREAS,GIS006,PARACENTESIS,281,MALIGNANCY OF HEPATOBILIARY SYSTEM & PANCREAS,07,DISEASES AND DISORDERS OF THE HEPATOBILIARY SYSTEM AND PANCREAS,3,Major,Major,Medical,Medicare,Medicare,Self-Pay,,,true,167150.23,41173.29
New York City,Manhattan,7002054,001464,New York-Presbyterian Hospital - Columbia Presbyterian Center,70 or Older,105,F,White,Not Span/Hispanic,2,Urgent,Home or Self Care,2018,NEO021,GASTROINTESTINAL CANCERS - ALL OTHER TYPES,HEP003,DIAGNOSTIC ERCP WITH OR WITHOUT BIOPSY,281,MALIGNANCY OF HEPATOBILIARY SYSTEM & PANCREAS,07,DISEASES AND DISORDERS OF THE HEPATOBILIARY SYSTEM AND PANCREAS,2,Moderate,Moderate,Medical,Medicare,Private Health Insurance,Self-Pay,,,false,34700.25,9899.57
New York City,Manhattan,7002054,001464,New York-Presbyterian Hospital - Columbia Presbyterian Center,50 to 69,111,F,Multi-racial,Multi-ethnic,1,Emergency,Medicare Cert Long Term Care Hospital,2018,NEO070,SECONDARY MALIGNANCIES,,,281,MALIGNANCY OF HEPATOBILIARY SYSTEM & PANCREAS,07,DISEASES AND DISORDERS OF THE HEPATOBILIARY SYSTEM AND PANCREAS,4,Extreme,Major,Medical,Medicare,Medicare,Self-Pay,,,true,21965.51,5391.24
Long Island,Nassau,7003004,000518,Long Island Jewish Valley Stream,50 to 69,104,F,Black/African American,Not Span/Hispanic,6,Emergency,Home w/ Home Health Services,2018,NEO021,GASTROINTESTINAL CANCERS - ALL OTHER TYPES,HEP003,DIAGNOSTIC ERCP WITH OR WITHOUT BIOPSY,281,MALIGNANCY OF HEPATOBILIARY SYSTEM & PANCREAS,07,DISEASES AND DISORDERS OF THE HEPATOBILIARY SYSTEM AND PANCREAS,3,Major,Minor,Medical,Medicaid,Medicaid,,,,true,122135.67,23189.28
New York City,Queens,7003004,001630,Long Island Jewish Medical Center,70 or Older,114,F,Other Race,Not Span/Hispanic,5,Emergency,Expired,2018,NEO051,ENDOCRINE SYSTEM CANCERS - PANCREAS,GIS004,GI SYSTEM ENDOSCOPY WITHOUT BIOPSY (DIAGNOSTIC),281,MALIGNANCY OF HEPATOBILIARY SYSTEM & PANCREAS,07,DISEASES AND DISORDERS OF THE HEPATOBILIARY SYSTEM AND PANCREAS,3,Major,Major,Medical,Medicaid,Self-Pay,,,,false,71139.57,13287.64
Long Island,Suffolk,5157003,000943,St Catherine of Siena Hospital,50 to 69,117,M,White,Not Span/Hispanic,1,Emergency,Home or Self Care,2018,NEO051,ENDOCRINE SYSTEM CANCERS - PANCREAS,,,281,MALIGNANCY OF HEPATOBILIARY SYSTEM & PANCREAS,07,DISEASES AND DISORDERS OF THE HEPATOBILIARY SYSTEM AND PANCREAS,2,Moderate,Moderate,Medical,Medicare,Private Health Insurance,,,,true,15687,2388.21
New York City,Bronx,7000006,003058,Montefiore Med Center - Jack D Weiler Hosp of A Einstein College Div,50 to 69,104,F,Other Race,Not Span/Hispanic,8,Emergency,Home w/ Home Health Services,2018,NEO070,SECONDARY MALIGNANCIES,HEP001,LIVER BIOPSY,281,MALIGNANCY OF HEPATOBILIARY SYSTEM & PANCREAS,07,DISEASES AND DISORDERS OF THE HEPATOBILIARY SYSTEM AND PANCREAS,2,Moderate,Moderate,Medical,Private Health Insurance,,,,,true,100404.45,16127.82
New York City,Manhattan,7002020,001453,Memorial Hospital for Cancer and Allied Diseases,50 to 69,100,M,Other Race,Not Span/Hispanic,6,Emergency,Home w/ Home Health Services,2018,NEO021,GASTROINTESTINAL CANCERS - ALL OTHER TYPES,GIS004,GI SYSTEM ENDOSCOPY WITHOUT BIOPSY (DIAGNOSTIC),281,MALIGNANCY OF HEPATOBILIARY SYSTEM & PANCREAS,07,DISEASES AND DISORDERS OF THE HEPATOBILIARY SYSTEM AND PANCREAS,4,Extreme,Major,Medical,Private Health Insurance,,,,,false,59783.87,23183.29
New York City,Manhattan,7002020,001453,Memorial Hospital for Cancer and Allied Diseases,50 to 69,117,M,White,Not Span/Hispanic,3,Emergency,Home or Self Care,2018,NEO070,SECONDARY MALIGNANCIES,GIS001,ESOPHAGOGASTRODUODENOSCOPY (EGD) WITH BIOPSY,281,MALIGNANCY OF HEPATOBILIARY SYSTEM & PANCREAS,07,DISEASES AND DISORDERS OF THE HEPATOBILIARY SYSTEM AND PANCREAS,3,Major,Major,Medical,Private Health Insurance,Federal/State/Local/VA,,,,false,23908.4,8552.03
New York City,Bronx,7000008,001172,Lincoln Medical & Mental Health Center,50 to 69,104,M,Other Race,Spanish/Hispanic,2,Emergency,Left Against Medical Advice,2018,NEO017,GASTROINTESTINAL CANCERS - LIVER,,,281,MALIGNANCY OF HEPATOBILIARY SYSTEM & PANCREAS,07,DISEASES AND DISORDERS OF THE HEPATOBILIARY SYSTEM AND PANCREAS,4,Extreme,Major,Medical,Medicaid,Medicaid,,,,true,16327.3,9642.2
Finger Lakes,Monroe,2701005,000413,Strong Memorial Hospital,70 or Older,145,M,White,Unknown,7,Urgent,Hospice - Medical Facility,2018,NEO051,ENDOCRINE SYSTEM CANCERS - PANCREAS,ESA001,HEMODIALYSIS,281,MALIGNANCY OF HEPATOBILIARY SYSTEM & PANCREAS,07,DISEASES AND DISORDERS OF THE HEPATOBILIARY SYSTEM AND PANCREAS,4,Extreme,Extreme,Medical,Medicare,,,,,false,24528.7,9671.27
Finger Lakes,Monroe,2701005,000413,Strong Memorial Hospital,50 to 69,145,F,White,Not Span/Hispanic,35,Urgent,Hospice - Home,2018,NEO051,ENDOCRINE SYSTEM CANCERS - PANCREAS,GIS006,PARACENTESIS,281,MALIGNANCY OF HEPATOBILIARY SYSTEM & PANCREAS,07,DISEASES AND DISORDERS OF THE HEPATOBILIARY SYSTEM AND PANCREAS,4,Extreme,Major,Medical,Medicare,,,,,false,67739.9,39386.44
Western NY,Erie,1401008,000213,Mercy Hospital of Buffalo,50 to 69,141,M,White,Not Span/Hispanic,1,Emergency,Home or Self Care,2018,NEO019,GASTROINTESTINAL CANCERS - GALLBLADDER,,,281,MALIGNANCY OF HEPATOBILIARY SYSTEM & PANCREAS,07,DISEASES AND DISORDERS OF THE HEPATOBILIARY SYSTEM AND PANCREAS,2,Moderate,Minor,Medical,Medicare,Medicare,,,,true,12493.73,3141.17
New York City,Bronx,7000008,001172,Lincoln Medical & Mental Health Center,50 to 69,104,M,Other Race,Spanish/Hispanic,2,Emergency,Home or Self Care,2018,NEO017,GASTROINTESTINAL CANCERS - LIVER,ADM021,"ADMINISTRATION OF THERAPEUTIC SUBSTANCES, NEC",281,MALIGNANCY OF HEPATOBILIARY SYSTEM & PANCREAS,07,DISEASES AND DISORDERS OF THE HEPATOBILIARY SYSTEM AND PANCREAS,3,Major,Moderate,Medical,Medicare,Medicare,Medicaid,,,true,16285.76,9617.67
New York City,Queens,7003004,001630,Long Island Jewish Medical Center,50 to 69,113,M,White,Not Span/Hispanic,10,Urgent,Home or Self Care,2018,NEO051,ENDOCRINE SYSTEM CANCERS - PANCREAS,HEP008,COMMON BILE DUCT SPHINCTEROTOMY AND STENTING,281,MALIGNANCY OF HEPATOBILIARY SYSTEM & PANCREAS,07,DISEASES AND DISORDERS OF THE HEPATOBILIARY SYSTEM AND PANCREAS,3,Major,Moderate,Medical,Medicare,Blue Cross/Blue Shield,Self-Pay,,,false,130821.46,23932.52
New York City,Kings,7001021,001306,New York - Presbyterian Brooklyn Methodist Hospital,70 or Older,112,F,Other Race,Spanish/Hispanic,7,Emergency,Home or Self Care,2018,NEO070,SECONDARY MALIGNANCIES,GIS001,ESOPHAGOGASTRODUODENOSCOPY (EGD) WITH BIOPSY,281,MALIGNANCY OF HEPATOBILIARY SYSTEM & PANCREAS,07,DISEASES AND DISORDERS OF THE HEPATOBILIARY SYSTEM AND PANCREAS,4,Extreme,Extreme,Medical,Medicare,Medicare,Self-Pay,,,true,44790.63,10925
New York City,Kings,7001021,001306,New York - Presbyterian Brooklyn Methodist Hospital,50 to 69,112,F,Black/African American,Not Span/Hispanic,20,Emergency,Hospice - Medical Facility,2018,NEO051,ENDOCRINE SYSTEM CANCERS - PANCREAS,HEP003,DIAGNOSTIC ERCP WITH OR WITHOUT BIOPSY,281,MALIGNANCY OF HEPATOBILIARY SYSTEM & PANCREAS,07,DISEASES AND DISORDERS OF THE HEPATOBILIARY SYSTEM AND PANCREAS,4,Extreme,Extreme,Medical,Medicare,Medicaid,Self-Pay,,,true,202165.16,59862.04
New York City,Kings,7001021,001306,New York - Presbyterian Brooklyn Methodist Hospital,70 or Older,112,F,White,Not Span/Hispanic,5,Emergency,Home or Self Care,2018,NEO051,ENDOCRINE SYSTEM CANCERS - PANCREAS,HEP008,COMMON BILE DUCT SPHINCTEROTOMY AND STENTING,281,MALIGNANCY OF HEPATOBILIARY SYSTEM & PANCREAS,07,DISEASES AND DISORDERS OF THE HEPATOBILIARY SYSTEM AND PANCREAS,3,Major,Major,Medical,Blue Cross/Blue Shield,Medicare,Self-Pay,,,true,46224.55,8994.11
New York City,Bronx,7000006,003058,Montefiore Med Center - Jack D Weiler Hosp of A Einstein College Div,70 or Older,104,F,White,Not Span/Hispanic,9,Emergency,Skilled Nursing Home,2018,NEO051,ENDOCRINE SYSTEM CANCERS - PANCREAS,HEP008,COMMON BILE DUCT SPHINCTEROTOMY AND STENTING,281,MALIGNANCY OF HEPATOBILIARY SYSTEM & PANCREAS,07,DISEASES AND DISORDERS OF THE HEPATOBILIARY SYSTEM AND PANCREAS,3,Major,Major,Medical,Medicare,Private Health Insurance,,,,true,110002.23,24035.46
New York City,Bronx,7000006,003058,Montefiore Med Center - Jack D Weiler Hosp of A Einstein College Div,70 or Older,104,F,Other Race,Spanish/Hispanic,6,Emergency,Home w/ Home Health Services,2018,NEO018,GASTROINTESTINAL CANCERS - BILE DUCT,HEP003,DIAGNOSTIC ERCP WITH OR WITHOUT BIOPSY,281,MALIGNANCY OF HEPATOBILIARY SYSTEM & PANCREAS,07,DISEASES AND DISORDERS OF THE HEPATOBILIARY SYSTEM AND PANCREAS,3,Major,Major,Medical,Medicare,Medicaid,,,,true,119931.74,29957.29
New York City,Kings,7001016,001301,Kings County Hospital Center,50 to 69,112,F,Black/African American,Not Span/Hispanic,2,Emergency,Home or Self Care,2018,NEO051,ENDOCRINE SYSTEM CANCERS - PANCREAS,HEP003,DIAGNOSTIC ERCP WITH OR WITHOUT BIOPSY,281,MALIGNANCY OF HEPATOBILIARY SYSTEM & PANCREAS,07,DISEASES AND DISORDERS OF THE HEPATOBILIARY SYSTEM AND PANCREAS,1,Minor,Minor,Medical,Medicare,Private Health Insurance,,,,true,20147.59,14312.06
New York City,Manhattan,7002020,001453,Memorial Hospital for Cancer and Allied Diseases,70 or Older,112,M,White,Spanish/Hispanic,13,Elective,Home w/ Home Health Services,2018,NEO051,ENDOCRINE SYSTEM CANCERS - PANCREAS,MST003,"SUBCUTANEOUS TISSUE, FASCIA, AND MUSCLE BIOPSY",281,MALIGNANCY OF HEPATOBILIARY SYSTEM & PANCREAS,07,DISEASES AND DISORDERS OF THE HEPATOBILIARY SYSTEM AND PANCREAS,3,Major,Extreme,Medical,"Managed Care, Unspecified",,,,,false,176659.57,68731.58
Hudson Valley,Orange,3523000,000699,Garnet Health Medical Center,50 to 69,109,F,White,Not Span/Hispanic,2,Emergency,Home or Self Care,2018,NEO070,SECONDARY MALIGNANCIES,HEP001,LIVER BIOPSY,281,MALIGNANCY OF HEPATOBILIARY SYSTEM & PANCREAS,07,DISEASES AND DISORDERS OF THE HEPATOBILIARY SYSTEM AND PANCREAS,2,Moderate,Moderate,Medical,Blue Cross/Blue Shield,,,,,true,26296.72,6709.89
Capital/Adirond,Albany,0101004,000005,St. Peter's Hospital,70 or Older,120,F,White,Not Span/Hispanic,3,Emergency,Home or Self Care,2018,NEO051,ENDOCRINE SYSTEM CANCERS - PANCREAS,HEP008,COMMON BILE DUCT SPHINCTEROTOMY AND STENTING,281,MALIGNANCY OF HEPATOBILIARY SYSTEM & PANCREAS,07,DISEASES AND DISORDERS OF THE HEPATOBILIARY SYSTEM AND PANCREAS,3,Major,Moderate,Medical,Medicare,Medicare,,,,true,30247.83,10416.67
New York City,Queens,7003003,001629,Jamaica Hospital Medical Center,50 to 69,,M,Black/African American,Not Span/Hispanic,1,Emergency,Hospice - Medical Facility,2018,NEO017,GASTROINTESTINAL CANCERS - LIVER,ADM020,"ADMINISTRATION OF DIAGNOSTIC SUBSTANCES, NEC",281,MALIGNANCY OF HEPATOBILIARY SYSTEM & PANCREAS,07,DISEASES AND DISORDERS OF THE HEPATOBILIARY SYSTEM AND PANCREAS,3,Major,Moderate,Medical,Medicare,,,,,true,5139,2258.93
Southern Tier,Broome,0303001,000058,United Health Services Hospitals Inc. - Wilson Medical Center,70 or Older,138,F,White,Not Span/Hispanic,13,Emergency,Skilled Nursing Home,2018,NEO051,ENDOCRINE SYSTEM CANCERS - PANCREAS,GIS004,GI SYSTEM ENDOSCOPY WITHOUT BIOPSY (DIAGNOSTIC),281,MALIGNANCY OF HEPATOBILIARY SYSTEM & PANCREAS,07,DISEASES AND DISORDERS OF THE HEPATOBILIARY SYSTEM AND PANCREAS,3,Major,Major,Medical,Medicare,Medicare,,,,true,31897.7,17955.02
New York City,Bronx,7000011,001175,Calvary Hospital Inc,70 or Older,107,F,White,Not Span/Hispanic,14,Elective,Expired,2018,NEO051,ENDOCRINE SYSTEM CANCERS - PANCREAS,,,281,MALIGNANCY OF HEPATOBILIARY SYSTEM & PANCREAS,07,DISEASES AND DISORDERS OF THE HEPATOBILIARY SYSTEM AND PANCREAS,3,Major,Major,Medical,Medicare,Medicare,,,,false,28919,14835.46
New York City,Bronx,7000006,003058,Montefiore Med Center - Jack D Weiler Hosp of A Einstein College Div,70 or Older,104,F,White,Not Span/Hispanic,5,Emergency,Home or Self Care,2018,NEO051,ENDOCRINE SYSTEM CANCERS - PANCREAS,GIS025,OTHER GI SYSTEM DEVICE PROCEDURES,281,MALIGNANCY OF HEPATOBILIARY SYSTEM & PANCREAS,07,DISEASES AND DISORDERS OF THE HEPATOBILIARY SYSTEM AND PANCREAS,3,Major,Major,Medical,Medicare,Medicaid,,,,true,76161.86,19539.92
New York City,Manhattan,7002054,001464,New York-Presbyterian Hospital - Columbia Presbyterian Center,70 or Older,104,M,White,Spanish/Hispanic,7,Emergency,Skilled Nursing Home,2018,NEO017,GASTROINTESTINAL CANCERS - LIVER,GIS006,PARACENTESIS,281,MALIGNANCY OF HEPATOBILIARY SYSTEM & PANCREAS,07,DISEASES AND DISORDERS OF THE HEPATOBILIARY SYSTEM AND PANCREAS,4,Extreme,Major,Medical,Medicare,Medicare,Medicaid,,,true,105285.4,23545.38
Central NY,Onondaga,3301007,000635,University Hospital SUNY Health Science Center,70 or Older,136,F,White,Not Span/Hispanic,6,Emergency,Skilled Nursing Home,2018,NEO051,ENDOCRINE SYSTEM CANCERS - PANCREAS,HEP003,DIAGNOSTIC ERCP WITH OR WITHOUT BIOPSY,281,MALIGNANCY OF HEPATOBILIARY SYSTEM & PANCREAS,07,DISEASES AND DISORDERS OF THE HEPATOBILIARY SYSTEM AND PANCREAS,3,Major,Moderate,Medical,Medicare,Private Health Insurance,,,,true,57175.04,16416.71
New York City,Kings,7002002,001324,Mount Sinai Brooklyn,30 to 49,112,M,White,Not Span/Hispanic,7,Emergency,Home or Self Care,2018,NEO017,GASTROINTESTINAL CANCERS - LIVER,IMG005,MAGNETIC RESONANCE IMAGING (MRI),281,MALIGNANCY OF HEPATOBILIARY SYSTEM & PANCREAS,07,DISEASES AND DISORDERS OF THE HEPATOBILIARY SYSTEM AND PANCREAS,1,Minor,Minor,Medical,Medicaid,Medicaid,Self-Pay,,,false,69168.71,11629.73
New York City,Manhattan,7002032,001466,Mount Sinai West,70 or Older,104,F,White,Not Span/Hispanic,7,Emergency,Skilled Nursing Home,2018,NEO070,SECONDARY MALIGNANCIES,HEP001,LIVER BIOPSY,281,MALIGNANCY OF HEPATOBILIARY SYSTEM & PANCREAS,07,DISEASES AND DISORDERS OF THE HEPATOBILIARY SYSTEM AND PANCREAS,3,Major,Major,Medical,Medicare,Private Health Insurance,Self-Pay,,,true,99630.01,25325.79
New York City,Queens,7003004,001630,Long Island Jewish Medical Center,70 or Older,114,F,Other Race,Not Span/Hispanic,8,Emergency,Home or Self Care,2018,NEO051,ENDOCRINE SYSTEM CANCERS - PANCREAS,HEP010,HEPATOBILIARY AND PANCREATIC DRAINAGE,281,MALIGNANCY OF HEPATOBILIARY SYSTEM & PANCREAS,07,DISEASES AND DISORDERS OF THE HEPATOBILIARY SYSTEM AND PANCREAS,3,Major,Major,Medical,Medicare,Medicaid,Self-Pay,,,true,113866.99,24743
Long Island,Suffolk,5149000,000895,John T Mather Memorial Hospital of Port Jefferson New York Inc,50 to 69,117,M,Other Race,Spanish/Hispanic,2,Emergency,Short-term Hospital,2018,NEO021,GASTROINTESTINAL CANCERS - ALL OTHER TYPES,,,281,MALIGNANCY OF HEPATOBILIARY SYSTEM & PANCREAS,07,DISEASES AND DISORDERS OF THE HEPATOBILIARY SYSTEM AND PANCREAS,2,Moderate,Moderate,Medical,Private Health Insurance,Medicaid,,,,true,22323.5,5020.75
Capital/Adirond,Schenectady,4601001,000829,Ellis Hospital,70 or Older,123,F,White,Not Span/Hispanic,4,Emergency,Home w/ Home Health Services,2018,NEO070,SECONDARY MALIGNANCIES,GIS006,PARACENTESIS,281,MALIGNANCY OF HEPATOBILIARY SYSTEM & PANCREAS,07,DISEASES AND DISORDERS OF THE HEPATOBILIARY SYSTEM AND PANCREAS,3,Major,Major,Medical,Medicare,Medicare,Private Health Insurance,,,true,27829.79,7106.54
New York City,Manhattan,7002054,001458,New York-Presbyterian Hospital - New York Weill Cornell Center,70 or Older,113,M,White,Not Span/Hispanic,15,Emergency,Home w/ Home Health Services,2018,NEO051,ENDOCRINE SYSTEM CANCERS - PANCREAS,SKB002,INCISION AND DRAINAGE OF SKIN,281,MALIGNANCY OF HEPATOBILIARY SYSTEM & PANCREAS,07,DISEASES AND DISORDERS OF THE HEPATOBILIARY SYSTEM AND PANCREAS,3,Major,Major,Medical,Medicare,Private Health Insurance,Self-Pay,,,true,221617.71,51578.99
New York City,Manhattan,7002054,001458,New York-Presbyterian Hospital - New York Weill Cornell Center,70 or Older,113,M,White,Not Span/Hispanic,20,Emergency,Skilled Nursing Home,2018,NEO051,ENDOCRINE SYSTEM CANCERS - PANCREAS,HEP001,LIVER BIOPSY,281,MALIGNANCY OF HEPATOBILIARY SYSTEM & PANCREAS,07,DISEASES AND DISORDERS OF THE HEPATOBILIARY SYSTEM AND PANCREAS,4,Extreme,Major,Medical,Medicare,Private Health Insurance,Self-Pay,,,true,233362.3,57734.81
New York City,Manhattan,7002054,001458,New York-Presbyterian Hospital - New York Weill Cornell Center,50 to 69,104,F,Other Race,Spanish/Hispanic,3,Emergency,Hospice - Home,2018,NEO051,ENDOCRINE SYSTEM CANCERS - PANCREAS,GIS024,OTHER PERITONEAL CAVITY PROCEDURES,281,MALIGNANCY OF HEPATOBILIARY SYSTEM & PANCREAS,07,DISEASES AND DISORDERS OF THE HEPATOBILIARY SYSTEM AND PANCREAS,4,Extreme,Extreme,Medical,Medicare,Medicaid,Self-Pay,,,true,52692.6,13777.28
New York City,Queens,7003004,001630,Long Island Jewish Medical Center,50 to 69,113,F,Other Race,Spanish/Hispanic,19,Urgent,Home or Self Care,2018,NEO051,ENDOCRINE SYSTEM CANCERS - PANCREAS,HEP008,COMMON BILE DUCT SPHINCTEROTOMY AND STENTING,281,MALIGNANCY OF HEPATOBILIARY SYSTEM & PANCREAS,07,DISEASES AND DISORDERS OF THE HEPATOBILIARY SYSTEM AND PANCREAS,2,Moderate,Minor,Medical,Medicare,Medicare,Self-Pay,,,true,215996.86,39164.45
Hudson Valley,Westchester,5920000,001117,Northern Westchester Hospital,70 or Older,105,F,White,Not Span/Hispanic,5,Emergency,Hospice - Medical Facility,2018,NEO051,ENDOCRINE SYSTEM CANCERS - PANCREAS,GIS006,PARACENTESIS,281,MALIGNANCY OF HEPATOBILIARY SYSTEM & PANCREAS,07,DISEASES AND DISORDERS OF THE HEPATOBILIARY SYSTEM AND PANCREAS,3,Major,Extreme,Medical,Medicare,Private Health Insurance,,,,true,23549.75,11700.93
Long Island,Nassau,2950001,000527,Mount Sinai South Nassau,50 to 69,115,M,White,Not Span/Hispanic,34,Emergency,Expired,2018,NEO051,ENDOCRINE SYSTEM CANCERS - PANCREAS,GIS006,PARACENTESIS,281,MALIGNANCY OF HEPATOBILIARY SYSTEM & PANCREAS,07,DISEASES AND DISORDERS OF THE HEPATOBILIARY SYSTEM AND PANCREAS,3,Major,Major,Medical,Medicare,Blue Cross/Blue Shield,,,,true,220735.42,42933.54
New York City,Manhattan,7002020,001453,Memorial Hospital for Cancer and Allied Diseases,50 to 69,100,F,White,Not Span/Hispanic,4,Emergency,Expired,2018,NEO051,ENDOCRINE SYSTEM CANCERS - PANCREAS,,,281,MALIGNANCY OF HEPATOBILIARY SYSTEM & PANCREAS,07,DISEASES AND DISORDERS OF THE HEPATOBILIARY SYSTEM AND PANCREAS,4,Extreme,Extreme,Medical,Private Health Insurance,,,,,false,21358.15,8997.58
New York City,Queens,7003004,001630,Long Island Jewish Medical Center,70 or Older,114,M,White,Not Span/Hispanic,2,Emergency,Home or Self Care,2018,NEO070,SECONDARY MALIGNANCIES,ESA001,HEMODIALYSIS,281,MALIGNANCY OF HEPATOBILIARY SYSTEM & PANCREAS,07,DISEASES AND DISORDERS OF THE HEPATOBILIARY SYSTEM AND PANCREAS,3,Major,Major,Medical,Medicare,Private Health Insurance,Self-Pay,,,false,24274.03,3988.73
New York City,Queens,7003004,001630,Long Island Jewish Medical Center,50 to 69,115,F,White,Not Span/Hispanic,4,Urgent,Home or Self Care,2018,NEO051,ENDOCRINE SYSTEM CANCERS - PANCREAS,,,281,MALIGNANCY OF HEPATOBILIARY SYSTEM & PANCREAS,07,DISEASES AND DISORDERS OF THE HEPATOBILIARY SYSTEM AND PANCREAS,2,Moderate,Moderate,Medical,Private Health Insurance,Medicare,Self-Pay,,,false,44709.66,8341.57
New York City,Kings,7002002,001324,Mount Sinai Brooklyn,50 to 69,112,M,Black/African American,Not Span/Hispanic,18,Emergency,Expired,2018,NEO051,ENDOCRINE SYSTEM CANCERS - PANCREAS,GIS007,GI SYSTEM DRAINAGE (EXCLUDING PARACENTESIS),281,MALIGNANCY OF HEPATOBILIARY SYSTEM & PANCREAS,07,DISEASES AND DISORDERS OF THE HEPATOBILIARY SYSTEM AND PANCREAS,4,Extreme,Major,Medical,Private Health Insurance,Private Health Insurance,Self-Pay,,,true,223805.91,38484.22
New York City,Queens,7003004,001630,Long Island Jewish Medical Center,50 to 69,114,F,Other Race,Not Span/Hispanic,17,Emergency,Hospice - Medical Facility,2018,NEO051,ENDOCRINE SYSTEM CANCERS - PANCREAS,HEP003,DIAGNOSTIC ERCP WITH OR WITHOUT BIOPSY,281,MALIGNANCY OF HEPATOBILIARY SYSTEM & PANCREAS,07,DISEASES AND DISORDERS OF THE HEPATOBILIARY SYSTEM AND PANCREAS,4,Extreme,Major,Medical,Medicaid,Self-Pay,,,,true,193852.26,35267.77
New York City,Manhattan,7002002,001439,Mount Sinai Beth Israel,70 or Older,112,F,Black/African American,Unknown,6,Emergency,Hospice - Home,2018,NEO051,ENDOCRINE SYSTEM CANCERS - PANCREAS,GIS001,ESOPHAGOGASTRODUODENOSCOPY (EGD) WITH BIOPSY,281,MALIGNANCY OF HEPATOBILIARY SYSTEM & PANCREAS,07,DISEASES AND DISORDERS OF THE HEPATOBILIARY SYSTEM AND PANCREAS,4,Extreme,Extreme,Medical,Medicaid,Self-Pay,,,,true,85294.25,18173.76
New York City,Manhattan,7002020,001453,Memorial Hospital for Cancer and Allied Diseases,50 to 69,108,F,White,Not Span/Hispanic,2,Emergency,Home or Self Care,2018,NEO070,SECONDARY MALIGNANCIES,CNS002,LUMBAR PUNCTURE,281,MALIGNANCY OF HEPATOBILIARY SYSTEM & PANCREAS,07,DISEASES AND DISORDERS OF THE HEPATOBILIARY SYSTEM AND PANCREAS,4,Extreme,Extreme,Medical,Private Health Insurance,,,,,true,58636.26,14329.61
New York City,Kings,7001021,001306,New York - Presbyterian Brooklyn Methodist Hospital,50 to 69,112,M,Other Race,Not Span/Hispanic,1,Emergency,Home or Self Care,2018,NEO070,SECONDARY MALIGNANCIES,,,281,MALIGNANCY OF HEPATOBILIARY SYSTEM & PANCREAS,07,DISEASES AND DISORDERS OF THE HEPATOBILIARY SYSTEM AND PANCREAS,2,Moderate,Moderate,Medical,Medicare,Medicare,Self-Pay,,,true,10477.66,2439.67
New York City,Bronx,7000006,001169,Montefiore Medical Center - Henry & Lucy Moses Div,70 or Older,104,F,White,Not Span/Hispanic,6,Emergency,Home w/ Home Health Services,2018,NEO051,ENDOCRINE SYSTEM CANCERS - PANCREAS,HEP008,COMMON BILE DUCT SPHINCTEROTOMY AND STENTING,281,MALIGNANCY OF HEPATOBILIARY SYSTEM & PANCREAS,07,DISEASES AND DISORDERS OF THE HEPATOBILIARY SYSTEM AND PANCREAS,2,Moderate,Minor,Medical,Medicare,Medicaid,,,,true,82266.53,23093.21
Western NY,Erie,1401014,000207,Buffalo General Medical Center,70 or Older,140,M,White,Not Span/Hispanic,13,Emergency,Home w/ Home Health Services,2018,NEO051,ENDOCRINE SYSTEM CANCERS - PANCREAS,HEP008,COMMON BILE DUCT SPHINCTEROTOMY AND STENTING,281,MALIGNANCY OF HEPATOBILIARY SYSTEM & PANCREAS,07,DISEASES AND DISORDERS OF THE HEPATOBILIARY SYSTEM AND PANCREAS,3,Major,Extreme,Medical,Medicare,Federal/State/Local/VA,Self-Pay,,,true,48124.58,22394.5
New York City,Queens,7003010,001637,New York - Presbyterian/Queens,50 to 69,114,M,Black/African American,Not Span/Hispanic,4,Emergency,Hospice - Home,2018,NEO070,SECONDARY MALIGNANCIES,ADM017,ADMINISTRATION OF NUTRITIONAL AND ELECTROLYTIC SUBSTANCES,281,MALIGNANCY OF HEPATOBILIARY SYSTEM & PANCREAS,07,DISEASES AND DISORDERS OF THE HEPATOBILIARY SYSTEM AND PANCREAS,3,Major,Moderate,Medical,Medicare,Self-Pay,,,,true,29313.99,7262.32
Finger Lakes,Monroe,2701001,000409,Highland Hospital,70 or Older,144,M,White,Not Span/Hispanic,2,Emergency,Hospice - Medical Facility,2018,NEO051,ENDOCRINE SYSTEM CANCERS - PANCREAS,GIS006,PARACENTESIS,281,MALIGNANCY OF HEPATOBILIARY SYSTEM & PANCREAS,07,DISEASES AND DISORDERS OF THE HEPATOBILIARY SYSTEM AND PANCREAS,4,Extreme,Extreme,Medical,Medicare,,,,,true,13353.21,3212.54