Hospital Service Area,Hospital County,Operating Certificate Number,Permanent Facility Id,Facility Name,Age Group,Zip Code - 3 digits,Gender,Race,Ethnicity,Length of Stay,Type of Admission,Patient Disposition,Discharge Year,CCS Diagnosis Code,CCS Diagnosis Description,CCS Procedure Code,CCS Procedure Description,APR DRG Code,APR DRG Description,APR MDC Code,APR MDC Description,APR Severity of Illness Code,APR Severity of Illness Description,APR Risk of Mortality,APR Medical Surgical Description,Payment Typology 1,Payment Typology 2,Payment Typology 3,Birth Weight,Abortion Edit Indicator,Emergency Department Indicator,Total Charges,Total Costs
Long Island,Suffolk,5123000,000885,Long Island Community Hospital,70 or Older,117,F,White,Not Span/Hispanic,21,Emergency,Hospice - Medical Facility,2019,NEO017,GASTROINTESTINAL CANCERS - LIVER,ADM006,INFUSION OF VASOPRESSOR,281,MALIGNANCY OF HEPATOBILIARY SYSTEM & PANCREAS,07,DISEASES AND DISORDERS OF THE HEPATOBILIARY SYSTEM AND PANCREAS,4,Extreme,Extreme,Medical,Medicare,Medicare,Blue Cross/Blue Shield,,,true,241830.53,49238.31
Long Island,Suffolk,5123000,000885,Long Island Community Hospital,50 to 69,117,F,White,Not Span/Hispanic,3,Emergency,Short-term Hospital,2019,NEO051,ENDOCRINE SYSTEM CANCERS - PANCREAS,,,281,MALIGNANCY OF HEPATOBILIARY SYSTEM & PANCREAS,07,DISEASES AND DISORDERS OF THE HEPATOBILIARY SYSTEM AND PANCREAS,3,Major,Moderate,Medical,Medicare,Medicaid,Medicare,,,true,51990.29,7707.03
Long Island,Suffolk,5123000,000885,Long Island Community Hospital,70 or Older,117,M,White,Not Span/Hispanic,6,Emergency,Home w/ Home Health Services,2019,NEO070,SECONDARY MALIGNANCIES,,,281,MALIGNANCY OF HEPATOBILIARY SYSTEM & PANCREAS,07,DISEASES AND DISORDERS OF THE HEPATOBILIARY SYSTEM AND PANCREAS,3,Major,Moderate,Medical,Medicare,Medicare,Private Health Insurance,,,true,65088.63,9691.72
Long Island,Suffolk,5123000,000885,Long Island Community Hospital,70 or Older,119,M,White,Not Span/Hispanic,3,Emergency,Expired,2019,NEO019,GASTROINTESTINAL CANCERS - GALLBLADDER,SUD002,PHARMACOTHERAPY FOR SUBSTANCE USE,281,MALIGNANCY OF HEPATOBILIARY SYSTEM & PANCREAS,07,DISEASES AND DISORDERS OF THE HEPATOBILIARY SYSTEM AND PANCREAS,3,Major,Major,Medical,Medicare,Medicare,Private Health Insurance,,,true,22059.39,4416.37
Long Island,Suffolk,5123000,000885,Long Island Community Hospital,70 or Older,117,M,White,Not Span/Hispanic,5,Emergency,Home or Self Care,2019,NEO051,ENDOCRINE SYSTEM CANCERS - PANCREAS,,,281,MALIGNANCY OF HEPATOBILIARY SYSTEM & PANCREAS,07,DISEASES AND DISORDERS OF THE HEPATOBILIARY SYSTEM AND PANCREAS,2,Moderate,Moderate,Medical,Medicare,,,,,true,52302.15,8399.7
Long Island,Suffolk,5123000,000885,Long Island Community Hospital,70 or Older,117,F,White,Not Span/Hispanic,6,Emergency,Home or Self Care,2019,NEO051,ENDOCRINE SYSTEM CANCERS - PANCREAS,,,281,MALIGNANCY OF HEPATOBILIARY SYSTEM & PANCREAS,07,DISEASES AND DISORDERS OF THE HEPATOBILIARY SYSTEM AND PANCREAS,2,Moderate,Moderate,Medical,Medicare,Medicare,Private Health Insurance,,,true,48929.77,8227.01
Long Island,Suffolk,5123000,000885,Long Island Community Hospital,70 or Older,117,F,White,Not Span/Hispanic,2,Emergency,Hospice - Home,2019,NEO051,ENDOCRINE SYSTEM CANCERS - PANCREAS,,,281,MALIGNANCY OF HEPATOBILIARY SYSTEM & PANCREAS,07,DISEASES AND DISORDERS OF THE HEPATOBILIARY SYSTEM AND PANCREAS,2,Moderate,Major,Medical,Medicare,Medicare,Blue Cross/Blue Shield,,,true,33909.2,4263.1
Long Island,Suffolk,5123000,000885,Long Island Community Hospital,70 or Older,117,F,White,Not Span/Hispanic,5,Emergency,Home w/ Home Health Services,2019,NEO051,ENDOCRINE SYSTEM CANCERS - PANCREAS,HEP003,DIAGNOSTIC ERCP WITH OR WITHOUT BIOPSY,281,MALIGNANCY OF HEPATOBILIARY SYSTEM & PANCREAS,07,DISEASES AND DISORDERS OF THE HEPATOBILIARY SYSTEM AND PANCREAS,3,Major,Moderate,Medical,Medicare,Medicare,Private Health Insurance,,,true,58446.9,10077.14
Long Island,Suffolk,5123000,000885,Long Island Community Hospital,70 or Older,117,F,Black/African American,Not Span/Hispanic,18,Emergency,Expired,2019,NEO051,ENDOCRINE SYSTEM CANCERS - PANCREAS,,,281,MALIGNANCY OF HEPATOBILIARY SYSTEM & PANCREAS,07,DISEASES AND DISORDERS OF THE HEPATOBILIARY SYSTEM AND PANCREAS,4,Extreme,Extreme,Medical,Medicare,Medicare,,,,true,118554.11,23855.26
Long Island,Suffolk,5123000,000885,Long Island Community Hospital,50 to 69,117,M,White,Not Span/Hispanic,3,Emergency,Home or Self Care,2019,NEO017,GASTROINTESTINAL CANCERS - LIVER,GIS004,GI SYSTEM ENDOSCOPY WITHOUT BIOPSY (DIAGNOSTIC),281,MALIGNANCY OF HEPATOBILIARY SYSTEM & PANCREAS,07,DISEASES AND DISORDERS OF THE HEPATOBILIARY SYSTEM AND PANCREAS,3,Major,Major,Medical,Medicare,Medicare,,,,true,51391.61,9198.31
Long Island,Suffolk,5123000,000885,Long Island Community Hospital,30 to 49,,M,White,Not Span/Hispanic,4,Emergency,Left Against Medical Advice,2019,NEO051,ENDOCRINE SYSTEM CANCERS - PANCREAS,,,281,MALIGNANCY OF HEPATOBILIARY SYSTEM & PANCREAS,07,DISEASES AND DISORDERS OF THE HEPATOBILIARY SYSTEM AND PANCREAS,3,Major,Moderate,Medical,Medicaid,,,,,true,60556.56,9072.73
Long Island,Suffolk,5123000,000885,Long Island Community Hospital,70 or Older,117,F,Black/African American,Not Span/Hispanic,4,Emergency,Home w/ Home Health Services,2019,NEO070,SECONDARY MALIGNANCIES,,,281,MALIGNANCY OF HEPATOBILIARY SYSTEM & PANCREAS,07,DISEASES AND DISORDERS OF THE HEPATOBILIARY SYSTEM AND PANCREAS,3,Major,Major,Medical,Medicare,Medicaid,Medicare,,,true,35290.07,5806.5
Long Island,Suffolk,5123000,000885,Long Island Community Hospital,70 or Older,117,M,White,Not Span/Hispanic,9,Emergency,Home or Self Care,2019,NEO017,GASTROINTESTINAL CANCERS - LIVER,GIS003,GI SYSTEM BIOPSY (NON-ENDOSCOPIC),281,MALIGNANCY OF HEPATOBILIARY SYSTEM & PANCREAS,07,DISEASES AND DISORDERS OF THE HEPATOBILIARY SYSTEM AND PANCREAS,3,Major,Major,Medical,Medicare,Medicare,Medicaid,,,true,120054.3,19070.32
Long Island,Suffolk,5123000,000885,Long Island Community Hospital,50 to 69,119,M,Other Race,Not Span/Hispanic,1,Emergency,Left Against Medical Advice,2019,NEO018,GASTROINTESTINAL CANCERS - BILE DUCT,,,281,MALIGNANCY OF HEPATOBILIARY SYSTEM & PANCREAS,07,DISEASES AND DISORDERS OF THE HEPATOBILIARY SYSTEM AND PANCREAS,3,Major,Major,Medical,Medicare,Medicaid,Medicare,,,true,21250.86,2082.44
Long Island,Suffolk,5123000,000885,Long Island Community Hospital,70 or Older,117,F,White,Not Span/Hispanic,2,Emergency,Short-term Hospital,2019,NEO070,SECONDARY MALIGNANCIES,,,281,MALIGNANCY OF HEPATOBILIARY SYSTEM & PANCREAS,07,DISEASES AND DISORDERS OF THE HEPATOBILIARY SYSTEM AND PANCREAS,3,Major,Major,Medical,Medicare,Medicare,Medicaid,,,true,32982.99,3683.69
