Hospital Service Area,Hospital County,Operating Certificate Number,Permanent Facility Id,Facility Name,Age Group,Zip Code - 3 digits,Gender,Race,Ethnicity,Length of Stay,Type of Admission,Patient Disposition,Discharge Year,CCS Diagnosis Code,CCS Diagnosis Description,CCS Procedure Code,CCS Procedure Description,APR DRG Code,APR DRG Description,APR MDC Code,APR MDC Description,APR Severity of Illness Code,APR Severity of Illness Description,APR Risk of Mortality,APR Medical Surgical Description,Payment Typology 1,Payment Typology 2,Payment Typology 3,Birth Weight,Abortion Edit Indicator,Emergency Department Indicator,Total Charges,Total Costs
New York City,Bronx,7000006,003058,Montefiore Med Center - Jack D Weiler Hosp of A Einstein College Div,70 or Older,104,M,Other Race,Spanish/Hispanic,4,Emergency,Home or Self Care,2020,NEO017,GASTROINTESTINAL CANCERS - LIVER,IMG006,COMPUTERIZED TOMOGRAPHY (CT) WITH CONTRAST,281,MALIGNANCY OF HEPATOBILIARY SYSTEM & PANCREAS,07,DISEASES AND DISORDERS OF THE HEPATOBILIARY SYSTEM AND PANCREAS,3,Major,Major,Medical,Medicaid,,,,,Y,47779.13,6702.38
New York City,Bronx,7000006,001169,Montefiore Medical Center - Henry & Lucy Moses Div,70 or Older,107,M,Other Race,Unknown,22,Emergency,Expired,2020,NEO051,ENDOCRINE SYSTEM CANCERS - PANCREAS,HEP003,DIAGNOSTIC ERCP WITH OR WITHOUT BIOPSY,281,MALIGNANCY OF HEPATOBILIARY SYSTEM & PANCREAS,07,DISEASES AND DISORDERS OF THE HEPATOBILIARY SYSTEM AND PANCREAS,4,Extreme,Extreme,Medical,Medicare,,,,,Y,341871.23,66035.66
New York City,Manhattan,7002024,001456,Mount Sinai Hospital,50 to 69,112,F,Other Race,Spanish/Hispanic,23,Emergency,Skilled Nursing Home,2020,NEO070,SECONDARY MALIGNANCIES,HEP003,DIAGNOSTIC ERCP WITH OR WITHOUT BIOPSY,281,MALIGNANCY OF HEPATOBILIARY SYSTEM & PANCREAS,07,DISEASES AND DISORDERS OF THE HEPATOBILIARY SYSTEM AND PANCREAS,3,Major,Major,Medical,Medicare,Medicare,Medicaid,,,Y,274574.3,71750.75
New York City,Manhattan,7002024,001456,Mount Sinai Hospital,50 to 69,104,M,Black/African American,Not Span/Hispanic,8,Emergency,Home w/ Home Health Services,2020,NEO017,GASTROINTESTINAL CANCERS - LIVER,RAD001,BEAM RADIATION,281,MALIGNANCY OF HEPATOBILIARY SYSTEM & PANCREAS,07,DISEASES AND DISORDERS OF THE HEPATOBILIARY SYSTEM AND PANCREAS,3,Major,Moderate,Medical,Medicaid,Medicaid,Self-Pay,,,Y,148224.82,29779.21
New York City,Bronx,7000006,003058,Montefiore Med Center - Jack D Weiler Hosp of A Einstein College Div,50 to 69,104,F,Other Race,Spanish/Hispanic,10,Emergency,Left Against Medical Advice,2020,NEO021,GASTROINTESTINAL CANCERS - ALL OTHER TYPES,GIS004,GI SYSTEM ENDOSCOPY WITHOUT BIOPSY (DIAGNOSTIC),281,MALIGNANCY OF HEPATOBILIARY SYSTEM & PANCREAS,07,DISEASES AND DISORDERS OF THE HEPATOBILIARY SYSTEM AND PANCREAS,4,Extreme,Major,Medical,Blue Cross/Blue Shield,Medicare,,,,Y,147045.29,30688.33
New York City,Manhattan,7002002,001439,Mount Sinai Beth Israel,70 or Older,112,F,Other Race,Unknown,1,Urgent,Home or Self Care,2020,NEO051,ENDOCRINE SYSTEM CANCERS - PANCREAS,HEP009,PANCREATIC AND PROXIMAL BILIARY DILATION AND STENTING,281,MALIGNANCY OF HEPATOBILIARY SYSTEM & PANCREAS,07,DISEASES AND DISORDERS OF THE HEPATOBILIARY SYSTEM AND PANCREAS,2,Moderate,Minor,Medical,Medicare,Medicaid,Self-Pay,,,Y,34683.81,7659.25
New York City,Manhattan,7002032,001466,Mount Sinai West,50 to 69,114,F,Other Race,Unknown,11,Urgent,Home or Self Care,2020,NEO070,SECONDARY MALIGNANCIES,HEP010,HEPATOBILIARY AND PANCREATIC DRAINAGE,281,MALIGNANCY OF HEPATOBILIARY SYSTEM & PANCREAS,07,DISEASES AND DISORDERS OF THE HEPATOBILIARY SYSTEM AND PANCREAS,4,Extreme,Moderate,Medical,Medicare,Medicare,Medicaid,,,N,174202.6,38771.12
New York City,Manhattan,7002032,001466,Mount Sinai West,70 or Older,100,F,White,Not Span/Hispanic,1,Emergency,Expired,2020,NEO051,ENDOCRINE SYSTEM CANCERS - PANCREAS,IMG009,PLAIN RADIOGRAPHY,281,MALIGNANCY OF HEPATOBILIARY SYSTEM & PANCREAS,07,DISEASES AND DISORDERS OF THE HEPATOBILIARY SYSTEM AND PANCREAS,3,Major,Major,Medical,Medicare,Private Health Insurance,Self-Pay,,,Y,22679.41,3874.28
New York City,Manhattan,7002032,001466,Mount Sinai West,70 or Older,100,F,Other Race,Spanish/Hispanic,2,Urgent,Home or Self Care,2020,NEO070,SECONDARY MALIGNANCIES,HEP001,LIVER BIOPSY,281,MALIGNANCY OF HEPATOBILIARY SYSTEM & PANCREAS,07,DISEASES AND DISORDERS OF THE HEPATOBILIARY SYSTEM AND PANCREAS,2,Moderate,Moderate,Medical,Medicare,Medicare,Medicaid,,,N,34857.68,6860.75
New York City,Manhattan,7002002,001439,Mount Sinai Beth Israel,70 or Older,100,F,White,Unknown,12,Emergency,Hospice - Home,2020,NEO070,SECONDARY MALIGNANCIES,IMG008,ULTRASONOGRAPHY,281,MALIGNANCY OF HEPATOBILIARY SYSTEM & PANCREAS,07,DISEASES AND DISORDERS OF THE HEPATOBILIARY SYSTEM AND PANCREAS,4,Extreme,Major,Medical,Medicare,Private Health Insurance,Self-Pay,,,Y,144878.01,33002.64
New York City,Bronx,7000006,003058,Montefiore Med Center - Jack D Weiler Hosp of A Einstein College Div,50 to 69,104,F,Other Race,Spanish/Hispanic,5,Emergency,Home or Self Care,2020,NEO051,ENDOCRINE SYSTEM CANCERS - PANCREAS,,,281,MALIGNANCY OF HEPATOBILIARY SYSTEM & PANCREAS,07,DISEASES AND DISORDERS OF THE HEPATOBILIARY SYSTEM AND PANCREAS,3,Major,Moderate,Medical,Private Health Insurance,,,,,Y,83905.8,12597.61
New York City,Manhattan,7002024,001456,Mount Sinai Hospital,70 or Older,100,F,Other Race,Not Span/Hispanic,28,Emergency,Skilled Nursing Home,2020,NEO051,ENDOCRINE SYSTEM CANCERS - PANCREAS,HEP003,DIAGNOSTIC ERCP WITH OR WITHOUT BIOPSY,281,MALIGNANCY OF HEPATOBILIARY SYSTEM & PANCREAS,07,DISEASES AND DISORDERS OF THE HEPATOBILIARY SYSTEM AND PANCREAS,3,Major,Extreme,Medical,Medicare,Medicare,Medicaid,,,Y,302846.01,73454.2
New York City,Bronx,7000006,001169,Montefiore Medical Center - Henry & Lucy Moses Div,50 to 69,104,F,Other Race,Unknown,12,Emergency,Skilled Nursing Home,2020,NEO017,GASTROINTESTINAL CANCERS - LIVER,ADM001,TRANSFUSION OF BLOOD AND BLOOD PRODUCTS,281,MALIGNANCY OF HEPATOBILIARY SYSTEM & PANCREAS,07,DISEASES AND DISORDERS OF THE HEPATOBILIARY SYSTEM AND PANCREAS,3,Major,Extreme,Medical,Medicare,,,,,Y,163383.05,28091.23
New York City,Bronx,7000006,001169,Montefiore Medical Center - Henry & Lucy Moses Div,50 to 69,108,M,Other Race,Spanish/Hispanic,5,Emergency,Home or Self Care,2020,NEO017,GASTROINTESTINAL CANCERS - LIVER,,,281,MALIGNANCY OF HEPATOBILIARY SYSTEM & PANCREAS,07,DISEASES AND DISORDERS OF THE HEPATOBILIARY SYSTEM AND PANCREAS,3,Major,Moderate,Medical,Medicaid,,,,,Y,81567.23,12702.91
New York City,Manhattan,7002054,003975,New York Presbyterian Hospital - Allen Hospital,50 to 69,100,F,Multi-racial,Not Span/Hispanic,17,Emergency,Skilled Nursing Home,2020,NEO051,ENDOCRINE SYSTEM CANCERS - PANCREAS,,,281,MALIGNANCY OF HEPATOBILIARY SYSTEM & PANCREAS,07,DISEASES AND DISORDERS OF THE HEPATOBILIARY SYSTEM AND PANCREAS,3,Major,Major,Medical,Medicare,Medicare,Self-Pay,,,Y,176443.49,38587.18
New York City,Manhattan,7002054,003975,New York Presbyterian Hospital - Allen Hospital,70 or Older,100,F,Black/African American,Spanish/Hispanic,6,Emergency,Hospice - Medical Facility,2020,NEO051,ENDOCRINE SYSTEM CANCERS - PANCREAS,CAR024,VENOUS AND ARTERIAL CATHETER PLACEMENT,281,MALIGNANCY OF HEPATOBILIARY SYSTEM & PANCREAS,07,DISEASES AND DISORDERS OF THE HEPATOBILIARY SYSTEM AND PANCREAS,3,Major,Major,Medical,Medicare,Medicaid,Self-Pay,,,Y,78491.94,16222
New York City,Manhattan,7002054,003975,New York Presbyterian Hospital - Allen Hospital,70 or Older,100,F,Other Race,Spanish/Hispanic,16,Emergency,Skilled Nursing Home,2020,NEO021,GASTROINTESTINAL CANCERS - ALL OTHER TYPES,IMG005,MAGNETIC RESONANCE IMAGING (MRI),281,MALIGNANCY OF HEPATOBILIARY SYSTEM & PANCREAS,07,DISEASES AND DISORDERS OF THE HEPATOBILIARY SYSTEM AND PANCREAS,3,Major,Major,Medical,Medicare,Medicare,Medicaid,,,Y,179937.07,38168.74
New York City,Bronx,7000006,001169,Montefiore Medical Center - Henry & Lucy Moses Div,70 or Older,104,F,Black/African American,Not Span/Hispanic,4,Emergency,Skilled Nursing Home,2020,NEO051,ENDOCRINE SYSTEM CANCERS - PANCREAS,,,281,MALIGNANCY OF HEPATOBILIARY SYSTEM & PANCREAS,07,DISEASES AND DISORDERS OF THE HEPATOBILIARY SYSTEM AND PANCREAS,2,Moderate,Moderate,Medical,Medicare,Medicaid,,,,Y,56209.89,9253.04
New York City,Manhattan,7002054,001464,New York-Presbyterian Hospital - Columbia Presbyterian Center,50 to 69,104,M,Black/African American,Spanish/Hispanic,5,Emergency,Home w/ Home Health Services,2020,NEO051,ENDOCRINE SYSTEM CANCERS - PANCREAS,HEP008,COMMON BILE DUCT SPHINCTEROTOMY AND STENTING,281,MALIGNANCY OF HEPATOBILIARY SYSTEM & PANCREAS,07,DISEASES AND DISORDERS OF THE HEPATOBILIARY SYSTEM AND PANCREAS,3,Major,Major,Medical,Medicaid,Self-Pay,,,,Y,95969.04,23997.71
New York City,Manhattan,7002054,001464,New York-Presbyterian Hospital - Columbia Presbyterian Center,30 to 49,104,M,Other Race,Not Span/Hispanic,3,Emergency,Home or Self Care,2020,NEO017,GASTROINTESTINAL CANCERS - LIVER,GIS006,PARACENTESIS,281,MALIGNANCY OF HEPATOBILIARY SYSTEM & PANCREAS,07,DISEASES AND DISORDERS OF THE HEPATOBILIARY SYSTEM AND PANCREAS,3,Major,Major,Medical,Medicaid,Self-Pay,,,,Y,53869.57,10908.73
New York City,Manhattan,7002054,001464,New York-Presbyterian Hospital - Columbia Presbyterian Center,50 to 69,100,F,Other Race,Not Span/Hispanic,11,Emergency,Hospice - Home,2020,NEO070,SECONDARY MALIGNANCIES,GIS006,PARACENTESIS,281,MALIGNANCY OF HEPATOBILIARY SYSTEM & PANCREAS,07,DISEASES AND DISORDERS OF THE HEPATOBILIARY SYSTEM AND PANCREAS,3,Major,Major,Medical,Medicaid,Medicaid,Self-Pay,,,Y,154992.91,35579.1
New York City,Manhattan,7002054,001464,New York-Presbyterian Hospital - Columbia Presbyterian Center,70 or Older,112,M,White,Not Span/Hispanic,9,Emergency,Skilled Nursing Home,2020,NEO070,SECONDARY MALIGNANCIES,HEP010,HEPATOBILIARY AND PANCREATIC DRAINAGE,281,MALIGNANCY OF HEPATOBILIARY SYSTEM & PANCREAS,07,DISEASES AND DISORDERS OF THE HEPATOBILIARY SYSTEM AND PANCREAS,4,Extreme,Major,Medical,Medicare,Self-Pay,,,,Y,133282.46,32437.5
New York City,Manhattan,7002054,001464,New York-Presbyterian Hospital - Columbia Presbyterian Center,50 to 69,104,F,Multi-racial,Spanish/Hispanic,7,Emergency,Home w/ Home Health Services,2020,NEO019,GASTROINTESTINAL CANCERS - GALLBLADDER,ADM001,TRANSFUSION OF BLOOD AND BLOOD PRODUCTS,281,MALIGNANCY OF HEPATOBILIARY SYSTEM & PANCREAS,07,DISEASES AND DISORDERS OF THE HEPATOBILIARY SYSTEM AND PANCREAS,4,Extreme,Major,Medical,Blue Cross/Blue Shield,Self-Pay,,,,Y,111550.41,25855.47
New York City,Manhattan,7002054,001464,New York-Presbyterian Hospital - Columbia Presbyterian Center,30 to 49,,M,Black/African American,Not Span/Hispanic,23,Emergency,Skilled Nursing Home,2020,NEO021,GASTROINTESTINAL CANCERS - ALL OTHER TYPES,GIS006,PARACENTESIS,281,MALIGNANCY OF HEPATOBILIARY SYSTEM & PANCREAS,07,DISEASES AND DISORDERS OF THE HEPATOBILIARY SYSTEM AND PANCREAS,3,Major,Major,Medical,Medicaid,Medicaid,Self-Pay,,,Y,333071.39,81929.33
New York City,Manhattan,7002054,001464,New York-Presbyterian Hospital - Columbia Presbyterian Center,30 to 49,112,M,Other Race,Not Span/Hispanic,6,Emergency,Home w/ Home Health Services,2020,NEO070,SECONDARY MALIGNANCIES,GIS006,PARACENTESIS,281,MALIGNANCY OF HEPATOBILIARY SYSTEM & PANCREAS,07,DISEASES AND DISORDERS OF THE HEPATOBILIARY SYSTEM AND PANCREAS,3,Major,Major,Medical,Medicaid,Self-Pay,,,,Y,96251.17,20162.97
New York City,Manhattan,7002054,001464,New York-Presbyterian Hospital - Columbia Presbyterian Center,70 or Older,OOS,F,Multi-racial,Not Span/Hispanic,4,Emergency,Hospice - Medical Facility,2020,NEO017,GASTROINTESTINAL CANCERS - LIVER,GIS006,PARACENTESIS,281,MALIGNANCY OF HEPATOBILIARY SYSTEM & PANCREAS,07,DISEASES AND DISORDERS OF THE HEPATOBILIARY SYSTEM AND PANCREAS,3,Major,Major,Medical,Medicare,Medicare,Self-Pay,,,Y,71272.04,16147.21
New York City,Manhattan,7002054,001464,New York-Presbyterian Hospital - Columbia Presbyterian Center,50 to 69,100,F,White,Not Span/Hispanic,11,Urgent,Hospice - Home,2020,NEO051,ENDOCRINE SYSTEM CANCERS - PANCREAS,ADM001,TRANSFUSION OF BLOOD AND BLOOD PRODUCTS,281,MALIGNANCY OF HEPATOBILIARY SYSTEM & PANCREAS,07,DISEASES AND DISORDERS OF THE HEPATOBILIARY SYSTEM AND PANCREAS,4,Extreme,Major,Medical,Private Health Insurance,Self-Pay,,,,N,141461.96,31562.48
New York City,Manhattan,7002054,001464,New York-Presbyterian Hospital - Columbia Presbyterian Center,50 to 69,OOS,F,White,Not Span/Hispanic,2,Urgent,Home or Self Care,2020,NEO070,SECONDARY MALIGNANCIES,,,281,MALIGNANCY OF HEPATOBILIARY SYSTEM & PANCREAS,07,DISEASES AND DISORDERS OF THE HEPATOBILIARY SYSTEM AND PANCREAS,4,Extreme,Major,Medical,Private Health Insurance,Self-Pay,,,,N,27981.7,5755.45
New York City,Manhattan,7002054,001464,New York-Presbyterian Hospital - Columbia Presbyterian Center,50 to 69,125,F,White,Not Span/Hispanic,12,Urgent,Home w/ Home Health Services,2020,NEO018,GASTROINTESTINAL CANCERS - BILE DUCT,ADM012,CHEMOTHERAPY,281,MALIGNANCY OF HEPATOBILIARY SYSTEM & PANCREAS,07,DISEASES AND DISORDERS OF THE HEPATOBILIARY SYSTEM AND PANCREAS,3,Major,Major,Medical,Blue Cross/Blue Shield,Self-Pay,,,,N,220542.31,64371.02
New York City,Manhattan,7002054,001464,New York-Presbyterian Hospital - Columbia Presbyterian Center,50 to 69,105,M,White,Not Span/Hispanic,14,Emergency,Home w/ Home Health Services,2020,NEO051,ENDOCRINE SYSTEM CANCERS - PANCREAS,HEP009,PANCREATIC AND PROXIMAL BILIARY DILATION AND STENTING,281,MALIGNANCY OF HEPATOBILIARY SYSTEM & PANCREAS,07,DISEASES AND DISORDERS OF THE HEPATOBILIARY SYSTEM AND PANCREAS,3,Major,Major,Medical,Private Health Insurance,Self-Pay,,,,Y,201611.38,51457.34
New York City,Manhattan,7002054,001464,New York-Presbyterian Hospital - Columbia Presbyterian Center,50 to 69,105,M,White,Not Span/Hispanic,8,Emergency,Home or Self Care,2020,NEO051,ENDOCRINE SYSTEM CANCERS - PANCREAS,HEP003,DIAGNOSTIC ERCP WITH OR WITHOUT BIOPSY,281,MALIGNANCY OF HEPATOBILIARY SYSTEM & PANCREAS,07,DISEASES AND DISORDERS OF THE HEPATOBILIARY SYSTEM AND PANCREAS,2,Moderate,Minor,Medical,Private Health Insurance,Self-Pay,,,,Y,96656.47,20071.92
New York City,Manhattan,7002054,001464,New York-Presbyterian Hospital - Columbia Presbyterian Center,70 or Older,113,M,Other Race,Not Span/Hispanic,3,Emergency,Home or Self Care,2020,NEO051,ENDOCRINE SYSTEM CANCERS - PANCREAS,HEP003,DIAGNOSTIC ERCP WITH OR WITHOUT BIOPSY,281,MALIGNANCY OF HEPATOBILIARY SYSTEM & PANCREAS,07,DISEASES AND DISORDERS OF THE HEPATOBILIARY SYSTEM AND PANCREAS,2,Moderate,Minor,Medical,Medicare,Private Health Insurance,Self-Pay,,,Y,65814.61,17909.7
New York City,Manhattan,7002054,001464,New York-Presbyterian Hospital - Columbia Presbyterian Center,70 or Older,OOS,F,White,Not Span/Hispanic,1,Emergency,Expired,2020,NEO017,GASTROINTESTINAL CANCERS - LIVER,,,281,MALIGNANCY OF HEPATOBILIARY SYSTEM & PANCREAS,07,DISEASES AND DISORDERS OF THE HEPATOBILIARY SYSTEM AND PANCREAS,3,Major,Major,Medical,Medicare,Private Health Insurance,Self-Pay,,,Y,41347.7,16025.93
New York City,Manhattan,7002024,001456,Mount Sinai Hospital,50 to 69,OOS,M,Other Race,Unknown,5,Emergency,Home or Self Care,2020,NEO017,GASTROINTESTINAL CANCERS - LIVER,GIS006,PARACENTESIS,281,MALIGNANCY OF HEPATOBILIARY SYSTEM & PANCREAS,07,DISEASES AND DISORDERS OF THE HEPATOBILIARY SYSTEM AND PANCREAS,3,Major,Major,Medical,Blue Cross/Blue Shield,Self-Pay,,,,Y,73821.75,20007.98
New York City,Manhattan,7002024,001456,Mount Sinai Hospital,70 or Older,100,M,Other Race,Not Span/Hispanic,9,Emergency,Home w/ Home Health Services,2020,NEO051,ENDOCRINE SYSTEM CANCERS - PANCREAS,HEP002,PANCREATICOBILIARY BIOPSY,281,MALIGNANCY OF HEPATOBILIARY SYSTEM & PANCREAS,07,DISEASES AND DISORDERS OF THE HEPATOBILIARY SYSTEM AND PANCREAS,3,Major,Major,Medical,Medicare,Private Health Insurance,Self-Pay,,,Y,126718.07,33134.68
New York City,Manhattan,7002024,001456,Mount Sinai Hospital,70 or Older,100,F,White,Not Span/Hispanic,5,Urgent,Home or Self Care,2020,NEO018,GASTROINTESTINAL CANCERS - BILE DUCT,,,281,MALIGNANCY OF HEPATOBILIARY SYSTEM & PANCREAS,07,DISEASES AND DISORDERS OF THE HEPATOBILIARY SYSTEM AND PANCREAS,4,Extreme,Major,Medical,Medicare,Private Health Insurance,Self-Pay,,,N,59206.83,15625.96
New York City,Manhattan,7002024,001456,Mount Sinai Hospital,50 to 69,100,M,White,Not Span/Hispanic,11,Emergency,Expired,2020,NEO051,ENDOCRINE SYSTEM CANCERS - PANCREAS,RES007,AIRWAY INTUBATION,281,MALIGNANCY OF HEPATOBILIARY SYSTEM & PANCREAS,07,DISEASES AND DISORDERS OF THE HEPATOBILIARY SYSTEM AND PANCREAS,4,Extreme,Extreme,Medical,Private Health Insurance,Self-Pay,,,,Y,157492.74,39342.64
New York City,Queens,7003010,001637,New York - Presbyterian/Queens,70 or Older,113,M,Other Race,Not Span/Hispanic,16,Emergency,Expired,2020,NEO017,GASTROINTESTINAL CANCERS - LIVER,GIS006,PARACENTESIS,281,MALIGNANCY OF HEPATOBILIARY SYSTEM & PANCREAS,07,DISEASES AND DISORDERS OF THE HEPATOBILIARY SYSTEM AND PANCREAS,4,Extreme,Extreme,Medical,Medicare,Medicare,Medicaid,,,Y,121654.21,28789.97
New York City,Queens,7003010,001637,New York - Presbyterian/Queens,70 or Older,113,F,White,Spanish/Hispanic,7,Emergency,Home or Self Care,2020,NEO051,ENDOCRINE SYSTEM CANCERS - PANCREAS,HEP008,COMMON BILE DUCT SPHINCTEROTOMY AND STENTING,281,MALIGNANCY OF HEPATOBILIARY SYSTEM & PANCREAS,07,DISEASES AND DISORDERS OF THE HEPATOBILIARY SYSTEM AND PANCREAS,3,Major,Moderate,Medical,Medicare,Medicare,Self-Pay,,,Y,66757.36,19209.99
New York City,Kings,7001037,001320,University Hospital of Brooklyn,50 to 69,112,M,Black/African American,Not Span/Hispanic,7,Emergency,Home or Self Care,2020,NEO018,GASTROINTESTINAL CANCERS - BILE DUCT,HEP010,HEPATOBILIARY AND PANCREATIC DRAINAGE,281,MALIGNANCY OF HEPATOBILIARY SYSTEM & PANCREAS,07,DISEASES AND DISORDERS OF THE HEPATOBILIARY SYSTEM AND PANCREAS,4,Extreme,Major,Medical,Private Health Insurance,Self-Pay,,,,Y,78963.4,50317.44
New York City,Kings,7002053,001304,NYU Langone Hospital-Brooklyn,50 to 69,112,F,Other Race,Not Span/Hispanic,4,Emergency,Home w/ Home Health Services,2020,NEO018,GASTROINTESTINAL CANCERS - BILE DUCT,HEP010,HEPATOBILIARY AND PANCREATIC DRAINAGE,281,MALIGNANCY OF HEPATOBILIARY SYSTEM & PANCREAS,07,DISEASES AND DISORDERS OF THE HEPATOBILIARY SYSTEM AND PANCREAS,2,Moderate,Minor,Medical,Private Health Insurance,,,,,Y,74206.43,17253.86
New York City,Manhattan,7002054,001437,New York-Presbyterian/Lower Manhattan Hospital,70 or Older,100,F,Other Race,Spanish/Hispanic,4,Emergency,Hospice - Home,2020,NEO051,ENDOCRINE SYSTEM CANCERS - PANCREAS,HEP009,PANCREATIC AND PROXIMAL BILIARY DILATION AND STENTING,281,MALIGNANCY OF HEPATOBILIARY SYSTEM & PANCREAS,07,DISEASES AND DISORDERS OF THE HEPATOBILIARY SYSTEM AND PANCREAS,3,Major,Major,Medical,Medicare,Medicaid,Self-Pay,,,Y,72990.55,19947.22
New York City,Kings,7001037,001320,University Hospital of Brooklyn,70 or Older,112,M,White,Spanish/Hispanic,1,Emergency,Left Against Medical Advice,2020,NEO051,ENDOCRINE SYSTEM CANCERS - PANCREAS,ADM017,ADMINISTRATION OF NUTRITIONAL AND ELECTROLYTIC SUBSTANCES,281,MALIGNANCY OF HEPATOBILIARY SYSTEM & PANCREAS,07,DISEASES AND DISORDERS OF THE HEPATOBILIARY SYSTEM AND PANCREAS,3,Major,Major,Medical,Medicaid,Self-Pay,,,,Y,9889,4433.63
New York City,Kings,7002053,001304,NYU Langone Hospital-Brooklyn,50 to 69,112,F,Other Race,Not Span/Hispanic,2,Emergency,Home or Self Care,2020,NEO051,ENDOCRINE SYSTEM CANCERS - PANCREAS,,,281,MALIGNANCY OF HEPATOBILIARY SYSTEM & PANCREAS,07,DISEASES AND DISORDERS OF THE HEPATOBILIARY SYSTEM AND PANCREAS,2,Moderate,Moderate,Medical,Blue Cross/Blue Shield,,,,,Y,41426.58,9538.56
New York City,Queens,7003010,001637,New York - Presbyterian/Queens,70 or Older,113,F,Other Race,Not Span/Hispanic,5,Emergency,Home w/ Home Health Services,2020,NEO051,ENDOCRINE SYSTEM CANCERS - PANCREAS,ADM021,"ADMINISTRATION OF THERAPEUTIC SUBSTANCES, NEC",281,MALIGNANCY OF HEPATOBILIARY SYSTEM & PANCREAS,07,DISEASES AND DISORDERS OF THE HEPATOBILIARY SYSTEM AND PANCREAS,2,Moderate,Major,Medical,Medicaid,Self-Pay,,,,Y,43930.02,9581.34
New York City,Queens,7003010,001637,New York - Presbyterian/Queens,70 or Older,114,M,Other Race,Spanish/Hispanic,1,Urgent,Home or Self Care,2020,NEO017,GASTROINTESTINAL CANCERS - LIVER,ADM012,CHEMOTHERAPY,281,MALIGNANCY OF HEPATOBILIARY SYSTEM & PANCREAS,07,DISEASES AND DISORDERS OF THE HEPATOBILIARY SYSTEM AND PANCREAS,1,Minor,Minor,Medical,Blue Cross/Blue Shield,Medicare,Self-Pay,,,N,61715.13,12998.29
New York City,Manhattan,7002054,001458,New York-Presbyterian Hospital - New York Weill Cornell Center,70 or Older,112,F,White,Not Span/Hispanic,7,Emergency,Hospice - Medical Facility,2020,NEO051,ENDOCRINE SYSTEM CANCERS - PANCREAS,IMG008,ULTRASONOGRAPHY,281,MALIGNANCY OF HEPATOBILIARY SYSTEM & PANCREAS,07,DISEASES AND DISORDERS OF THE HEPATOBILIARY SYSTEM AND PANCREAS,3,Major,Major,Medical,Medicare,Private Health Insurance,Self-Pay,,,Y,95611.54,20586.49
New York City,Manhattan,7002054,001458,New York-Presbyterian Hospital - New York Weill Cornell Center,30 to 49,112,M,White,Not Span/Hispanic,2,Emergency,Home or Self Care,2020,NEO017,GASTROINTESTINAL CANCERS - LIVER,ADM017,ADMINISTRATION OF NUTRITIONAL AND ELECTROLYTIC SUBSTANCES,281,MALIGNANCY OF HEPATOBILIARY SYSTEM & PANCREAS,07,DISEASES AND DISORDERS OF THE HEPATOBILIARY SYSTEM AND PANCREAS,3,Major,Extreme,Medical,Medicaid,Self-Pay,,,,Y,41921.83,9917.45
New York City,Manhattan,7002054,001458,New York-Presbyterian Hospital - New York Weill Cornell Center,50 to 69,103,F,Black/African American,Not Span/Hispanic,31,Emergency,Hospice - Home,2020,NEO070,SECONDARY MALIGNANCIES,ADM014,REGIONAL ANESTHESIA,281,MALIGNANCY OF HEPATOBILIARY SYSTEM & PANCREAS,07,DISEASES AND DISORDERS OF THE HEPATOBILIARY SYSTEM AND PANCREAS,3,Major,Major,Medical,Medicaid,Self-Pay,,,,Y,371683.3,80189.33
New York City,Manhattan,7002054,001458,New York-Presbyterian Hospital - New York Weill Cornell Center,70 or Older,111,F,White,Not Span/Hispanic,11,Emergency,Expired,2020,NEO070,SECONDARY MALIGNANCIES,GIS006,PARACENTESIS,281,MALIGNANCY OF HEPATOBILIARY SYSTEM & PANCREAS,07,DISEASES AND DISORDERS OF THE HEPATOBILIARY SYSTEM AND PANCREAS,4,Extreme,Extreme,Medical,Medicare,Private Health Insurance,Self-Pay,,,Y,144491.55,31727.07
New York City,Manhattan,7002054,001458,New York-Presbyterian Hospital - New York Weill Cornell Center,50 to 69,104,M,Black/African American,Spanish/Hispanic,5,Emergency,Home or Self Care,2020,NEO017,GASTROINTESTINAL CANCERS - LIVER,GIS006,PARACENTESIS,281,MALIGNANCY OF HEPATOBILIARY SYSTEM & PANCREAS,07,DISEASES AND DISORDERS OF THE HEPATOBILIARY SYSTEM AND PANCREAS,4,Extreme,Major,Medical,Private Health Insurance,Medicare,Self-Pay,,,Y,61958.12,13407.7
New York City,Kings,7001021,001306,New York - Presbyterian Brooklyn Methodist Hospital,50 to 69,112,M,Other Race,Not Span/Hispanic,3,Elective,Home or Self Care,2020,NEO051,ENDOCRINE SYSTEM CANCERS - PANCREAS,IMG008,ULTRASONOGRAPHY,281,MALIGNANCY OF HEPATOBILIARY SYSTEM & PANCREAS,07,DISEASES AND DISORDERS OF THE HEPATOBILIARY SYSTEM AND PANCREAS,2,Moderate,Minor,Medical,Blue Cross/Blue Shield,Medicare,Self-Pay,,,N,21186.58,5391.15
New York City,Manhattan,7002054,001458,New York-Presbyterian Hospital - New York Weill Cornell Center,70 or Older,100,F,Other Race,Not Span/Hispanic,3,Emergency,Home or Self Care,2020,NEO051,ENDOCRINE SYSTEM CANCERS - PANCREAS,ADM017,ADMINISTRATION OF NUTRITIONAL AND ELECTROLYTIC SUBSTANCES,281,MALIGNANCY OF HEPATOBILIARY SYSTEM & PANCREAS,07,DISEASES AND DISORDERS OF THE HEPATOBILIARY SYSTEM AND PANCREAS,3,Major,Major,Medical,Medicare,Private Health Insurance,Self-Pay,,,Y,41257.94,8842.32
New York City,Manhattan,7002054,001458,New York-Presbyterian Hospital - New York Weill Cornell Center,50 to 69,100,F,Other Race,Not Span/Hispanic,3,Emergency,Hospice - Home,2020,NEO070,SECONDARY MALIGNANCIES,ADM021,"ADMINISTRATION OF THERAPEUTIC SUBSTANCES, NEC",281,MALIGNANCY OF HEPATOBILIARY SYSTEM & PANCREAS,07,DISEASES AND DISORDERS OF THE HEPATOBILIARY SYSTEM AND PANCREAS,3,Major,Major,Medical,Medicare,Medicaid,Self-Pay,,,Y,53901.84,10937.99