Hospital Service Area,Hospital County,Operating Certificate Number,Permanent Facility Id,Facility Name,Age Group,Zip Code - 3 digits,Gender,Race,Ethnicity,Length of Stay,Type of Admission,Patient Disposition,Discharge Year,CCS Diagnosis Code,CCS Diagnosis Description,CCS Procedure Code,CCS Procedure Description,APR DRG Code,APR DRG Description,APR MDC Code,APR MDC Description,APR Severity of Illness Code,APR Severity of Illness Description,APR Risk of Mortality,APR Medical Surgical Description,Payment Typology 1,Payment Typology 2,Payment Typology 3,Birth Weight,Abortion Edit Indicator,Emergency Department Indicator,Total Charges,Total Costs
New York City,Kings,7001037,001320,University Hospital of Brooklyn,30 to 49,112,F,Black/African American,Not Span/Hispanic,5,Emergency,Home or Self Care,2018,DIG020,PANCREATIC DISORDERS (EXCLUDING DIABETES),ADM017,ADMINISTRATION OF NUTRITIONAL AND ELECTROLYTIC SUBSTANCES,282,DISORDERS OF PANCREAS EXCEPT MALIGNANCY,07,DISEASES AND DISORDERS OF THE HEPATOBILIARY SYSTEM AND PANCREAS,2,Moderate,Minor,Medical,Medicaid,Medicaid,Self-Pay,,,true,32731,21473.72
New York City,Kings,7001037,001320,University Hospital of Brooklyn,30 to 49,112,F,Black/African American,Not Span/Hispanic,1,Emergency,Home or Self Care,2018,DIG020,PANCREATIC DISORDERS (EXCLUDING DIABETES),IMG006,COMPUTERIZED TOMOGRAPHY (CT) WITH CONTRAST,282,DISORDERS OF PANCREAS EXCEPT MALIGNANCY,07,DISEASES AND DISORDERS OF THE HEPATOBILIARY SYSTEM AND PANCREAS,1,Minor,Minor,Medical,Medicaid,Medicaid,Self-Pay,,,true,8391,3463.81
New York City,Queens,7003001,001628,Flushing Hospital Medical Center,50 to 69,113,F,White,Not Span/Hispanic,4,Emergency,Home or Self Care,2018,DIG020,PANCREATIC DISORDERS (EXCLUDING DIABETES),,,282,DISORDERS OF PANCREAS EXCEPT MALIGNANCY,07,DISEASES AND DISORDERS OF THE HEPATOBILIARY SYSTEM AND PANCREAS,2,Moderate,Minor,Medical,Medicare,Medicaid,,,,false,11118,7450.13
Finger Lakes,Livingston,2527000,000393,Nicholas H. Noyes Memorial Hospital,30 to 49,148,M,White,Not Span/Hispanic,2,Emergency,Home or Self Care,2018,DIG020,PANCREATIC DISORDERS (EXCLUDING DIABETES),,,282,DISORDERS OF PANCREAS EXCEPT MALIGNANCY,07,DISEASES AND DISORDERS OF THE HEPATOBILIARY SYSTEM AND PANCREAS,2,Moderate,Minor,Medical,Blue Cross/Blue Shield,,,,,true,5405.04,1621.72
Hudson Valley,Westchester,5957001,001139,Westchester Medical Center,0 to 17,107,F,White,Not Span/Hispanic,9,Emergency,Home or Self Care,2018,DIG020,PANCREATIC DISORDERS (EXCLUDING DIABETES),HEP009,PANCREATIC AND PROXIMAL BILIARY DILATION AND STENTING,282,DISORDERS OF PANCREAS EXCEPT MALIGNANCY,07,DISEASES AND DISORDERS OF THE HEPATOBILIARY SYSTEM AND PANCREAS,3,Major,Moderate,Medical,Medicaid,Medicaid,,,,true,178445.19,31890.41
New York City,Bronx,7000006,001169,Montefiore Medical Center - Henry & Lucy Moses Div,50 to 69,104,M,Black/African American,Not Span/Hispanic,3,Emergency,Home or Self Care,2018,DIG020,PANCREATIC DISORDERS (EXCLUDING DIABETES),ADM007,INTRAVENOUS INDUCTION OF LABOR,282,DISORDERS OF PANCREAS EXCEPT MALIGNANCY,07,DISEASES AND DISORDERS OF THE HEPATOBILIARY SYSTEM AND PANCREAS,2,Moderate,Moderate,Medical,Private Health Insurance,,,,,true,32222.46,6710.88
New York City,Manhattan,7002054,001458,New York-Presbyterian Hospital - New York Weill Cornell Center,70 or Older,112,M,Black/African American,Not Span/Hispanic,2,Emergency,Home w/ Home Health Services,2018,DIG020,PANCREATIC DISORDERS (EXCLUDING DIABETES),ADM012,CHEMOTHERAPY,282,DISORDERS OF PANCREAS EXCEPT MALIGNANCY,07,DISEASES AND DISORDERS OF THE HEPATOBILIARY SYSTEM AND PANCREAS,2,Moderate,Moderate,Medical,Medicare,Self-Pay,,,,true,28859.16,8202.67
Finger Lakes,Monroe,2701001,000409,Highland Hospital,30 to 49,146,F,Black/African American,Not Span/Hispanic,5,Emergency,Home or Self Care,2018,DIG020,PANCREATIC DISORDERS (EXCLUDING DIABETES),,,282,DISORDERS OF PANCREAS EXCEPT MALIGNANCY,07,DISEASES AND DISORDERS OF THE HEPATOBILIARY SYSTEM AND PANCREAS,2,Moderate,Minor,Medical,Blue Cross/Blue Shield,,,,,true,14567.82,4284.88
New York City,Bronx,7000024,001186,North Central Bronx Hospital,30 to 49,104,M,Black/African American,Not Span/Hispanic,3,Emergency,Home or Self Care,2018,INJ030,DRUG INDUCED OR TOXIC RELATED CONDITION,IMG007,COMPUTERIZED TOMOGRAPHY (CT) WITHOUT CONTRAST,282,DISORDERS OF PANCREAS EXCEPT MALIGNANCY,07,DISEASES AND DISORDERS OF THE HEPATOBILIARY SYSTEM AND PANCREAS,2,Moderate,Minor,Medical,Medicaid,Medicaid,,,,true,23452.38,14078.67
Hudson Valley,Westchester,5902001,001045,White Plains Hospital Center,50 to 69,106,F,Other Race,Not Span/Hispanic,1,Emergency,Home or Self Care,2018,DIG020,PANCREATIC DISORDERS (EXCLUDING DIABETES),,,282,DISORDERS OF PANCREAS EXCEPT MALIGNANCY,07,DISEASES AND DISORDERS OF THE HEPATOBILIARY SYSTEM AND PANCREAS,2,Moderate,Minor,Medical,Medicare,Medicaid,,,,true,12240,2149.53
New York City,Bronx,7000006,001169,Montefiore Medical Center - Henry & Lucy Moses Div,30 to 49,104,M,Other Race,Spanish/Hispanic,2,Emergency,Home or Self Care,2018,DIG020,PANCREATIC DISORDERS (EXCLUDING DIABETES),,,282,DISORDERS OF PANCREAS EXCEPT MALIGNANCY,07,DISEASES AND DISORDERS OF THE HEPATOBILIARY SYSTEM AND PANCREAS,3,Major,Minor,Medical,Medicaid,,,,,true,27564.4,4696.72
Western NY,Wyoming,6027000,001153,Wyoming County Community Hospital,50 to 69,140,F,White,Not Span/Hispanic,10,Emergency,Home or Self Care,2018,DIG020,PANCREATIC DISORDERS (EXCLUDING DIABETES),,,282,DISORDERS OF PANCREAS EXCEPT MALIGNANCY,07,DISEASES AND DISORDERS OF THE HEPATOBILIARY SYSTEM AND PANCREAS,2,Moderate,Minor,Medical,Blue Cross/Blue Shield,,,,,true,16233.31,10343.41
New York City,Kings,7001020,001305,Maimonides Medical Center,30 to 49,112,M,White,Not Span/Hispanic,3,Emergency,Home or Self Care,2018,DIG020,PANCREATIC DISORDERS (EXCLUDING DIABETES),IMG006,COMPUTERIZED TOMOGRAPHY (CT) WITH CONTRAST,282,DISORDERS OF PANCREAS EXCEPT MALIGNANCY,07,DISEASES AND DISORDERS OF THE HEPATOBILIARY SYSTEM AND PANCREAS,2,Moderate,Minor,Medical,Blue Cross/Blue Shield,Self-Pay,,,,true,25531.02,7665.01
Hudson Valley,Orange,3535001,000708,Bon Secours Community Hospital,70 or Older,127,F,White,Not Span/Hispanic,3,Emergency,Short-term Hospital,2018,DIG020,PANCREATIC DISORDERS (EXCLUDING DIABETES),,,282,DISORDERS OF PANCREAS EXCEPT MALIGNANCY,07,DISEASES AND DISORDERS OF THE HEPATOBILIARY SYSTEM AND PANCREAS,3,Major,Major,Medical,Medicare,Private Health Insurance,,,,true,55652.79,7363.2
New York City,Bronx,7000014,001176,SBH Health System,18 to 29,104,M,Black/African American,Spanish/Hispanic,2,Emergency,Home or Self Care,2018,DIG020,PANCREATIC DISORDERS (EXCLUDING DIABETES),IMG005,MAGNETIC RESONANCE IMAGING (MRI),282,DISORDERS OF PANCREAS EXCEPT MALIGNANCY,07,DISEASES AND DISORDERS OF THE HEPATOBILIARY SYSTEM AND PANCREAS,3,Major,Minor,Medical,Medicaid,,,,,true,14891.51,4301.75
Western NY,Erie,1401014,003067,Millard Fillmore Suburban Hospital,30 to 49,141,M,White,Not Span/Hispanic,4,Urgent,Home or Self Care,2018,DIG020,PANCREATIC DISORDERS (EXCLUDING DIABETES),,,282,DISORDERS OF PANCREAS EXCEPT MALIGNANCY,07,DISEASES AND DISORDERS OF THE HEPATOBILIARY SYSTEM AND PANCREAS,2,Moderate,Moderate,Medical,Medicaid,Self-Pay,,,,true,12752.04,5815.5
New York City,Bronx,7000006,001169,Montefiore Medical Center - Henry & Lucy Moses Div,50 to 69,104,M,Black/African American,Not Span/Hispanic,1,Emergency,Home or Self Care,2018,DIG020,PANCREATIC DISORDERS (EXCLUDING DIABETES),ADM014,REGIONAL ANESTHESIA,282,DISORDERS OF PANCREAS EXCEPT MALIGNANCY,07,DISEASES AND DISORDERS OF THE HEPATOBILIARY SYSTEM AND PANCREAS,1,Minor,Minor,Medical,Medicaid,,,,,true,21645.05,2653.17
Long Island,Suffolk,5151001,000245,Stony Brook University Hospital,30 to 49,117,F,White,Not Span/Hispanic,3,Emergency,Home or Self Care,2018,DIG020,PANCREATIC DISORDERS (EXCLUDING DIABETES),,,282,DISORDERS OF PANCREAS EXCEPT MALIGNANCY,07,DISEASES AND DISORDERS OF THE HEPATOBILIARY SYSTEM AND PANCREAS,2,Moderate,Moderate,Medical,Medicaid,Medicaid,,,,true,32775.28,8970.06
Capital/Adirond,Albany,0101004,000005,St. Peter's Hospital,70 or Older,120,M,White,Not Span/Hispanic,3,Emergency,Home or Self Care,2018,DIG020,PANCREATIC DISORDERS (EXCLUDING DIABETES),HEP003,DIAGNOSTIC ERCP WITH OR WITHOUT BIOPSY,282,DISORDERS OF PANCREAS EXCEPT MALIGNANCY,07,DISEASES AND DISORDERS OF THE HEPATOBILIARY SYSTEM AND PANCREAS,3,Major,Moderate,Medical,Medicare,Medicare,,,,true,48145.55,15065.3
Long Island,Suffolk,5154001,000925,Good Samaritan Hospital Medical Center,50 to 69,117,F,Other Race,Spanish/Hispanic,4,Emergency,Home or Self Care,2018,DIG020,PANCREATIC DISORDERS (EXCLUDING DIABETES),HEP008,COMMON BILE DUCT SPHINCTEROTOMY AND STENTING,282,DISORDERS OF PANCREAS EXCEPT MALIGNANCY,07,DISEASES AND DISORDERS OF THE HEPATOBILIARY SYSTEM AND PANCREAS,3,Major,Minor,Medical,Blue Cross/Blue Shield,,,,,true,48920.84,8954.32
Long Island,Suffolk,5153000,000913,Huntington Hospital,30 to 49,117,M,Other Race,Spanish/Hispanic,4,Emergency,Home or Self Care,2018,DIG020,PANCREATIC DISORDERS (EXCLUDING DIABETES),,,282,DISORDERS OF PANCREAS EXCEPT MALIGNANCY,07,DISEASES AND DISORDERS OF THE HEPATOBILIARY SYSTEM AND PANCREAS,2,Moderate,Moderate,Medical,Medicaid,,,,,true,38085.63,9471.61
New York City,Bronx,7000006,003058,Montefiore Med Center - Jack D Weiler Hosp of A Einstein College Div,50 to 69,146,M,White,Not Span/Hispanic,1,Emergency,Left Against Medical Advice,2018,DIG020,PANCREATIC DISORDERS (EXCLUDING DIABETES),SKB010,"SKIN AND BREAST PROCEDURES, NEC",282,DISORDERS OF PANCREAS EXCEPT MALIGNANCY,07,DISEASES AND DISORDERS OF THE HEPATOBILIARY SYSTEM AND PANCREAS,2,Moderate,Minor,Medical,Medicaid,,,,,true,20204.42,2320.58
Finger Lakes,Monroe,2701003,000411,Rochester General Hospital,50 to 69,144,M,White,Not Span/Hispanic,4,Urgent,Home or Self Care,2018,DIG020,PANCREATIC DISORDERS (EXCLUDING DIABETES),,,282,DISORDERS OF PANCREAS EXCEPT MALIGNANCY,07,DISEASES AND DISORDERS OF THE HEPATOBILIARY SYSTEM AND PANCREAS,1,Minor,Minor,Medical,Blue Cross/Blue Shield,Federal/State/Local/VA,,,,false,9395.09,5380.55
New York City,Manhattan,7002017,001450,Lenox Hill Hospital,30 to 49,100,M,White,Not Span/Hispanic,5,Emergency,Home or Self Care,2018,DIG020,PANCREATIC DISORDERS (EXCLUDING DIABETES),,,282,DISORDERS OF PANCREAS EXCEPT MALIGNANCY,07,DISEASES AND DISORDERS OF THE HEPATOBILIARY SYSTEM AND PANCREAS,2,Moderate,Moderate,Medical,Medicaid,Medicaid,,,,true,69309.75,10112.88
Finger Lakes,Monroe,2701005,000413,Strong Memorial Hospital,70 or Older,145,F,White,Not Span/Hispanic,6,Emergency,Home or Self Care,2018,DIG020,PANCREATIC DISORDERS (EXCLUDING DIABETES),HEP007,BILIARY AND PANCREATIC CALCULUS REMOVAL,282,DISORDERS OF PANCREAS EXCEPT MALIGNANCY,07,DISEASES AND DISORDERS OF THE HEPATOBILIARY SYSTEM AND PANCREAS,1,Minor,Moderate,Medical,Medicare,Blue Cross/Blue Shield,Self-Pay,,,true,33966.45,13759.9
Capital/Adirond,Albany,0101004,000005,St. Peter's Hospital,50 to 69,122,F,White,Not Span/Hispanic,2,Emergency,Home or Self Care,2018,DIG020,PANCREATIC DISORDERS (EXCLUDING DIABETES),,,282,DISORDERS OF PANCREAS EXCEPT MALIGNANCY,07,DISEASES AND DISORDERS OF THE HEPATOBILIARY SYSTEM AND PANCREAS,2,Moderate,Minor,Medical,Medicaid,Medicaid,,,,true,10900.5,3512.03
Capital/Adirond,Albany,0101004,000005,St. Peter's Hospital,70 or Older,123,F,White,Not Span/Hispanic,10,Emergency,Home or Self Care,2018,INJ030,DRUG INDUCED OR TOXIC RELATED CONDITION,HEP008,COMMON BILE DUCT SPHINCTEROTOMY AND STENTING,282,DISORDERS OF PANCREAS EXCEPT MALIGNANCY,07,DISEASES AND DISORDERS OF THE HEPATOBILIARY SYSTEM AND PANCREAS,2,Moderate,Moderate,Medical,Medicare,Medicare,,,,true,56363.7,22347.53
New York City,Queens,7003010,001637,New York - Presbyterian/Queens,50 to 69,114,M,Black/African American,Not Span/Hispanic,3,Emergency,Home or Self Care,2018,DIG020,PANCREATIC DISORDERS (EXCLUDING DIABETES),ADM015,ADMINISTRATION OF ANTIBIOTICS,282,DISORDERS OF PANCREAS EXCEPT MALIGNANCY,07,DISEASES AND DISORDERS OF THE HEPATOBILIARY SYSTEM AND PANCREAS,2,Moderate,Minor,Medical,Private Health Insurance,Self-Pay,,,,true,24927.41,5996.52
Finger Lakes,Livingston,2527000,000393,Nicholas H. Noyes Memorial Hospital,50 to 69,148,M,White,Not Span/Hispanic,2,Emergency,Home or Self Care,2018,DIG020,PANCREATIC DISORDERS (EXCLUDING DIABETES),,,282,DISORDERS OF PANCREAS EXCEPT MALIGNANCY,07,DISEASES AND DISORDERS OF THE HEPATOBILIARY SYSTEM AND PANCREAS,2,Moderate,Minor,Medical,Medicare,,,,,true,6348.55,1829.1
Finger Lakes,Ontario,3402000,000671,Geneva General Hospital,70 or Older,144,F,White,Not Span/Hispanic,2,Urgent,Home or Self Care,2018,DIG020,PANCREATIC DISORDERS (EXCLUDING DIABETES),,,282,DISORDERS OF PANCREAS EXCEPT MALIGNANCY,07,DISEASES AND DISORDERS OF THE HEPATOBILIARY SYSTEM AND PANCREAS,2,Moderate,Minor,Medical,Medicare,,,,,true,5774.63,1754.46
New York City,Queens,7003004,001630,Long Island Jewish Medical Center,50 to 69,110,M,Other Race,Not Span/Hispanic,6,Emergency,Home or Self Care,2018,DIG020,PANCREATIC DISORDERS (EXCLUDING DIABETES),,,282,DISORDERS OF PANCREAS EXCEPT MALIGNANCY,07,DISEASES AND DISORDERS OF THE HEPATOBILIARY SYSTEM AND PANCREAS,2,Moderate,Moderate,Medical,Blue Cross/Blue Shield,Self-Pay,,,,false,64038.16,10606.68
New York City,Bronx,7000006,003058,Montefiore Med Center - Jack D Weiler Hosp of A Einstein College Div,70 or Older,104,F,Other Race,Spanish/Hispanic,1,Emergency,Home w/ Home Health Services,2018,DIG020,PANCREATIC DISORDERS (EXCLUDING DIABETES),IMG007,COMPUTERIZED TOMOGRAPHY (CT) WITHOUT CONTRAST,282,DISORDERS OF PANCREAS EXCEPT MALIGNANCY,07,DISEASES AND DISORDERS OF THE HEPATOBILIARY SYSTEM AND PANCREAS,1,Minor,Minor,Medical,Medicare,Medicaid,,,,true,20611.48,2315.17
Long Island,Suffolk,5154001,000925,Good Samaritan Hospital Medical Center,50 to 69,117,F,White,Not Span/Hispanic,5,Emergency,Home or Self Care,2018,DIG020,PANCREATIC DISORDERS (EXCLUDING DIABETES),,,282,DISORDERS OF PANCREAS EXCEPT MALIGNANCY,07,DISEASES AND DISORDERS OF THE HEPATOBILIARY SYSTEM AND PANCREAS,3,Major,Moderate,Medical,Blue Cross/Blue Shield,,,,,true,36816,6453.7
New York City,Kings,7001035,001318,Wyckoff Heights Medical Center,50 to 69,113,M,Other Race,Not Span/Hispanic,10,Emergency,Home or Self Care,2018,DIG020,PANCREATIC DISORDERS (EXCLUDING DIABETES),,,282,DISORDERS OF PANCREAS EXCEPT MALIGNANCY,07,DISEASES AND DISORDERS OF THE HEPATOBILIARY SYSTEM AND PANCREAS,2,Moderate,Moderate,Medical,Medicaid,Miscellaneous/Other,,,,true,49383.82,21545.72
New York City,Kings,7001046,001309,Interfaith Medical Center,30 to 49,112,F,Black/African American,Not Span/Hispanic,2,Emergency,Left Against Medical Advice,2018,DIG020,PANCREATIC DISORDERS (EXCLUDING DIABETES),,,282,DISORDERS OF PANCREAS EXCEPT MALIGNANCY,07,DISEASES AND DISORDERS OF THE HEPATOBILIARY SYSTEM AND PANCREAS,3,Major,Moderate,Medical,Medicaid,Medicaid,,,,false,13788.67,5737.06
Finger Lakes,Wayne,5820000,001028,Newark-Wayne Community Hospital,50 to 69,145,F,White,Not Span/Hispanic,5,Emergency,Home or Self Care,2018,DIG020,PANCREATIC DISORDERS (EXCLUDING DIABETES),,,282,DISORDERS OF PANCREAS EXCEPT MALIGNANCY,07,DISEASES AND DISORDERS OF THE HEPATOBILIARY SYSTEM AND PANCREAS,1,Minor,Minor,Medical,Federal/State/Local/VA,,,,,true,14536.99,5046.12
New York City,Queens,7003004,001638,Long Island Jewish Forest Hills,30 to 49,113,F,White,Not Span/Hispanic,4,Emergency,Home or Self Care,2018,DIG020,PANCREATIC DISORDERS (EXCLUDING DIABETES),,,282,DISORDERS OF PANCREAS EXCEPT MALIGNANCY,07,DISEASES AND DISORDERS OF THE HEPATOBILIARY SYSTEM AND PANCREAS,2,Moderate,Minor,Medical,Self-Pay,Self-Pay,,,,true,52014.12,8733.48
New York City,Manhattan,7002054,001437,New York-Presbyterian/Lower Manhattan Hospital,30 to 49,100,M,White,Not Span/Hispanic,3,Emergency,Inpatient Rehabilitation Facility,2018,DIG020,PANCREATIC DISORDERS (EXCLUDING DIABETES),ADM021,"ADMINISTRATION OF THERAPEUTIC SUBSTANCES, NEC",282,DISORDERS OF PANCREAS EXCEPT MALIGNANCY,07,DISEASES AND DISORDERS OF THE HEPATOBILIARY SYSTEM AND PANCREAS,2,Moderate,Moderate,Medical,Medicaid,Self-Pay,,,,true,33291.04,7303.35
,,,,Redacted for Confidentiality,18 to 29,,M,Other Race,Multi-ethnic,2,Emergency,Home or Self Care,2018,DIG020,PANCREATIC DISORDERS (EXCLUDING DIABETES),,,282,DISORDERS OF PANCREAS EXCEPT MALIGNANCY,07,DISEASES AND DISORDERS OF THE HEPATOBILIARY SYSTEM AND PANCREAS,2,Moderate,Moderate,Medical,Medicaid,,,,,true,19070.27,5600.98
New York City,Manhattan,7002020,001453,Memorial Hospital for Cancer and Allied Diseases,50 to 69,117,F,White,Not Span/Hispanic,7,Emergency,Home or Self Care,2018,DIG020,PANCREATIC DISORDERS (EXCLUDING DIABETES),GIS025,OTHER GI SYSTEM DEVICE PROCEDURES,282,DISORDERS OF PANCREAS EXCEPT MALIGNANCY,07,DISEASES AND DISORDERS OF THE HEPATOBILIARY SYSTEM AND PANCREAS,4,Extreme,Major,Medical,Private Health Insurance,,,,,true,69435.72,26947.48
New York City,Queens,7003004,001630,Long Island Jewish Medical Center,30 to 49,114,F,Other Race,Not Span/Hispanic,8,Emergency,Home or Self Care,2018,DIG020,PANCREATIC DISORDERS (EXCLUDING DIABETES),,,282,DISORDERS OF PANCREAS EXCEPT MALIGNANCY,07,DISEASES AND DISORDERS OF THE HEPATOBILIARY SYSTEM AND PANCREAS,3,Major,Moderate,Medical,Medicaid,Medicaid,Self-Pay,,,false,75779.27,14163.49
Capital/Adirond,Albany,0101004,000005,St. Peter's Hospital,30 to 49,,M,Black/African American,Not Span/Hispanic,1,Elective,Home or Self Care,2018,DIG020,PANCREATIC DISORDERS (EXCLUDING DIABETES),,,282,DISORDERS OF PANCREAS EXCEPT MALIGNANCY,07,DISEASES AND DISORDERS OF THE HEPATOBILIARY SYSTEM AND PANCREAS,1,Minor,Minor,Medical,Medicaid,Medicaid,,,,false,3083.4,1414.19
Capital/Adirond,Albany,0101004,000005,St. Peter's Hospital,50 to 69,125,M,White,Not Span/Hispanic,3,Emergency,Home or Self Care,2018,DIG020,PANCREATIC DISORDERS (EXCLUDING DIABETES),,,282,DISORDERS OF PANCREAS EXCEPT MALIGNANCY,07,DISEASES AND DISORDERS OF THE HEPATOBILIARY SYSTEM AND PANCREAS,1,Minor,Minor,Medical,Medicaid,Medicaid,,,,true,14970.59,5277.6
New York City,Kings,7001020,001305,Maimonides Medical Center,50 to 69,112,M,Other Race,Not Span/Hispanic,3,Emergency,Home or Self Care,2018,DIG020,PANCREATIC DISORDERS (EXCLUDING DIABETES),,,282,DISORDERS OF PANCREAS EXCEPT MALIGNANCY,07,DISEASES AND DISORDERS OF THE HEPATOBILIARY SYSTEM AND PANCREAS,2,Moderate,Minor,Medical,Medicaid,Medicaid,Self-Pay,,,false,19445.01,4832.25
New York City,Bronx,7000008,001172,Lincoln Medical & Mental Health Center,30 to 49,104,M,Other Race,Spanish/Hispanic,2,Emergency,Home or Self Care,2018,DIG020,PANCREATIC DISORDERS (EXCLUDING DIABETES),,,282,DISORDERS OF PANCREAS EXCEPT MALIGNANCY,07,DISEASES AND DISORDERS OF THE HEPATOBILIARY SYSTEM AND PANCREAS,3,Major,Moderate,Medical,Private Health Insurance,Medicaid,,,,true,15299.07,9034.97
New York City,Bronx,7000008,001172,Lincoln Medical & Mental Health Center,30 to 49,,F,Black/African American,Not Span/Hispanic,2,Emergency,Home or Self Care,2018,DIG020,PANCREATIC DISORDERS (EXCLUDING DIABETES),,,282,DISORDERS OF PANCREAS EXCEPT MALIGNANCY,07,DISEASES AND DISORDERS OF THE HEPATOBILIARY SYSTEM AND PANCREAS,1,Minor,Minor,Medical,Medicaid,Medicaid,,,,true,14367.43,8484.79
New York City,Kings,7001021,001306,New York - Presbyterian Brooklyn Methodist Hospital,30 to 49,112,M,Black/African American,Not Span/Hispanic,9,Emergency,Skilled Nursing Home,2018,DIG020,PANCREATIC DISORDERS (EXCLUDING DIABETES),IMG008,ULTRASONOGRAPHY,282,DISORDERS OF PANCREAS EXCEPT MALIGNANCY,07,DISEASES AND DISORDERS OF THE HEPATOBILIARY SYSTEM AND PANCREAS,3,Major,Major,Medical,"Managed Care, Unspecified",Medicaid,Self-Pay,,,true,58683.47,16216.43
New York City,Richmond,7004010,001738,Richmond University Medical Center,18 to 29,103,F,White,Not Span/Hispanic,2,Emergency,Home or Self Care,2018,INJ030,DRUG INDUCED OR TOXIC RELATED CONDITION,,,282,DISORDERS OF PANCREAS EXCEPT MALIGNANCY,07,DISEASES AND DISORDERS OF THE HEPATOBILIARY SYSTEM AND PANCREAS,2,Moderate,Minor,Medical,Medicaid,Self-Pay,Self-Pay,,,true,20918.69,8092.99
Long Island,Nassau,2909000,000513,Mercy Hospital,70 or Older,115,F,White,Not Span/Hispanic,4,Emergency,Home or Self Care,2018,DIG020,PANCREATIC DISORDERS (EXCLUDING DIABETES),,,282,DISORDERS OF PANCREAS EXCEPT MALIGNANCY,07,DISEASES AND DISORDERS OF THE HEPATOBILIARY SYSTEM AND PANCREAS,2,Moderate,Moderate,Medical,Medicare,Blue Cross/Blue Shield,,,,true,30763,5095.58
New York City,Kings,7001037,001320,University Hospital of Brooklyn,0 to 17,112,F,Black/African American,Not Span/Hispanic,2,Emergency,Home or Self Care,2018,DIG020,PANCREATIC DISORDERS (EXCLUDING DIABETES),ADM017,ADMINISTRATION OF NUTRITIONAL AND ELECTROLYTIC SUBSTANCES,282,DISORDERS OF PANCREAS EXCEPT MALIGNANCY,07,DISEASES AND DISORDERS OF THE HEPATOBILIARY SYSTEM AND PANCREAS,1,Minor,Minor,Medical,Blue Cross/Blue Shield,Self-Pay,,,,true,14157,20356.45
Long Island,Nassau,2909000,000513,Mercy Hospital,50 to 69,115,F,Black/African American,Not Span/Hispanic,3,Emergency,Home or Self Care,2018,DIG020,PANCREATIC DISORDERS (EXCLUDING DIABETES),,,282,DISORDERS OF PANCREAS EXCEPT MALIGNANCY,07,DISEASES AND DISORDERS OF THE HEPATOBILIARY SYSTEM AND PANCREAS,2,Moderate,Minor,Medical,Medicare,Medicare,,,,true,35840,5516.92
New York City,Kings,7001008,001293,"New York Community Hospital of Brooklyn, Inc",70 or Older,112,F,Black/African American,Not Span/Hispanic,3,Emergency,Home or Self Care,2018,DIG020,PANCREATIC DISORDERS (EXCLUDING DIABETES),,,282,DISORDERS OF PANCREAS EXCEPT MALIGNANCY,07,DISEASES AND DISORDERS OF THE HEPATOBILIARY SYSTEM AND PANCREAS,1,Minor,Minor,Medical,Medicare,Medicare,Self-Pay,,,true,13635.88,4876.23
New York City,Manhattan,7002032,001466,Mount Sinai West,50 to 69,100,F,White,Not Span/Hispanic,1,Emergency,Home or Self Care,2018,DIG020,PANCREATIC DISORDERS (EXCLUDING DIABETES),IMG008,ULTRASONOGRAPHY,282,DISORDERS OF PANCREAS EXCEPT MALIGNANCY,07,DISEASES AND DISORDERS OF THE HEPATOBILIARY SYSTEM AND PANCREAS,2,Moderate,Moderate,Medical,Blue Cross/Blue Shield,Self-Pay,,,,true,14357.32,3869.56
Western NY,Niagara,3101000,000565,Eastern Niagara Hospital - Lockport Division,70 or Older,141,F,White,Not Span/Hispanic,7,Emergency,Home w/ Home Health Services,2018,DIG020,PANCREATIC DISORDERS (EXCLUDING DIABETES),,,282,DISORDERS OF PANCREAS EXCEPT MALIGNANCY,07,DISEASES AND DISORDERS OF THE HEPATOBILIARY SYSTEM AND PANCREAS,3,Major,Major,Medical,Medicare,Medicare,,,,true,16847.36,6394.98
Hudson Valley,Sullivan,5263000,000971,Garnet Health Medical Center - Catskills,30 to 49,127,M,Black/African American,Not Span/Hispanic,5,Emergency,Home or Self Care,2018,DIG020,PANCREATIC DISORDERS (EXCLUDING DIABETES),,,282,DISORDERS OF PANCREAS EXCEPT MALIGNANCY,07,DISEASES AND DISORDERS OF THE HEPATOBILIARY SYSTEM AND PANCREAS,2,Moderate,Minor,Medical,Private Health Insurance,,,,,true,28888.58,6849.11
Western NY,Erie,1401008,000213,Mercy Hospital of Buffalo,30 to 49,142,M,White,Not Span/Hispanic,2,Emergency,Home or Self Care,2018,DIG020,PANCREATIC DISORDERS (EXCLUDING DIABETES),,,282,DISORDERS OF PANCREAS EXCEPT MALIGNANCY,07,DISEASES AND DISORDERS OF THE HEPATOBILIARY SYSTEM AND PANCREAS,2,Moderate,Minor,Medical,Self-Pay,,,,,true,10003.35,3462.88
Finger Lakes,Monroe,2701003,000411,Rochester General Hospital,30 to 49,146,F,White,Not Span/Hispanic,2,Emergency,Home or Self Care,2018,DIG020,PANCREATIC DISORDERS (EXCLUDING DIABETES),,,282,DISORDERS OF PANCREAS EXCEPT MALIGNANCY,07,DISEASES AND DISORDERS OF THE HEPATOBILIARY SYSTEM AND PANCREAS,1,Minor,Minor,Medical,Blue Cross/Blue Shield,Medicaid,,,,true,8969.13,3779.55
New York City,Richmond,7004003,001737,Staten Island University Hospital Prince's Bay,70 or Older,103,F,White,Not Span/Hispanic,3,Emergency,Skilled Nursing Home,2018,DIG020,PANCREATIC DISORDERS (EXCLUDING DIABETES),,,282,DISORDERS OF PANCREAS EXCEPT MALIGNANCY,07,DISEASES AND DISORDERS OF THE HEPATOBILIARY SYSTEM AND PANCREAS,2,Moderate,Moderate,Medical,Medicare,Blue Cross/Blue Shield,,,,true,24992.1,5633.73