Hospital Service Area,Hospital County,Operating Certificate Number,Permanent Facility Id,Facility Name,Age Group,Zip Code - 3 digits,Gender,Race,Ethnicity,Length of Stay,Type of Admission,Patient Disposition,Discharge Year,CCS Diagnosis Code,CCS Diagnosis Description,CCS Procedure Code,CCS Procedure Description,APR DRG Code,APR DRG Description,APR MDC Code,APR MDC Description,APR Severity of Illness Code,APR Severity of Illness Description,APR Risk of Mortality,APR Medical Surgical Description,Payment Typology 1,Payment Typology 2,Payment Typology 3,Birth Weight,Abortion Edit Indicator,Emergency Department Indicator,Total Charges,Total Costs
New York City,Manhattan,7002024,001456,Mount Sinai Hospital,50 to 69,OOS,M,White,Not Span/Hispanic,2,Emergency,Home or Self Care,2017,151,Other liver diseases,223,ENTERAL/PARENTERAL NUTR,283,Other disorders of the liver,07,Diseases and Disorders of the Hepatobiliary System and Pancreas,3,Major,Minor,Medical,Private Health Insurance,Self-Pay,,,N,Y,17467.39,5903.63
New York City,Bronx,7000006,001169,Montefiore Medical Center - Henry & Lucy Moses Div,50 to 69,104,F,White,Not Span/Hispanic,1,Emergency,Home w/ Home Health Services,2017,151,Other liver diseases,088,ABDOMINAL PARACENTESIS,283,Other disorders of the liver,07,Diseases and Disorders of the Hepatobiliary System and Pancreas,2,Moderate,Minor,Medical,Medicaid,,,,N,Y,15446.86,2764.51
New York City,Bronx,7000006,001169,Montefiore Medical Center - Henry & Lucy Moses Div,50 to 69,104,M,Other Race,Spanish/Hispanic,1,Emergency,Home or Self Care,2017,151,Other liver diseases,088,ABDOMINAL PARACENTESIS,283,Other disorders of the liver,07,Diseases and Disorders of the Hepatobiliary System and Pancreas,3,Major,Major,Medical,Medicaid,,,,N,Y,9075.85,1486.67
New York City,Bronx,7000006,001169,Montefiore Medical Center - Henry & Lucy Moses Div,0 to 17,104,F,Other Race,Spanish/Hispanic,4,Emergency,Home or Self Care,2017,151,Other liver diseases,222,BLOOD TRANSFUSION,283,Other disorders of the liver,07,Diseases and Disorders of the Hepatobiliary System and Pancreas,3,Major,Minor,Medical,Blue Cross/Blue Shield,Medicaid,,,N,Y,47132.24,11014.45
New York City,Bronx,7000011,001175,Calvary Hospital Inc,30 to 49,,M,Other Race,Unknown,1,Emergency,Expired,2017,151,Other liver diseases,000,NO PROC,283,Other disorders of the liver,07,Diseases and Disorders of the Hepatobiliary System and Pancreas,2,Moderate,Moderate,Medical,Medicaid,,,,N,N,1952.00,1058.11
New York City,Manhattan,7002002,001439,Mount Sinai Beth Israel,50 to 69,112,M,Other Race,Not Span/Hispanic,6,Emergency,Home or Self Care,2017,006,Hepatitis,092,OTHER BOWEL DX PRCS,283,Other disorders of the liver,07,Diseases and Disorders of the Hepatobiliary System and Pancreas,3,Major,Major,Medical,Medicare,Miscellaneous/Other,Medicaid,,N,Y,49656.75,15797.99
New York City,Manhattan,7002002,001439,Mount Sinai Beth Israel,50 to 69,104,M,Black/African American,Spanish/Hispanic,3,Emergency,Short-term Hospital,2017,151,Other liver diseases,088,ABDOMINAL PARACENTESIS,283,Other disorders of the liver,07,Diseases and Disorders of the Hepatobiliary System and Pancreas,3,Major,Moderate,Medical,Medicaid,Medicaid,Self-Pay,,N,Y,35826.43,8315.26
New York City,Manhattan,7002024,001456,Mount Sinai Hospital,18 to 29,,M,Black/African American,Not Span/Hispanic,11,Emergency,Home or Self Care,2017,151,Other liver diseases,097,OTHER GI DX PRCS,283,Other disorders of the liver,07,Diseases and Disorders of the Hepatobiliary System and Pancreas,4,Extreme,Moderate,Medical,Medicaid,Medicaid,Self-Pay,,N,Y,113993.35,37521.82
New York City,Manhattan,7002024,001456,Mount Sinai Hospital,50 to 69,101,F,White,Not Span/Hispanic,2,Emergency,Left Against Medical Advice,2017,151,Other liver diseases,222,BLOOD TRANSFUSION,283,Other disorders of the liver,07,Diseases and Disorders of the Hepatobiliary System and Pancreas,3,Major,Moderate,Medical,Medicare,Private Health Insurance,Self-Pay,,N,Y,23204.50,7485.47
New York City,Manhattan,7002024,001456,Mount Sinai Hospital,70 or Older,112,F,White,Not Span/Hispanic,7,Emergency,Skilled Nursing Home,2017,006,Hepatitis,000,NO PROC,283,Other disorders of the liver,07,Diseases and Disorders of the Hepatobiliary System and Pancreas,3,Major,Major,Medical,Medicare,Blue Cross/Blue Shield,Self-Pay,,N,Y,53126.96,17662.08
New York City,Manhattan,7002024,001456,Mount Sinai Hospital,70 or Older,100,F,White,Not Span/Hispanic,2,Emergency,Home or Self Care,2017,151,Other liver diseases,000,NO PROC,283,Other disorders of the liver,07,Diseases and Disorders of the Hepatobiliary System and Pancreas,3,Major,Major,Medical,Medicare,Private Health Insurance,Self-Pay,,N,Y,23004.18,6850.55
New York City,Manhattan,7002032,001469,Mount Sinai St. Luke's,50 to 69,100,F,Black/African American,Not Span/Hispanic,5,Emergency,Home or Self Care,2017,006,Hepatitis,083,BIOPSY OF LIVER,283,Other disorders of the liver,07,Diseases and Disorders of the Hepatobiliary System and Pancreas,1,Minor,Minor,Medical,Private Health Insurance,Self-Pay,,,N,Y,55027.25,15713.36
Hudson Valley,Orange,3523000,000699,Orange Regional Medical Center,70 or Older,109,F,White,Not Span/Hispanic,4,Emergency,Home or Self Care,2017,006,Hepatitis,088,ABDOMINAL PARACENTESIS,283,Other disorders of the liver,07,Diseases and Disorders of the Hepatobiliary System and Pancreas,3,Major,Moderate,Medical,Medicare,,,,N,Y,29271.62,8630.04
New York City,Bronx,7000006,003058,Montefiore Med Center - Jack D Weiler Hosp of A Einstein College Div,30 to 49,104,F,Other Race,Not Span/Hispanic,16,Emergency,Home or Self Care,2017,151,Other liver diseases,222,BLOOD TRANSFUSION,283,Other disorders of the liver,07,Diseases and Disorders of the Hepatobiliary System and Pancreas,2,Moderate,Moderate,Medical,Medicaid,,,,N,Y,231397.10,41877.92
New York City,Manhattan,7002024,001456,Mount Sinai Hospital,50 to 69,117,F,White,Not Span/Hispanic,8,Urgent,Home or Self Care,2017,151,Other liver diseases,000,NO PROC,283,Other disorders of the liver,07,Diseases and Disorders of the Hepatobiliary System and Pancreas,4,Extreme,Major,Medical,Medicare,Medicaid,Self-Pay,,N,N,74523.70,27696.76
New York City,Manhattan,7002024,001456,Mount Sinai Hospital,70 or Older,101,F,White,Not Span/Hispanic,5,Urgent,Home w/ Home Health Services,2017,151,Other liver diseases,083,BIOPSY OF LIVER,283,Other disorders of the liver,07,Diseases and Disorders of the Hepatobiliary System and Pancreas,1,Minor,Minor,Medical,Medicare,Medicare,Self-Pay,,N,N,47708.46,16696.20
New York City,Manhattan,7002024,001456,Mount Sinai Hospital,50 to 69,125,F,White,Not Span/Hispanic,4,Urgent,Home or Self Care,2017,006,Hepatitis,000,NO PROC,283,Other disorders of the liver,07,Diseases and Disorders of the Hepatobiliary System and Pancreas,3,Major,Moderate,Medical,Blue Cross/Blue Shield,Self-Pay,,,N,N,31192.01,10130.51
New York City,Bronx,7000006,001169,Montefiore Medical Center - Henry & Lucy Moses Div,50 to 69,104,F,Other Race,Not Span/Hispanic,5,Emergency,Home or Self Care,2017,151,Other liver diseases,000,NO PROC,283,Other disorders of the liver,07,Diseases and Disorders of the Hepatobiliary System and Pancreas,2,Moderate,Major,Medical,Medicaid,,,,N,Y,71423.32,13718.47
New York City,Bronx,7000006,001169,Montefiore Medical Center - Henry & Lucy Moses Div,50 to 69,105,M,White,Not Span/Hispanic,1,Emergency,Home or Self Care,2017,151,Other liver diseases,000,NO PROC,283,Other disorders of the liver,07,Diseases and Disorders of the Hepatobiliary System and Pancreas,2,Moderate,Minor,Medical,Private Health Insurance,,,,N,N,17486.00,4224.83
New York City,Bronx,7000006,001169,Montefiore Medical Center - Henry & Lucy Moses Div,0 to 17,109,F,White,Not Span/Hispanic,3,Emergency,Home or Self Care,2017,155,Other gastrointestinal disorders,088,ABDOMINAL PARACENTESIS,283,Other disorders of the liver,07,Diseases and Disorders of the Hepatobiliary System and Pancreas,1,Minor,Minor,Medical,Private Health Insurance,Medicaid,,,N,N,34863.65,8065.90
New York City,Bronx,7000006,003058,Montefiore Med Center - Jack D Weiler Hosp of A Einstein College Div,30 to 49,OOS,F,Other Race,Spanish/Hispanic,10,Emergency,Home or Self Care,2017,151,Other liver diseases,083,BIOPSY OF LIVER,283,Other disorders of the liver,07,Diseases and Disorders of the Hepatobiliary System and Pancreas,2,Moderate,Moderate,Medical,Private Health Insurance,,,,N,Y,132898.40,24654.91
New York City,Bronx,7000006,003058,Montefiore Med Center - Jack D Weiler Hosp of A Einstein College Div,30 to 49,104,M,White,Not Span/Hispanic,2,Emergency,Home or Self Care,2017,151,Other liver diseases,231,OTHER THERAPEUTIC PRCS,283,Other disorders of the liver,07,Diseases and Disorders of the Hepatobiliary System and Pancreas,4,Extreme,Moderate,Medical,Private Health Insurance,,,,N,Y,23425.96,4268.50
New York City,Kings,7001003,001288,Brooklyn Hospital Center - Downtown Campus,50 to 69,112,F,Black/African American,Unknown,2,Emergency,Home w/ Home Health Services,2017,155,Other gastrointestinal disorders,088,ABDOMINAL PARACENTESIS,283,Other disorders of the liver,07,Diseases and Disorders of the Hepatobiliary System and Pancreas,1,Minor,Minor,Medical,Medicaid,Medicaid,Self-Pay,,N,Y,21860.50,3964.32
New York City,Manhattan,7002024,001456,Mount Sinai Hospital,50 to 69,100,F,Other Race,Not Span/Hispanic,5,Emergency,Home or Self Care,2017,151,Other liver diseases,000,NO PROC,283,Other disorders of the liver,07,Diseases and Disorders of the Hepatobiliary System and Pancreas,2,Moderate,Minor,Medical,Medicaid,Medicaid,Self-Pay,,N,Y,42933.20,13323.03
New York City,Manhattan,7002024,001456,Mount Sinai Hospital,18 to 29,112,M,White,Not Span/Hispanic,4,Emergency,Psychiatric Hospital or Unit of Hosp,2017,151,Other liver diseases,000,NO PROC,283,Other disorders of the liver,07,Diseases and Disorders of the Hepatobiliary System and Pancreas,2,Moderate,Minor,Medical,Blue Cross/Blue Shield,Self-Pay,,,N,Y,33512.33,10681.16
New York City,Manhattan,7002032,001466,Mount Sinai West,50 to 69,100,M,White,Not Span/Hispanic,1,Emergency,Skilled Nursing Home,2017,151,Other liver diseases,070,UP GASTRO ENDOSC/BIOPSY,283,Other disorders of the liver,07,Diseases and Disorders of the Hepatobiliary System and Pancreas,2,Moderate,Minor,Medical,Medicaid,Medicaid,Self-Pay,,N,Y,20155.10,6240.24
New York City,Manhattan,7002032,001466,Mount Sinai West,30 to 49,113,M,White,Not Span/Hispanic,1,Emergency,Home or Self Care,2017,155,Other gastrointestinal disorders,193,DX ULTRASOUND HEART,283,Other disorders of the liver,07,Diseases and Disorders of the Hepatobiliary System and Pancreas,2,Moderate,Minor,Medical,Blue Cross/Blue Shield,Self-Pay,,,N,Y,23634.03,7454.11
Long Island,Nassau,2950002,000528,Nassau University Medical Center,30 to 49,117,M,Black/African American,Not Span/Hispanic,2,Emergency,Home or Self Care,2017,151,Other liver diseases,070,UP GASTRO ENDOSC/BIOPSY,283,Other disorders of the liver,07,Diseases and Disorders of the Hepatobiliary System and Pancreas,3,Major,Moderate,Medical,Medicare,Medicaid,Self-Pay,,N,N,22497.78,10865.91
New York City,Kings,7001008,001293,"New York Community Hospital of Brooklyn, Inc",70 or Older,112,F,White,Not Span/Hispanic,7,Emergency,Home w/ Home Health Services,2017,151,Other liver diseases,088,ABDOMINAL PARACENTESIS,283,Other disorders of the liver,07,Diseases and Disorders of the Hepatobiliary System and Pancreas,3,Major,Major,Medical,Medicare,Medicaid,Self-Pay,,N,Y,24517.84,14300.07
New York City,Kings,7001021,001306,New York - Presbyterian Brooklyn Methodist Hospital,70 or Older,112,F,Black/African American,Not Span/Hispanic,11,Emergency,Skilled Nursing Home,2017,151,Other liver diseases,222,BLOOD TRANSFUSION,283,Other disorders of the liver,07,Diseases and Disorders of the Hepatobiliary System and Pancreas,3,Major,Major,Medical,Medicare,Private Health Insurance,Self-Pay,,N,Y,67559.09,20426.12
New York City,Kings,7001021,001306,New York - Presbyterian Brooklyn Methodist Hospital,50 to 69,112,F,White,Spanish/Hispanic,2,Emergency,Home or Self Care,2017,006,Hepatitis,000,NO PROC,283,Other disorders of the liver,07,Diseases and Disorders of the Hepatobiliary System and Pancreas,2,Moderate,Moderate,Medical,Medicaid,Medicaid,Self-Pay,,N,Y,23365.07,5331.15
New York City,Kings,7001021,001306,New York - Presbyterian Brooklyn Methodist Hospital,30 to 49,112,M,White,Not Span/Hispanic,1,Emergency,Home or Self Care,2017,155,Other gastrointestinal disorders,088,ABDOMINAL PARACENTESIS,283,Other disorders of the liver,07,Diseases and Disorders of the Hepatobiliary System and Pancreas,2,Moderate,Moderate,Medical,Private Health Insurance,Self-Pay,,,N,Y,8639.77,2247.73
New York City,Kings,7001021,001306,New York - Presbyterian Brooklyn Methodist Hospital,50 to 69,112,M,White,Spanish/Hispanic,1,Emergency,Home or Self Care,2017,151,Other liver diseases,088,ABDOMINAL PARACENTESIS,283,Other disorders of the liver,07,Diseases and Disorders of the Hepatobiliary System and Pancreas,2,Moderate,Moderate,Medical,Medicare,Medicare,Medicaid,,N,Y,9602.77,2440.44
New York City,Manhattan,7002054,001437,New York-Presbyterian/Lower Manhattan Hospital,50 to 69,100,M,Multi-racial,Spanish/Hispanic,2,Emergency,Home w/ Home Health Services,2017,151,Other liver diseases,088,ABDOMINAL PARACENTESIS,283,Other disorders of the liver,07,Diseases and Disorders of the Hepatobiliary System and Pancreas,3,Major,Moderate,Medical,Medicaid,Self-Pay,,,N,Y,26340.90,7471.52
New York City,Manhattan,7002054,001437,New York-Presbyterian/Lower Manhattan Hospital,30 to 49,114,F,Black/African American,Not Span/Hispanic,3,Emergency,Home or Self Care,2017,006,Hepatitis,070,UP GASTRO ENDOSC/BIOPSY,283,Other disorders of the liver,07,Diseases and Disorders of the Hepatobiliary System and Pancreas,3,Major,Major,Medical,Medicaid,Medicaid,Self-Pay,,N,Y,34532.55,8800.71
New York City,Manhattan,7002002,001439,Mount Sinai Beth Israel,50 to 69,113,F,White,Not Span/Hispanic,4,Emergency,Home or Self Care,2017,151,Other liver diseases,202,ELECTROCARDIOGRAM,283,Other disorders of the liver,07,Diseases and Disorders of the Hepatobiliary System and Pancreas,3,Major,Moderate,Medical,Medicaid,Medicaid,Self-Pay,,N,Y,48145.65,13456.58
New York City,Manhattan,7002024,001456,Mount Sinai Hospital,50 to 69,104,M,Other Race,Not Span/Hispanic,17,Urgent,Hospice - Medical Facility,2017,151,Other liver diseases,088,ABDOMINAL PARACENTESIS,283,Other disorders of the liver,07,Diseases and Disorders of the Hepatobiliary System and Pancreas,3,Major,Moderate,Medical,Medicaid,Medicaid,Self-Pay,,N,N,124480.46,42134.57
New York City,Manhattan,7002024,001456,Mount Sinai Hospital,50 to 69,114,F,Other Race,Not Span/Hispanic,18,Urgent,Home w/ Home Health Services,2017,151,Other liver diseases,054,OT VASC CATH; NOT HEART,283,Other disorders of the liver,07,Diseases and Disorders of the Hepatobiliary System and Pancreas,4,Extreme,Major,Medical,Medicare,Medicare,Self-Pay,,N,N,174976.49,55761.49
New York City,Manhattan,7002054,001464,New York Presbyterian Hospital - Columbia Presbyterian Center,50 to 69,OOS,F,White,Not Span/Hispanic,4,Urgent,Home w/ Home Health Services,2017,151,Other liver diseases,000,NO PROC,283,Other disorders of the liver,07,Diseases and Disorders of the Hepatobiliary System and Pancreas,4,Extreme,Major,Medical,Medicare,Private Health Insurance,Self-Pay,,N,N,42058.95,10501.27
New York City,Manhattan,7002054,001464,New York Presbyterian Hospital - Columbia Presbyterian Center,50 to 69,104,M,Other Race,Spanish/Hispanic,33,Emergency,Skilled Nursing Home,2017,151,Other liver diseases,098,OT NON-OR GI THER PRCS,283,Other disorders of the liver,07,Diseases and Disorders of the Hepatobiliary System and Pancreas,3,Major,Major,Medical,Medicaid,Medicaid,Self-Pay,,N,N,424164.85,159118.71
New York City,Manhattan,7002054,001464,New York Presbyterian Hospital - Columbia Presbyterian Center,50 to 69,112,M,Other Race,Not Span/Hispanic,5,Emergency,Home w/ Home Health Services,2017,151,Other liver diseases,070,UP GASTRO ENDOSC/BIOPSY,283,Other disorders of the liver,07,Diseases and Disorders of the Hepatobiliary System and Pancreas,4,Extreme,Major,Medical,Private Health Insurance,Self-Pay,,,N,Y,71755.89,23779.21
New York City,Manhattan,7002054,001464,New York Presbyterian Hospital - Columbia Presbyterian Center,50 to 69,100,F,Multi-racial,Not Span/Hispanic,12,Emergency,Home w/ Home Health Services,2017,006,Hepatitis,039,INCISION OF PLEURA,283,Other disorders of the liver,07,Diseases and Disorders of the Hepatobiliary System and Pancreas,3,Major,Moderate,Medical,Medicare,Medicaid,Self-Pay,,N,Y,138130.54,36011.72
New York City,Manhattan,7002054,001464,New York Presbyterian Hospital - Columbia Presbyterian Center,70 or Older,100,F,Other Race,Not Span/Hispanic,4,Emergency,Hospice - Home,2017,151,Other liver diseases,000,NO PROC,283,Other disorders of the liver,07,Diseases and Disorders of the Hepatobiliary System and Pancreas,3,Major,Major,Medical,Medicare,Medicare,Medicaid,,N,Y,56665.84,14001.00
New York City,Queens,7003010,001637,New York - Presbyterian/Queens,50 to 69,113,M,Other Race,Spanish/Hispanic,12,Emergency,Home w/ Home Health Services,2017,155,Other gastrointestinal disorders,088,ABDOMINAL PARACENTESIS,283,Other disorders of the liver,07,Diseases and Disorders of the Hepatobiliary System and Pancreas,3,Major,Major,Medical,Medicaid,Self-Pay,,,N,Y,103788.09,31360.68
New York City,Queens,7003010,001637,New York - Presbyterian/Queens,50 to 69,114,F,Other Race,Spanish/Hispanic,9,Emergency,Short-term Hospital,2017,151,Other liver diseases,098,OT NON-OR GI THER PRCS,283,Other disorders of the liver,07,Diseases and Disorders of the Hepatobiliary System and Pancreas,4,Extreme,Extreme,Medical,Medicare,Medicare,Self-Pay,,N,Y,116513.48,39237.16
New York City,Queens,7003010,001637,New York - Presbyterian/Queens,50 to 69,113,M,Other Race,Spanish/Hispanic,2,Emergency,Home or Self Care,2017,151,Other liver diseases,231,OTHER THERAPEUTIC PRCS,283,Other disorders of the liver,07,Diseases and Disorders of the Hepatobiliary System and Pancreas,3,Major,Major,Medical,Medicare,Medicare,Self-Pay,,N,Y,16890.53,4666.94
New York City,Queens,7003010,001637,New York - Presbyterian/Queens,70 or Older,113,F,White,Not Span/Hispanic,3,Emergency,Home w/ Home Health Services,2017,151,Other liver diseases,088,ABDOMINAL PARACENTESIS,283,Other disorders of the liver,07,Diseases and Disorders of the Hepatobiliary System and Pancreas,3,Major,Major,Medical,Medicare,Medicaid,Self-Pay,,N,Y,21250.38,6490.63
New York City,Queens,7003010,001637,New York - Presbyterian/Queens,70 or Older,113,F,Other Race,Not Span/Hispanic,5,Emergency,Home w/ Home Health Services,2017,058,Other nutritional; endocrine; and metabolic disorders,198,MAG RESONANCE IMAGING,283,Other disorders of the liver,07,Diseases and Disorders of the Hepatobiliary System and Pancreas,2,Moderate,Minor,Medical,Medicaid,Medicaid,Self-Pay,,N,Y,38698.15,10478.80
Central NY,Onondaga,3301008,000636,Crouse Hospital,30 to 49,130,M,White,Not Span/Hispanic,6,Emergency,Home or Self Care,2017,006,Hepatitis,083,BIOPSY OF LIVER,283,Other disorders of the liver,07,Diseases and Disorders of the Hepatobiliary System and Pancreas,1,Minor,Minor,Medical,Medicaid,,,,N,Y,20277.78,8570.78
Central NY,Onondaga,3301008,000636,Crouse Hospital,70 or Older,131,F,White,Not Span/Hispanic,8,Emergency,Skilled Nursing Home,2017,151,Other liver diseases,222,BLOOD TRANSFUSION,283,Other disorders of the liver,07,Diseases and Disorders of the Hepatobiliary System and Pancreas,3,Major,Major,Medical,Medicare,Medicare,Private Health Insurance,,N,Y,32387.65,14625.85
Central NY,Onondaga,3301008,000636,Crouse Hospital,30 to 49,132,M,Other Race,Spanish/Hispanic,1,Emergency,Home or Self Care,2017,151,Other liver diseases,093,OT NON-OR UP GI THER PR,283,Other disorders of the liver,07,Diseases and Disorders of the Hepatobiliary System and Pancreas,3,Major,Moderate,Medical,Medicaid,,,,N,Y,6097.29,2788.03
Capital/Adirond,Columbia,1001000,000146,Columbia Memorial Hospital,50 to 69,125,F,White,Not Span/Hispanic,9,Emergency,Skilled Nursing Home,2017,151,Other liver diseases,000,NO PROC,283,Other disorders of the liver,07,Diseases and Disorders of the Hepatobiliary System and Pancreas,4,Extreme,Major,Medical,Medicare,Private Health Insurance,,,N,Y,27841.39,11802.19
Hudson Valley,Orange,3535001,000708,Bon Secours Community Hospital,50 to 69,127,M,White,Not Span/Hispanic,4,Emergency,Home or Self Care,2017,151,Other liver diseases,000,NO PROC,283,Other disorders of the liver,07,Diseases and Disorders of the Hepatobiliary System and Pancreas,2,Moderate,Moderate,Medical,Private Health Insurance,,,,N,Y,52710.97,11885.98
Hudson Valley,Rockland,4329000,000779,Good Samaritan Hospital of Suffern,70 or Older,109,M,Other Race,Spanish/Hispanic,8,Emergency,Home or Self Care,2017,151,Other liver diseases,070,UP GASTRO ENDOSC/BIOPSY,283,Other disorders of the liver,07,Diseases and Disorders of the Hepatobiliary System and Pancreas,3,Major,Major,Medical,Medicaid,,,,N,Y,118705.38,22269.73
Hudson Valley,Westchester,5904001,001072,Montefiore New Rochelle Hospital,70 or Older,108,M,White,Unknown,5,Emergency,Home or Self Care,2017,151,Other liver diseases,083,BIOPSY OF LIVER,283,Other disorders of the liver,07,Diseases and Disorders of the Hepatobiliary System and Pancreas,3,Major,Minor,Medical,Medicare,Medicare,Private Health Insurance,,N,N,49970.00,21762.35
Hudson Valley,Westchester,5907001,001097,SJRH - St Johns Division,70 or Older,107,M,White,Not Span/Hispanic,5,Emergency,Expired,2017,151,Other liver diseases,000,NO PROC,283,Other disorders of the liver,07,Diseases and Disorders of the Hepatobiliary System and Pancreas,3,Major,Major,Medical,Medicare,Blue Cross/Blue Shield,Self-Pay,,N,Y,34094.16,12070.88
New York City,Bronx,7000011,001175,Calvary Hospital Inc,30 to 49,,F,Other Race,Spanish/Hispanic,10,Elective,Expired,2017,151,Other liver diseases,000,NO PROC,283,Other disorders of the liver,07,Diseases and Disorders of the Hepatobiliary System and Pancreas,3,Major,Moderate,Medical,Private Health Insurance,Private Health Insurance,,,N,N,22695.79,12302.62
New York City,Bronx,7000011,001175,Calvary Hospital Inc,70 or Older,107,F,White,Not Span/Hispanic,5,Elective,Expired,2017,151,Other liver diseases,000,NO PROC,283,Other disorders of the liver,07,Diseases and Disorders of the Hepatobiliary System and Pancreas,3,Major,Major,Medical,Private Health Insurance,Medicare,Blue Cross/Blue Shield,,N,N,10489.92,5686.23
New York City,Manhattan,7002053,001463,NYU Langone Hospitals,70 or Older,113,M,White,Not Span/Hispanic,3,Emergency,Home or Self Care,2017,151,Other liver diseases,088,ABDOMINAL PARACENTESIS,283,Other disorders of the liver,07,Diseases and Disorders of the Hepatobiliary System and Pancreas,1,Minor,Minor,Medical,Private Health Insurance,,,,N,Y,29861.80,13091.91
New York City,Manhattan,7002032,001469,Mount Sinai St. Luke's,50 to 69,100,M,White,Spanish/Hispanic,42,Emergency,Home w/ Home Health Services,2017,151,Other liver diseases,088,ABDOMINAL PARACENTESIS,283,Other disorders of the liver,07,Diseases and Disorders of the Hepatobiliary System and Pancreas,3,Major,Major,Medical,Medicare,Medicare,Medicaid,,N,Y,308537.92,90093.55
New York City,Manhattan,7002032,001469,Mount Sinai St. Luke's,50 to 69,100,F,Black/African American,Unknown,3,Emergency,Home or Self Care,2017,006,Hepatitis,196,DX ULTRASOUND AB/RETRO,283,Other disorders of the liver,07,Diseases and Disorders of the Hepatobiliary System and Pancreas,2,Moderate,Minor,Medical,Medicaid,Medicaid,Self-Pay,,N,Y,29739.71,7574.18
Long Island,Suffolk,5123000,000885,Brookhaven Memorial Hospital Medical Center Inc,50 to 69,119,M,White,Not Span/Hispanic,6,Emergency,Home w/ Home Health Services,2017,151,Other liver diseases,222,BLOOD TRANSFUSION,283,Other disorders of the liver,07,Diseases and Disorders of the Hepatobiliary System and Pancreas,3,Major,Major,Medical,Medicare,Medicare,,,N,Y,87615.95,18444.80