Hospital Service Area,Hospital County,Operating Certificate Number,Permanent Facility Id,Facility Name,Age Group,Zip Code - 3 digits,Gender,Race,Ethnicity,Length of Stay,Type of Admission,Patient Disposition,Discharge Year,CCS Diagnosis Code,CCS Diagnosis Description,CCS Procedure Code,CCS Procedure Description,APR DRG Code,APR DRG Description,APR MDC Code,APR MDC Description,APR Severity of Illness Code,APR Severity of Illness Description,APR Risk of Mortality,APR Medical Surgical Description,Payment Typology 1,Payment Typology 2,Payment Typology 3,Birth Weight,Abortion Edit Indicator,Emergency Department Indicator,Total Charges,Total Costs
New York City,Queens,7003001,001628,Flushing Hospital Medical Center,30 to 49,113,F,White,Spanish/Hispanic,5,Emergency,Home or Self Care,2018,SYM017,ABNORMAL FINDINGS WITHOUT DIAGNOSIS,,,283,OTHER DISORDERS OF THE LIVER,07,DISEASES AND DISORDERS OF THE HEPATOBILIARY SYSTEM AND PANCREAS,2,Moderate,Minor,Medical,Blue Cross/Blue Shield,,,,,true,16961.95,10308.4
Hudson Valley,Dutchess,1302001,000181,Vassar Brothers Medical Center,50 to 69,125,F,White,Not Span/Hispanic,9,Emergency,Expired,2018,DIG023,NONINFECTIOUS HEPATITIS,GIS027,"UPPER GI THERAPEUTIC PROCEDURES, NEC (ENDOSCOPIC)",283,OTHER DISORDERS OF THE LIVER,07,DISEASES AND DISORDERS OF THE HEPATOBILIARY SYSTEM AND PANCREAS,3,Major,Major,Medical,Blue Cross/Blue Shield,Medicare,,,,true,70269.19,18294.58
Capital/Adirond,Albany,0101003,000004,Samaritan Hospital - Albany Memorial Campus,30 to 49,112,F,Black/African American,Not Span/Hispanic,3,Emergency,Home or Self Care,2018,SYM006,ABDOMINAL PAIN AND OTHER DIGESTIVE/ABDOMEN SIGNS AND SYMPTOMS,GIS006,PARACENTESIS,283,OTHER DISORDERS OF THE LIVER,07,DISEASES AND DISORDERS OF THE HEPATOBILIARY SYSTEM AND PANCREAS,3,Major,Extreme,Medical,Medicare,Medicaid,,,,true,28069.55,5308.57
Long Island,Suffolk,5151001,000245,Stony Brook University Hospital,30 to 49,117,M,Other Race,Spanish/Hispanic,3,Emergency,Home or Self Care,2018,INF007,HEPATITIS,IMG006,COMPUTERIZED TOMOGRAPHY (CT) WITH CONTRAST,283,OTHER DISORDERS OF THE LIVER,07,DISEASES AND DISORDERS OF THE HEPATOBILIARY SYSTEM AND PANCREAS,3,Major,Extreme,Medical,Self-Pay,,,,,true,34780.98,8927.27
Capital/Adirond,Albany,0101004,000005,St. Peter's Hospital,70 or Older,120,M,White,Not Span/Hispanic,6,Emergency,Home or Self Care,2018,DIG019,OTHER SPECIFIED AND UNSPECIFIED LIVER DISEASE,,,283,OTHER DISORDERS OF THE LIVER,07,DISEASES AND DISORDERS OF THE HEPATOBILIARY SYSTEM AND PANCREAS,3,Major,Major,Medical,Medicare,Blue Cross/Blue Shield,,,,true,37040.9,11059.72
Capital/Adirond,Otsego,3801000,000739,A.O. Fox Memorial Hospital,50 to 69,121,F,White,Not Span/Hispanic,2,Emergency,Home or Self Care,2018,DIG019,OTHER SPECIFIED AND UNSPECIFIED LIVER DISEASE,,,283,OTHER DISORDERS OF THE LIVER,07,DISEASES AND DISORDERS OF THE HEPATOBILIARY SYSTEM AND PANCREAS,2,Moderate,Minor,Medical,Medicare,,,,,true,7696.94,4024.72
Finger Lakes,Ontario,3402000,000671,Geneva General Hospital,30 to 49,144,F,White,Not Span/Hispanic,3,Urgent,Home or Self Care,2018,DIG019,OTHER SPECIFIED AND UNSPECIFIED LIVER DISEASE,GIS006,PARACENTESIS,283,OTHER DISORDERS OF THE LIVER,07,DISEASES AND DISORDERS OF THE HEPATOBILIARY SYSTEM AND PANCREAS,3,Major,Moderate,Medical,Self-Pay,,,,,true,11602.2,3828.47
Long Island,Suffolk,5157003,000943,St Catherine of Siena Hospital,70 or Older,117,F,White,Not Span/Hispanic,3,Emergency,Home or Self Care,2018,SYM006,ABDOMINAL PAIN AND OTHER DIGESTIVE/ABDOMEN SIGNS AND SYMPTOMS,GIS006,PARACENTESIS,283,OTHER DISORDERS OF THE LIVER,07,DISEASES AND DISORDERS OF THE HEPATOBILIARY SYSTEM AND PANCREAS,3,Major,Major,Medical,Medicare,Private Health Insurance,,,,true,34853,5964.11
Central NY,Onondaga,3301003,000630,St. Joseph's Hospital Health Center,70 or Older,134,F,White,Not Span/Hispanic,3,Emergency,Home or Self Care,2018,DIG019,OTHER SPECIFIED AND UNSPECIFIED LIVER DISEASE,GIS027,"UPPER GI THERAPEUTIC PROCEDURES, NEC (ENDOSCOPIC)",283,OTHER DISORDERS OF THE LIVER,07,DISEASES AND DISORDERS OF THE HEPATOBILIARY SYSTEM AND PANCREAS,3,Major,Major,Medical,Medicare,Blue Cross/Blue Shield,,,,true,19187.71,8191.64
New York City,Manhattan,7002024,001456,Mount Sinai Hospital,50 to 69,113,M,Other Race,Spanish/Hispanic,3,Emergency,Home or Self Care,2018,DIG019,OTHER SPECIFIED AND UNSPECIFIED LIVER DISEASE,ADM001,TRANSFUSION OF BLOOD AND BLOOD PRODUCTS,283,OTHER DISORDERS OF THE LIVER,07,DISEASES AND DISORDERS OF THE HEPATOBILIARY SYSTEM AND PANCREAS,3,Major,Major,Medical,Medicare,Medicare,Medicaid,,,true,59361.15,14903.64
Finger Lakes,Monroe,2701005,000413,Strong Memorial Hospital,50 to 69,144,F,Other Race,Unknown,3,Emergency,Home or Self Care,2018,DIG019,OTHER SPECIFIED AND UNSPECIFIED LIVER DISEASE,GIS006,PARACENTESIS,283,OTHER DISORDERS OF THE LIVER,07,DISEASES AND DISORDERS OF THE HEPATOBILIARY SYSTEM AND PANCREAS,3,Major,Major,Medical,Medicare,,,,,true,18211.06,6926.98
New York City,Bronx,7000001,001178,BronxCare Hospital Center,50 to 69,104,M,Other Race,Unknown,8,Emergency,Home or Self Care,2018,INF007,HEPATITIS,GIS006,PARACENTESIS,283,OTHER DISORDERS OF THE LIVER,07,DISEASES AND DISORDERS OF THE HEPATOBILIARY SYSTEM AND PANCREAS,3,Major,Extreme,Medical,Medicare,Medicare,Medicaid,,,true,22496.58,28527.11
Hudson Valley,Orange,3522000,000694,St Luke's Cornwall Hospital/Newburgh,70 or Older,125,M,Other Race,Not Span/Hispanic,9,Emergency,Skilled Nursing Home,2018,DIG019,OTHER SPECIFIED AND UNSPECIFIED LIVER DISEASE,,,283,OTHER DISORDERS OF THE LIVER,07,DISEASES AND DISORDERS OF THE HEPATOBILIARY SYSTEM AND PANCREAS,3,Major,Major,Medical,Medicare,Blue Cross/Blue Shield,,,,true,84005.28,18898.29
Finger Lakes,Monroe,2701005,000413,Strong Memorial Hospital,0 to 17,144,F,White,Spanish/Hispanic,1,Elective,Home or Self Care,2018,SYM006,ABDOMINAL PAIN AND OTHER DIGESTIVE/ABDOMEN SIGNS AND SYMPTOMS,HEP001,LIVER BIOPSY,283,OTHER DISORDERS OF THE LIVER,07,DISEASES AND DISORDERS OF THE HEPATOBILIARY SYSTEM AND PANCREAS,1,Minor,Minor,Medical,Blue Cross/Blue Shield,Self-Pay,,,,false,21665.82,7648.54
New York City,Manhattan,7002024,001456,Mount Sinai Hospital,50 to 69,113,M,White,Not Span/Hispanic,1,Emergency,Home or Self Care,2018,DIG019,OTHER SPECIFIED AND UNSPECIFIED LIVER DISEASE,GIS006,PARACENTESIS,283,OTHER DISORDERS OF THE LIVER,07,DISEASES AND DISORDERS OF THE HEPATOBILIARY SYSTEM AND PANCREAS,3,Major,Moderate,Medical,Private Health Insurance,Self-Pay,,,,true,18203.45,5531.85
Central NY,Oswego,3702000,000727,Oswego Hospital,30 to 49,131,M,White,Not Span/Hispanic,2,Emergency,Court/Law Enforcement,2018,DIG019,OTHER SPECIFIED AND UNSPECIFIED LIVER DISEASE,,,283,OTHER DISORDERS OF THE LIVER,07,DISEASES AND DISORDERS OF THE HEPATOBILIARY SYSTEM AND PANCREAS,2,Moderate,Minor,Medical,Private Health Insurance,,,,,true,11176.41,7150.18
New York City,Richmond,7004003,001740,Staten Island University Hosp-North,70 or Older,103,F,White,Not Span/Hispanic,9,Emergency,Expired,2018,DIG023,NONINFECTIOUS HEPATITIS,GIS002,COLONOSCOPY AND PROCTOSCOPY WITH BIOPSY,283,OTHER DISORDERS OF THE LIVER,07,DISEASES AND DISORDERS OF THE HEPATOBILIARY SYSTEM AND PANCREAS,4,Extreme,Extreme,Medical,Medicare,Medicaid,,,,true,87525.53,23826.84
Western NY,Erie,1401014,003067,Millard Fillmore Suburban Hospital,70 or Older,140,M,White,Not Span/Hispanic,5,Emergency,Skilled Nursing Home,2018,DIG023,NONINFECTIOUS HEPATITIS,GNR004,ENDOSCOPIC CONTROL OF BLEEDING,283,OTHER DISORDERS OF THE LIVER,07,DISEASES AND DISORDERS OF THE HEPATOBILIARY SYSTEM AND PANCREAS,3,Major,Major,Medical,Medicare,Self-Pay,Self-Pay,,,true,25129.83,11204.23
New York City,Kings,7001016,001301,Kings County Hospital Center,70 or Older,112,F,Black/African American,Not Span/Hispanic,3,Emergency,Home or Self Care,2018,DIG019,OTHER SPECIFIED AND UNSPECIFIED LIVER DISEASE,,,283,OTHER DISORDERS OF THE LIVER,07,DISEASES AND DISORDERS OF THE HEPATOBILIARY SYSTEM AND PANCREAS,2,Moderate,Major,Medical,Medicare,Medicare,Medicaid,,,true,28391.12,20167.94
Long Island,Nassau,2951001,000541,North Shore University Hospital,70 or Older,113,M,White,Not Span/Hispanic,5,Emergency,Home or Self Care,2018,DIG019,OTHER SPECIFIED AND UNSPECIFIED LIVER DISEASE,GIS006,PARACENTESIS,283,OTHER DISORDERS OF THE LIVER,07,DISEASES AND DISORDERS OF THE HEPATOBILIARY SYSTEM AND PANCREAS,3,Major,Major,Medical,Medicare,Private Health Insurance,,,,true,57964,10871.73
New York City,Kings,7002002,001324,Mount Sinai Brooklyn,50 to 69,112,F,White,Not Span/Hispanic,4,Emergency,Home w/ Home Health Services,2018,INF007,HEPATITIS,,,283,OTHER DISORDERS OF THE LIVER,07,DISEASES AND DISORDERS OF THE HEPATOBILIARY SYSTEM AND PANCREAS,2,Moderate,Moderate,Medical,Medicare,Private Health Insurance,Medicaid,,,true,51440.83,8112.99
New York City,Bronx,7000006,003058,Montefiore Med Center - Jack D Weiler Hosp of A Einstein College Div,30 to 49,104,F,Black/African American,Spanish/Hispanic,4,Emergency,Home or Self Care,2018,INF007,HEPATITIS,ADM015,ADMINISTRATION OF ANTIBIOTICS,283,OTHER DISORDERS OF THE LIVER,07,DISEASES AND DISORDERS OF THE HEPATOBILIARY SYSTEM AND PANCREAS,2,Moderate,Minor,Medical,Private Health Insurance,,,,,true,52629.08,8619.32
Long Island,Suffolk,5123000,000885,Long Island Community Hospital,50 to 69,119,F,White,Not Span/Hispanic,1,Emergency,Short-term Hospital,2018,DIG019,OTHER SPECIFIED AND UNSPECIFIED LIVER DISEASE,CAR024,VENOUS AND ARTERIAL CATHETER PLACEMENT,283,OTHER DISORDERS OF THE LIVER,07,DISEASES AND DISORDERS OF THE HEPATOBILIARY SYSTEM AND PANCREAS,3,Major,Extreme,Medical,Medicare,Medicare,,,,true,60841.24,11779.08
New York City,Manhattan,7002002,001439,Mount Sinai Beth Israel,50 to 69,100,F,Other Race,Spanish/Hispanic,1,Emergency,Home w/ Home Health Services,2018,SYM006,ABDOMINAL PAIN AND OTHER DIGESTIVE/ABDOMEN SIGNS AND SYMPTOMS,GIS006,PARACENTESIS,283,OTHER DISORDERS OF THE LIVER,07,DISEASES AND DISORDERS OF THE HEPATOBILIARY SYSTEM AND PANCREAS,3,Major,Moderate,Medical,Medicaid,Medicaid,Self-Pay,,,true,27968.56,10530.04
Long Island,Nassau,2909000,000513,Mercy Hospital,70 or Older,116,M,Black/African American,Not Span/Hispanic,23,Emergency,Skilled Nursing Home,2018,SYM006,ABDOMINAL PAIN AND OTHER DIGESTIVE/ABDOMEN SIGNS AND SYMPTOMS,OTR004,ISOLATION PROCEDURES,283,OTHER DISORDERS OF THE LIVER,07,DISEASES AND DISORDERS OF THE HEPATOBILIARY SYSTEM AND PANCREAS,2,Moderate,Moderate,Medical,Medicare,Medicaid,,,,true,185389,39335.02
New York City,Kings,7001009,001294,Coney Island Hospital,30 to 49,112,M,White,Not Span/Hispanic,5,Emergency,Home or Self Care,2018,INF007,HEPATITIS,GIS006,PARACENTESIS,283,OTHER DISORDERS OF THE LIVER,07,DISEASES AND DISORDERS OF THE HEPATOBILIARY SYSTEM AND PANCREAS,3,Major,Moderate,Medical,Private Health Insurance,Medicaid,Medicaid,,,true,30078.58,16835.85
New York City,Kings,7002002,001324,Mount Sinai Brooklyn,50 to 69,112,M,White,Not Span/Hispanic,24,Emergency,Skilled Nursing Home,2018,DIG019,OTHER SPECIFIED AND UNSPECIFIED LIVER DISEASE,GIS006,PARACENTESIS,283,OTHER DISORDERS OF THE LIVER,07,DISEASES AND DISORDERS OF THE HEPATOBILIARY SYSTEM AND PANCREAS,4,Extreme,Major,Medical,Blue Cross/Blue Shield,Medicare,Self-Pay,,,true,239738.06,41865.1
New York City,Bronx,7000008,001172,Lincoln Medical & Mental Health Center,50 to 69,104,M,Other Race,Spanish/Hispanic,4,Emergency,Home or Self Care,2018,DIG019,OTHER SPECIFIED AND UNSPECIFIED LIVER DISEASE,,,283,OTHER DISORDERS OF THE LIVER,07,DISEASES AND DISORDERS OF THE HEPATOBILIARY SYSTEM AND PANCREAS,3,Major,Major,Medical,Medicare,Medicare,Medicaid,,,true,23031.39,13601.35
Capital/Adirond,Schenectady,4601001,000829,Ellis Hospital,50 to 69,123,F,Black/African American,Not Span/Hispanic,3,Emergency,Home or Self Care,2018,SYM006,ABDOMINAL PAIN AND OTHER DIGESTIVE/ABDOMEN SIGNS AND SYMPTOMS,GIS006,PARACENTESIS,283,OTHER DISORDERS OF THE LIVER,07,DISEASES AND DISORDERS OF THE HEPATOBILIARY SYSTEM AND PANCREAS,3,Major,Major,Medical,Medicare,Medicare,Medicaid,,,true,27202.2,7041.01
New York City,Queens,7003003,001629,Jamaica Hospital Medical Center,70 or Older,114,M,Other Race,Not Span/Hispanic,2,Emergency,Home or Self Care,2018,DIG023,NONINFECTIOUS HEPATITIS,ADM017,ADMINISTRATION OF NUTRITIONAL AND ELECTROLYTIC SUBSTANCES,283,OTHER DISORDERS OF THE LIVER,07,DISEASES AND DISORDERS OF THE HEPATOBILIARY SYSTEM AND PANCREAS,2,Moderate,Moderate,Medical,Medicare,,,,,true,11252,4546.96
Finger Lakes,Monroe,2701001,000409,Highland Hospital,70 or Older,144,F,White,Not Span/Hispanic,1,Emergency,Home or Self Care,2018,DIG019,OTHER SPECIFIED AND UNSPECIFIED LIVER DISEASE,GIS004,GI SYSTEM ENDOSCOPY WITHOUT BIOPSY (DIAGNOSTIC),283,OTHER DISORDERS OF THE LIVER,07,DISEASES AND DISORDERS OF THE HEPATOBILIARY SYSTEM AND PANCREAS,2,Moderate,Moderate,Medical,Medicare,Private Health Insurance,,,,true,8827.76,2640.82
New York City,Bronx,7000006,003058,Montefiore Med Center - Jack D Weiler Hosp of A Einstein College Div,50 to 69,104,M,Black/African American,Not Span/Hispanic,2,Emergency,Home or Self Care,2018,DIG019,OTHER SPECIFIED AND UNSPECIFIED LIVER DISEASE,IMG008,ULTRASONOGRAPHY,283,OTHER DISORDERS OF THE LIVER,07,DISEASES AND DISORDERS OF THE HEPATOBILIARY SYSTEM AND PANCREAS,3,Major,Minor,Medical,Private Health Insurance,,,,,true,22835.96,3777.2
New York City,Richmond,7004010,001738,Richmond University Medical Center,70 or Older,103,M,Black/African American,Not Span/Hispanic,6,Emergency,Home w/ Home Health Services,2018,DIG019,OTHER SPECIFIED AND UNSPECIFIED LIVER DISEASE,HEP001,LIVER BIOPSY,283,OTHER DISORDERS OF THE LIVER,07,DISEASES AND DISORDERS OF THE HEPATOBILIARY SYSTEM AND PANCREAS,2,Moderate,Moderate,Medical,Medicare,Medicare,Medicaid,,,false,56923.11,13289.21
Finger Lakes,Wayne,5820000,001028,Newark-Wayne Community Hospital,50 to 69,145,F,White,Not Span/Hispanic,11,Emergency,Home w/ Home Health Services,2018,DIG019,OTHER SPECIFIED AND UNSPECIFIED LIVER DISEASE,SKB006,SKIN LACERATION REPAIR (EXCLUDING PERINEUM),283,OTHER DISORDERS OF THE LIVER,07,DISEASES AND DISORDERS OF THE HEPATOBILIARY SYSTEM AND PANCREAS,3,Major,Moderate,Medical,Medicare,Medicaid,,,,true,36352.38,15393.92
New York City,Kings,7002002,001324,Mount Sinai Brooklyn,70 or Older,112,M,White,Not Span/Hispanic,5,Emergency,Home or Self Care,2018,DIG019,OTHER SPECIFIED AND UNSPECIFIED LIVER DISEASE,IMG008,ULTRASONOGRAPHY,283,OTHER DISORDERS OF THE LIVER,07,DISEASES AND DISORDERS OF THE HEPATOBILIARY SYSTEM AND PANCREAS,2,Moderate,Moderate,Medical,Blue Cross/Blue Shield,Self-Pay,,,,true,59915.89,11291.72
New York City,Queens,7003004,003376,Cohen Children's Medical Center,0 to 17,112,M,Other Race,Not Span/Hispanic,2,Emergency,Home or Self Care,2018,INF007,HEPATITIS,,,283,OTHER DISORDERS OF THE LIVER,07,DISEASES AND DISORDERS OF THE HEPATOBILIARY SYSTEM AND PANCREAS,3,Major,Minor,Medical,Medicaid,Medicaid,Self-Pay,,,false,22430.27,5241.73
New York City,Queens,7003007,001633,Queens Hospital Center,30 to 49,114,F,Other Race,Not Span/Hispanic,2,Emergency,Home or Self Care,2018,INF007,HEPATITIS,IMG008,ULTRASONOGRAPHY,283,OTHER DISORDERS OF THE LIVER,07,DISEASES AND DISORDERS OF THE HEPATOBILIARY SYSTEM AND PANCREAS,1,Minor,Minor,Medical,Medicaid,,,,,true,18580.91,9921.63
Long Island,Nassau,2950002,000528,Nassau University Medical Center,50 to 69,115,F,Black/African American,Not Span/Hispanic,9,Emergency,Home or Self Care,2018,DIG019,OTHER SPECIFIED AND UNSPECIFIED LIVER DISEASE,ESA001,HEMODIALYSIS,283,OTHER DISORDERS OF THE LIVER,07,DISEASES AND DISORDERS OF THE HEPATOBILIARY SYSTEM AND PANCREAS,3,Major,Major,Medical,Medicaid,Medicaid,Self-Pay,,,false,64529.75,23620.14
New York City,Bronx,7000006,003058,Montefiore Med Center - Jack D Weiler Hosp of A Einstein College Div,50 to 69,104,M,Other Race,Spanish/Hispanic,2,Emergency,Home or Self Care,2018,DIG019,OTHER SPECIFIED AND UNSPECIFIED LIVER DISEASE,GIS006,PARACENTESIS,283,OTHER DISORDERS OF THE LIVER,07,DISEASES AND DISORDERS OF THE HEPATOBILIARY SYSTEM AND PANCREAS,3,Major,Moderate,Medical,Medicare,Medicaid,,,,true,34650.43,8368.84
Central NY,Onondaga,3301007,000635,University Hospital SUNY Health Science Center,50 to 69,130,F,White,Not Span/Hispanic,4,Emergency,Home or Self Care,2018,SYM006,ABDOMINAL PAIN AND OTHER DIGESTIVE/ABDOMEN SIGNS AND SYMPTOMS,GIS006,PARACENTESIS,283,OTHER DISORDERS OF THE LIVER,07,DISEASES AND DISORDERS OF THE HEPATOBILIARY SYSTEM AND PANCREAS,3,Major,Moderate,Medical,Medicaid,,,,,false,29587.46,9116.52
Capital/Adirond,Albany,0101000,000001,Albany Medical Center Hospital,18 to 29,129,M,Black/African American,Not Span/Hispanic,13,Emergency,Court/Law Enforcement,2018,DIG019,OTHER SPECIFIED AND UNSPECIFIED LIVER DISEASE,GIS006,PARACENTESIS,283,OTHER DISORDERS OF THE LIVER,07,DISEASES AND DISORDERS OF THE HEPATOBILIARY SYSTEM AND PANCREAS,3,Major,Moderate,Medical,Department of Corrections,,,,,true,60721.57,23243.63
Capital/Adirond,Schenectady,4601001,000829,Ellis Hospital,50 to 69,123,F,White,Not Span/Hispanic,6,Emergency,Home w/ Home Health Services,2018,DIG023,NONINFECTIOUS HEPATITIS,GIS026,"UPPER GI THERAPEUTIC PROCEDURES, NEC (OPEN AND LAPAROSCOPIC)",283,OTHER DISORDERS OF THE LIVER,07,DISEASES AND DISORDERS OF THE HEPATOBILIARY SYSTEM AND PANCREAS,3,Major,Major,Medical,Medicare,Medicare,Private Health Insurance,,,true,53472.9,23769.58
Long Island,Suffolk,5155000,000938,Peconic Bay Medical Center,70 or Older,119,M,White,Spanish/Hispanic,4,Emergency,Home or Self Care,2018,DIG019,OTHER SPECIFIED AND UNSPECIFIED LIVER DISEASE,GIS006,PARACENTESIS,283,OTHER DISORDERS OF THE LIVER,07,DISEASES AND DISORDERS OF THE HEPATOBILIARY SYSTEM AND PANCREAS,3,Major,Major,Medical,Medicare,Blue Cross/Blue Shield,,,,true,39850.97,7903.95
New York City,Manhattan,7002053,001463,NYU Langone Hospitals,50 to 69,100,F,Black/African American,Not Span/Hispanic,1,Emergency,Home or Self Care,2018,DIG019,OTHER SPECIFIED AND UNSPECIFIED LIVER DISEASE,,,283,OTHER DISORDERS OF THE LIVER,07,DISEASES AND DISORDERS OF THE HEPATOBILIARY SYSTEM AND PANCREAS,1,Minor,Minor,Medical,Blue Cross/Blue Shield,,,,,true,35761.42,7809.88
Long Island,Nassau,2951001,000541,North Shore University Hospital,70 or Older,114,M,White,Not Span/Hispanic,6,Emergency,Home or Self Care,2018,DIG019,OTHER SPECIFIED AND UNSPECIFIED LIVER DISEASE,MAM006,PACEMAKER AND DEFIBRILLATOR INTERROGATION,283,OTHER DISORDERS OF THE LIVER,07,DISEASES AND DISORDERS OF THE HEPATOBILIARY SYSTEM AND PANCREAS,3,Major,Moderate,Medical,Medicare,Blue Cross/Blue Shield,,,,true,81467.55,12697.83
New York City,Bronx,7000008,001172,Lincoln Medical & Mental Health Center,50 to 69,104,M,Other Race,Not Span/Hispanic,4,Emergency,Home or Self Care,2018,DIG019,OTHER SPECIFIED AND UNSPECIFIED LIVER DISEASE,GIS001,ESOPHAGOGASTRODUODENOSCOPY (EGD) WITH BIOPSY,283,OTHER DISORDERS OF THE LIVER,07,DISEASES AND DISORDERS OF THE HEPATOBILIARY SYSTEM AND PANCREAS,3,Major,Major,Medical,Medicaid,Medicaid,,,,true,24453.18,14441
Western NY,Erie,1401014,000207,Buffalo General Medical Center,50 to 69,142,M,Black/African American,Not Span/Hispanic,3,Emergency,Home or Self Care,2018,INF007,HEPATITIS,,,283,OTHER DISORDERS OF THE LIVER,07,DISEASES AND DISORDERS OF THE HEPATOBILIARY SYSTEM AND PANCREAS,2,Moderate,Minor,Medical,Medicare,Self-Pay,,,,true,13309.24,5106.44
New York City,Kings,7001021,001306,New York - Presbyterian Brooklyn Methodist Hospital,70 or Older,112,F,White,Spanish/Hispanic,4,Emergency,Home w/ Home Health Services,2018,DIG019,OTHER SPECIFIED AND UNSPECIFIED LIVER DISEASE,GIS006,PARACENTESIS,283,OTHER DISORDERS OF THE LIVER,07,DISEASES AND DISORDERS OF THE HEPATOBILIARY SYSTEM AND PANCREAS,2,Moderate,Major,Medical,Medicare,Medicare,Medicaid,,,true,24016.47,6335.39
New York City,Queens,7003004,001630,Long Island Jewish Medical Center,30 to 49,115,F,White,Not Span/Hispanic,1,Emergency,Home or Self Care,2018,DIG023,NONINFECTIOUS HEPATITIS,,,283,OTHER DISORDERS OF THE LIVER,07,DISEASES AND DISORDERS OF THE HEPATOBILIARY SYSTEM AND PANCREAS,2,Moderate,Moderate,Medical,Blue Cross/Blue Shield,Self-Pay,,,,false,17133.73,2930.75
New York City,Queens,7003004,001630,Long Island Jewish Medical Center,30 to 49,115,F,Other Race,Spanish/Hispanic,2,Emergency,Home or Self Care,2018,DIG019,OTHER SPECIFIED AND UNSPECIFIED LIVER DISEASE,,,283,OTHER DISORDERS OF THE LIVER,07,DISEASES AND DISORDERS OF THE HEPATOBILIARY SYSTEM AND PANCREAS,3,Major,Moderate,Medical,Blue Cross/Blue Shield,Self-Pay,,,,false,23209.39,4332.25
Long Island,Nassau,2950002,000528,Nassau University Medical Center,50 to 69,115,M,Other Race,Spanish/Hispanic,2,Emergency,Home or Self Care,2018,DIG019,OTHER SPECIFIED AND UNSPECIFIED LIVER DISEASE,IMG007,COMPUTERIZED TOMOGRAPHY (CT) WITHOUT CONTRAST,283,OTHER DISORDERS OF THE LIVER,07,DISEASES AND DISORDERS OF THE HEPATOBILIARY SYSTEM AND PANCREAS,3,Major,Moderate,Medical,Medicaid,Self-Pay,,,,false,16212.75,4631.49
Hudson Valley,Westchester,5957001,001139,Westchester Medical Center,50 to 69,125,F,White,Not Span/Hispanic,13,Emergency,Home or Self Care,2018,DIG019,OTHER SPECIFIED AND UNSPECIFIED LIVER DISEASE,RES003,THORACENTESIS (DIAGNOSTIC),283,OTHER DISORDERS OF THE LIVER,07,DISEASES AND DISORDERS OF THE HEPATOBILIARY SYSTEM AND PANCREAS,4,Extreme,Major,Medical,Medicaid,Medicaid,,,,true,261898.73,50571.44
Western NY,Erie,1401014,000208,John R. Oishei Children's Hospital,0 to 17,148,F,White,Not Span/Hispanic,2,Emergency,Home or Self Care,2018,NEO073,BENIGN NEOPLASMS,IMG005,MAGNETIC RESONANCE IMAGING (MRI),283,OTHER DISORDERS OF THE LIVER,07,DISEASES AND DISORDERS OF THE HEPATOBILIARY SYSTEM AND PANCREAS,1,Minor,Minor,Medical,Medicaid,Self-Pay,,,,true,20225.91,8011.66
New York City,Manhattan,7002032,001466,Mount Sinai West,50 to 69,100,M,Black/African American,Not Span/Hispanic,6,Emergency,Left Against Medical Advice,2018,INF007,HEPATITIS,ADM021,"ADMINISTRATION OF THERAPEUTIC SUBSTANCES, NEC",283,OTHER DISORDERS OF THE LIVER,07,DISEASES AND DISORDERS OF THE HEPATOBILIARY SYSTEM AND PANCREAS,2,Moderate,Minor,Medical,Medicaid,Medicaid,Self-Pay,,,true,73735.69,17821.69
Long Island,Nassau,2951001,000541,North Shore University Hospital,50 to 69,115,F,White,Not Span/Hispanic,4,Emergency,Home or Self Care,2018,DIG019,OTHER SPECIFIED AND UNSPECIFIED LIVER DISEASE,GIS027,"UPPER GI THERAPEUTIC PROCEDURES, NEC (ENDOSCOPIC)",283,OTHER DISORDERS OF THE LIVER,07,DISEASES AND DISORDERS OF THE HEPATOBILIARY SYSTEM AND PANCREAS,3,Major,Extreme,Medical,Private Health Insurance,,,,,true,65518.17,14193.08
New York City,Kings,7001021,001306,New York - Presbyterian Brooklyn Methodist Hospital,70 or Older,112,M,Other Race,Not Span/Hispanic,8,Emergency,Home w/ Home Health Services,2018,DIG019,OTHER SPECIFIED AND UNSPECIFIED LIVER DISEASE,GIS006,PARACENTESIS,283,OTHER DISORDERS OF THE LIVER,07,DISEASES AND DISORDERS OF THE HEPATOBILIARY SYSTEM AND PANCREAS,4,Extreme,Major,Medical,Medicare,Medicare,Medicaid,,,true,57783.68,15284.86
Central NY,Onondaga,3301007,000628,UPSTATE University Hospital at Community General,50 to 69,137,M,White,Not Span/Hispanic,5,Emergency,Home or Self Care,2018,INF007,HEPATITIS,HEP001,LIVER BIOPSY,283,OTHER DISORDERS OF THE LIVER,07,DISEASES AND DISORDERS OF THE HEPATOBILIARY SYSTEM AND PANCREAS,2,Moderate,Minor,Medical,Medicaid,,,,,true,36123.8,10549.28
Long Island,Nassau,2951001,000541,North Shore University Hospital,50 to 69,105,M,White,Not Span/Hispanic,4,Emergency,Home or Self Care,2018,DIG019,OTHER SPECIFIED AND UNSPECIFIED LIVER DISEASE,,,283,OTHER DISORDERS OF THE LIVER,07,DISEASES AND DISORDERS OF THE HEPATOBILIARY SYSTEM AND PANCREAS,3,Major,Moderate,Medical,Private Health Insurance,,,,,true,56240.43,9172.64