Hospital Service Area,Hospital County,Operating Certificate Number,Permanent Facility Id,Facility Name,Age Group,Zip Code - 3 digits,Gender,Race,Ethnicity,Length of Stay,Type of Admission,Patient Disposition,Discharge Year,CCS Diagnosis Code,CCS Diagnosis Description,CCS Procedure Code,CCS Procedure Description,APR DRG Code,APR DRG Description,APR MDC Code,APR MDC Description,APR Severity of Illness Code,APR Severity of Illness Description,APR Risk of Mortality,APR Medical Surgical Description,Payment Typology 1,Payment Typology 2,Payment Typology 3,Birth Weight,Abortion Edit Indicator,Emergency Department Indicator,Total Charges,Total Costs
New York City,Kings,7002053,001304,NYU Langone Hospital-Brooklyn,70 or Older,112,F,Other Race,Not Span/Hispanic,6,Emergency,Home w/ Home Health Services,2019,DIG019,OTHER SPECIFIED AND UNSPECIFIED LIVER DISEASE,ADM015,ADMINISTRATION OF ANTIBIOTICS,283,OTHER DISORDERS OF THE LIVER,07,DISEASES AND DISORDERS OF THE HEPATOBILIARY SYSTEM AND PANCREAS,2,Moderate,Moderate,Medical,Medicare,Medicaid,,,,true,80432.35,23617.12
New York City,Kings,7002053,001304,NYU Langone Hospital-Brooklyn,50 to 69,112,F,White,Not Span/Hispanic,5,Emergency,Home or Self Care,2019,DIG019,OTHER SPECIFIED AND UNSPECIFIED LIVER DISEASE,GIS006,PARACENTESIS,283,OTHER DISORDERS OF THE LIVER,07,DISEASES AND DISORDERS OF THE HEPATOBILIARY SYSTEM AND PANCREAS,3,Major,Major,Medical,Medicaid,,,,,true,42586.67,17087.08
New York City,Kings,7002053,001304,NYU Langone Hospital-Brooklyn,50 to 69,112,M,Other Race,Not Span/Hispanic,2,Emergency,Home or Self Care,2019,DIG019,OTHER SPECIFIED AND UNSPECIFIED LIVER DISEASE,GIS006,PARACENTESIS,283,OTHER DISORDERS OF THE LIVER,07,DISEASES AND DISORDERS OF THE HEPATOBILIARY SYSTEM AND PANCREAS,3,Major,Moderate,Medical,Private Health Insurance,,,,,true,29390.21,8631.81
New York City,Kings,7002053,001304,NYU Langone Hospital-Brooklyn,50 to 69,112,F,Black/African American,Not Span/Hispanic,2,Emergency,Home or Self Care,2019,SYM006,ABDOMINAL PAIN AND OTHER DIGESTIVE/ABDOMEN SIGNS AND SYMPTOMS,GIS006,PARACENTESIS,283,OTHER DISORDERS OF THE LIVER,07,DISEASES AND DISORDERS OF THE HEPATOBILIARY SYSTEM AND PANCREAS,2,Moderate,Moderate,Medical,Private Health Insurance,,,,,true,32613.11,9334.7
New York City,Kings,7002053,001304,NYU Langone Hospital-Brooklyn,70 or Older,112,F,White,Not Span/Hispanic,4,Emergency,Home w/ Home Health Services,2019,DIG019,OTHER SPECIFIED AND UNSPECIFIED LIVER DISEASE,ADM021,"ADMINISTRATION OF THERAPEUTIC SUBSTANCES, NEC",283,OTHER DISORDERS OF THE LIVER,07,DISEASES AND DISORDERS OF THE HEPATOBILIARY SYSTEM AND PANCREAS,3,Major,Major,Medical,Medicaid,,,,,true,117691.99,38563.84
New York City,Kings,7002053,001304,NYU Langone Hospital-Brooklyn,70 or Older,112,M,Other Race,Not Span/Hispanic,3,Emergency,Home w/ Home Health Services,2019,DIG019,OTHER SPECIFIED AND UNSPECIFIED LIVER DISEASE,GIS027,"UPPER GI THERAPEUTIC PROCEDURES, NEC (ENDOSCOPIC)",283,OTHER DISORDERS OF THE LIVER,07,DISEASES AND DISORDERS OF THE HEPATOBILIARY SYSTEM AND PANCREAS,3,Major,Major,Medical,Medicare,Blue Cross/Blue Shield,,,,true,116500.73,26293.52
New York City,Kings,7002053,001304,NYU Langone Hospital-Brooklyn,70 or Older,112,F,Other Race,Spanish/Hispanic,2,Emergency,Home or Self Care,2019,DIG019,OTHER SPECIFIED AND UNSPECIFIED LIVER DISEASE,GIS006,PARACENTESIS,283,OTHER DISORDERS OF THE LIVER,07,DISEASES AND DISORDERS OF THE HEPATOBILIARY SYSTEM AND PANCREAS,4,Extreme,Major,Medical,Medicaid,,,,,true,45605.28,10010.8
New York City,Kings,7002053,001304,NYU Langone Hospital-Brooklyn,50 to 69,112,F,White,Not Span/Hispanic,4,Emergency,Home or Self Care,2019,DIG019,OTHER SPECIFIED AND UNSPECIFIED LIVER DISEASE,MAM011,ELECTROENCEPHALOGRAM (EEG),283,OTHER DISORDERS OF THE LIVER,07,DISEASES AND DISORDERS OF THE HEPATOBILIARY SYSTEM AND PANCREAS,3,Major,Moderate,Medical,Medicaid,,,,,true,74039.97,25216.32
New York City,Kings,7002053,001304,NYU Langone Hospital-Brooklyn,50 to 69,112,F,White,Spanish/Hispanic,3,Emergency,Home or Self Care,2019,DIG019,OTHER SPECIFIED AND UNSPECIFIED LIVER DISEASE,,,283,OTHER DISORDERS OF THE LIVER,07,DISEASES AND DISORDERS OF THE HEPATOBILIARY SYSTEM AND PANCREAS,2,Moderate,Minor,Medical,Medicaid,,,,,true,57607.94,14176.94
New York City,Kings,7002053,001304,NYU Langone Hospital-Brooklyn,50 to 69,112,M,White,Not Span/Hispanic,6,Emergency,Home or Self Care,2019,DIG019,OTHER SPECIFIED AND UNSPECIFIED LIVER DISEASE,,,283,OTHER DISORDERS OF THE LIVER,07,DISEASES AND DISORDERS OF THE HEPATOBILIARY SYSTEM AND PANCREAS,4,Extreme,Major,Medical,Medicare,,,,,true,73272.21,22475.04
New York City,Kings,7002053,001304,NYU Langone Hospital-Brooklyn,50 to 69,112,M,Other Race,Not Span/Hispanic,3,Emergency,Home or Self Care,2019,DIG019,OTHER SPECIFIED AND UNSPECIFIED LIVER DISEASE,GIS027,"UPPER GI THERAPEUTIC PROCEDURES, NEC (ENDOSCOPIC)",283,OTHER DISORDERS OF THE LIVER,07,DISEASES AND DISORDERS OF THE HEPATOBILIARY SYSTEM AND PANCREAS,3,Major,Major,Medical,Private Health Insurance,,,,,true,78047.7,24906.51
New York City,Kings,7002053,001304,NYU Langone Hospital-Brooklyn,50 to 69,112,F,Other Race,Spanish/Hispanic,11,Emergency,Home w/ Home Health Services,2019,DIG019,OTHER SPECIFIED AND UNSPECIFIED LIVER DISEASE,,,283,OTHER DISORDERS OF THE LIVER,07,DISEASES AND DISORDERS OF THE HEPATOBILIARY SYSTEM AND PANCREAS,3,Major,Major,Medical,Medicare,Medicaid,,,,true,187513.76,42412.15
New York City,Kings,7002053,001304,NYU Langone Hospital-Brooklyn,30 to 49,112,M,White,Not Span/Hispanic,1,Emergency,Home or Self Care,2019,DIG023,NONINFECTIOUS HEPATITIS,,,283,OTHER DISORDERS OF THE LIVER,07,DISEASES AND DISORDERS OF THE HEPATOBILIARY SYSTEM AND PANCREAS,1,Minor,Minor,Medical,Medicaid,,,,,true,31317.18,7097.94
New York City,Kings,7002053,001304,NYU Langone Hospital-Brooklyn,18 to 29,112,M,Other Race,Unknown,1,Emergency,Home or Self Care,2019,INJ010,"INTERNAL ORGAN INJURY, INITIAL ENCOUNTER",ADM021,"ADMINISTRATION OF THERAPEUTIC SUBSTANCES, NEC",283,OTHER DISORDERS OF THE LIVER,07,DISEASES AND DISORDERS OF THE HEPATOBILIARY SYSTEM AND PANCREAS,2,Moderate,Minor,Medical,Medicaid,,,,,true,30779.26,7175.56
New York City,Kings,7002053,001304,NYU Langone Hospital-Brooklyn,70 or Older,112,M,Other Race,Not Span/Hispanic,3,Emergency,Home w/ Home Health Services,2019,DIG019,OTHER SPECIFIED AND UNSPECIFIED LIVER DISEASE,GIS004,GI SYSTEM ENDOSCOPY WITHOUT BIOPSY (DIAGNOSTIC),283,OTHER DISORDERS OF THE LIVER,07,DISEASES AND DISORDERS OF THE HEPATOBILIARY SYSTEM AND PANCREAS,3,Major,Major,Medical,Medicare,Blue Cross/Blue Shield,,,,true,60811.45,14879.79
New York City,Kings,7002053,001304,NYU Langone Hospital-Brooklyn,50 to 69,112,F,White,Not Span/Hispanic,26,Emergency,Left Against Medical Advice,2019,DIG019,OTHER SPECIFIED AND UNSPECIFIED LIVER DISEASE,GIS006,PARACENTESIS,283,OTHER DISORDERS OF THE LIVER,07,DISEASES AND DISORDERS OF THE HEPATOBILIARY SYSTEM AND PANCREAS,4,Extreme,Extreme,Medical,Medicaid,,,,,true,260829.09,88696.64
New York City,Kings,7002053,001304,NYU Langone Hospital-Brooklyn,70 or Older,112,F,White,Not Span/Hispanic,17,Emergency,Hospice - Medical Facility,2019,DIG019,OTHER SPECIFIED AND UNSPECIFIED LIVER DISEASE,GIS006,PARACENTESIS,283,OTHER DISORDERS OF THE LIVER,07,DISEASES AND DISORDERS OF THE HEPATOBILIARY SYSTEM AND PANCREAS,4,Extreme,Major,Medical,Medicare,Private Health Insurance,,,,true,134610.65,56486.5
New York City,Kings,7002053,001304,NYU Langone Hospital-Brooklyn,0 to 17,112,F,White,Spanish/Hispanic,1,Emergency,Short-term Hospital,2019,INF007,HEPATITIS,,,283,OTHER DISORDERS OF THE LIVER,07,DISEASES AND DISORDERS OF THE HEPATOBILIARY SYSTEM AND PANCREAS,2,Moderate,Moderate,Medical,Private Health Insurance,,,,,true,42817.55,8085.04
New York City,Kings,7002053,001304,NYU Langone Hospital-Brooklyn,50 to 69,112,M,Other Race,Not Span/Hispanic,1,Emergency,Home or Self Care,2019,DIG019,OTHER SPECIFIED AND UNSPECIFIED LIVER DISEASE,ADM021,"ADMINISTRATION OF THERAPEUTIC SUBSTANCES, NEC",283,OTHER DISORDERS OF THE LIVER,07,DISEASES AND DISORDERS OF THE HEPATOBILIARY SYSTEM AND PANCREAS,3,Major,Moderate,Medical,Private Health Insurance,,,,,true,12642.66,4247.92
New York City,Kings,7002053,001304,NYU Langone Hospital-Brooklyn,50 to 69,112,F,White,Not Span/Hispanic,8,Emergency,Home w/ Home Health Services,2019,DIG019,OTHER SPECIFIED AND UNSPECIFIED LIVER DISEASE,GIS006,PARACENTESIS,283,OTHER DISORDERS OF THE LIVER,07,DISEASES AND DISORDERS OF THE HEPATOBILIARY SYSTEM AND PANCREAS,3,Major,Moderate,Medical,Medicaid,,,,,true,122055.75,42123.37
New York City,Kings,7002053,001304,NYU Langone Hospital-Brooklyn,50 to 69,112,F,Other Race,Not Span/Hispanic,5,Emergency,Home or Self Care,2019,DIG019,OTHER SPECIFIED AND UNSPECIFIED LIVER DISEASE,GIS006,PARACENTESIS,283,OTHER DISORDERS OF THE LIVER,07,DISEASES AND DISORDERS OF THE HEPATOBILIARY SYSTEM AND PANCREAS,4,Extreme,Extreme,Medical,Medicare,Medicaid,,,,true,80895.4,25958.83
New York City,Kings,7002053,001304,NYU Langone Hospital-Brooklyn,30 to 49,112,F,Other Race,Not Span/Hispanic,1,Emergency,Home or Self Care,2019,INF007,HEPATITIS,ADM021,"ADMINISTRATION OF THERAPEUTIC SUBSTANCES, NEC",283,OTHER DISORDERS OF THE LIVER,07,DISEASES AND DISORDERS OF THE HEPATOBILIARY SYSTEM AND PANCREAS,1,Minor,Minor,Medical,Self-Pay,,,,,true,17915.04,4986.17
New York City,Kings,7002053,001304,NYU Langone Hospital-Brooklyn,18 to 29,112,M,White,Not Span/Hispanic,1,Emergency,Home or Self Care,2019,SYM006,ABDOMINAL PAIN AND OTHER DIGESTIVE/ABDOMEN SIGNS AND SYMPTOMS,,,283,OTHER DISORDERS OF THE LIVER,07,DISEASES AND DISORDERS OF THE HEPATOBILIARY SYSTEM AND PANCREAS,2,Moderate,Minor,Medical,Blue Cross/Blue Shield,,,,,true,40526.56,11852.92
New York City,Kings,7002053,001304,NYU Langone Hospital-Brooklyn,70 or Older,112,M,White,Not Span/Hispanic,2,Emergency,Home or Self Care,2019,DIG019,OTHER SPECIFIED AND UNSPECIFIED LIVER DISEASE,GIS006,PARACENTESIS,283,OTHER DISORDERS OF THE LIVER,07,DISEASES AND DISORDERS OF THE HEPATOBILIARY SYSTEM AND PANCREAS,3,Major,Major,Medical,Medicare,Blue Cross/Blue Shield,,,,true,35482.38,9164.11
New York City,Kings,7002053,001304,NYU Langone Hospital-Brooklyn,50 to 69,112,F,White,Spanish/Hispanic,1,Emergency,Home or Self Care,2019,DIG019,OTHER SPECIFIED AND UNSPECIFIED LIVER DISEASE,,,283,OTHER DISORDERS OF THE LIVER,07,DISEASES AND DISORDERS OF THE HEPATOBILIARY SYSTEM AND PANCREAS,1,Minor,Minor,Medical,Medicaid,,,,,true,26345.55,5930.14
New York City,Kings,7002053,001304,NYU Langone Hospital-Brooklyn,70 or Older,112,M,Other Race,Spanish/Hispanic,4,Emergency,Home or Self Care,2019,SYM006,ABDOMINAL PAIN AND OTHER DIGESTIVE/ABDOMEN SIGNS AND SYMPTOMS,GIS006,PARACENTESIS,283,OTHER DISORDERS OF THE LIVER,07,DISEASES AND DISORDERS OF THE HEPATOBILIARY SYSTEM AND PANCREAS,3,Major,Major,Medical,Medicare,,,,,true,71145.03,17925.85
New York City,Kings,7002053,001304,NYU Langone Hospital-Brooklyn,70 or Older,112,F,Other Race,Spanish/Hispanic,3,Emergency,Home w/ Home Health Services,2019,DIG019,OTHER SPECIFIED AND UNSPECIFIED LIVER DISEASE,GIS006,PARACENTESIS,283,OTHER DISORDERS OF THE LIVER,07,DISEASES AND DISORDERS OF THE HEPATOBILIARY SYSTEM AND PANCREAS,3,Major,Major,Medical,Private Health Insurance,Medicaid,,,,true,56493.33,13988.35
New York City,Kings,7002053,001304,NYU Langone Hospital-Brooklyn,50 to 69,112,F,White,Not Span/Hispanic,3,Emergency,Left Against Medical Advice,2019,DIG019,OTHER SPECIFIED AND UNSPECIFIED LIVER DISEASE,GIS004,GI SYSTEM ENDOSCOPY WITHOUT BIOPSY (DIAGNOSTIC),283,OTHER DISORDERS OF THE LIVER,07,DISEASES AND DISORDERS OF THE HEPATOBILIARY SYSTEM AND PANCREAS,3,Major,Major,Medical,Medicare,Blue Cross/Blue Shield,,,,true,145758.23,36113.21
New York City,Kings,7002053,001304,NYU Langone Hospital-Brooklyn,30 to 49,112,F,Black/African American,Spanish/Hispanic,2,Emergency,Home or Self Care,2019,SYM006,ABDOMINAL PAIN AND OTHER DIGESTIVE/ABDOMEN SIGNS AND SYMPTOMS,GIS024,OTHER PERITONEAL CAVITY PROCEDURES,283,OTHER DISORDERS OF THE LIVER,07,DISEASES AND DISORDERS OF THE HEPATOBILIARY SYSTEM AND PANCREAS,2,Moderate,Moderate,Medical,Medicaid,,,,,true,99925.44,17985.91
New York City,Kings,7002053,001304,NYU Langone Hospital-Brooklyn,30 to 49,112,M,White,Not Span/Hispanic,2,Emergency,Home or Self Care,2019,END016,OTHER SPECIFIED AND UNSPECIFIED NUTRITIONAL AND METABOLIC DISORDERS,,,283,OTHER DISORDERS OF THE LIVER,07,DISEASES AND DISORDERS OF THE HEPATOBILIARY SYSTEM AND PANCREAS,2,Moderate,Moderate,Medical,Medicare,Medicaid,,,,true,31797.56,9274.57
New York City,Kings,7002053,001304,NYU Langone Hospital-Brooklyn,50 to 69,112,F,White,Not Span/Hispanic,2,Emergency,Home or Self Care,2019,DIG019,OTHER SPECIFIED AND UNSPECIFIED LIVER DISEASE,GIS006,PARACENTESIS,283,OTHER DISORDERS OF THE LIVER,07,DISEASES AND DISORDERS OF THE HEPATOBILIARY SYSTEM AND PANCREAS,3,Major,Major,Medical,Private Health Insurance,,,,,true,71005.29,14057.39
New York City,Kings,7002053,001304,NYU Langone Hospital-Brooklyn,70 or Older,OOS,M,White,Not Span/Hispanic,6,Emergency,Home or Self Care,2019,DIG019,OTHER SPECIFIED AND UNSPECIFIED LIVER DISEASE,GIS027,"UPPER GI THERAPEUTIC PROCEDURES, NEC (ENDOSCOPIC)",283,OTHER DISORDERS OF THE LIVER,07,DISEASES AND DISORDERS OF THE HEPATOBILIARY SYSTEM AND PANCREAS,3,Major,Major,Medical,Medicare,Blue Cross/Blue Shield,,,,true,105666.79,27427.85
New York City,Kings,7002053,001304,NYU Langone Hospital-Brooklyn,30 to 49,112,M,Other Race,Not Span/Hispanic,4,Emergency,Home or Self Care,2019,INF007,HEPATITIS,,,283,OTHER DISORDERS OF THE LIVER,07,DISEASES AND DISORDERS OF THE HEPATOBILIARY SYSTEM AND PANCREAS,1,Minor,Minor,Medical,Private Health Insurance,,,,,true,60265.55,17222.85
New York City,Kings,7002053,001304,NYU Langone Hospital-Brooklyn,18 to 29,112,M,White,Not Span/Hispanic,2,Emergency,Home or Self Care,2019,INF007,HEPATITIS,,,283,OTHER DISORDERS OF THE LIVER,07,DISEASES AND DISORDERS OF THE HEPATOBILIARY SYSTEM AND PANCREAS,2,Moderate,Minor,Medical,Medicaid,,,,,true,46089.38,10992.4
New York City,Kings,7002053,001304,NYU Langone Hospital-Brooklyn,50 to 69,112,M,Other Race,Not Span/Hispanic,10,Emergency,Home or Self Care,2019,DIG019,OTHER SPECIFIED AND UNSPECIFIED LIVER DISEASE,GIS006,PARACENTESIS,283,OTHER DISORDERS OF THE LIVER,07,DISEASES AND DISORDERS OF THE HEPATOBILIARY SYSTEM AND PANCREAS,3,Major,Major,Medical,Medicaid,,,,,true,98920.83,34623.85
New York City,Kings,7002053,001304,NYU Langone Hospital-Brooklyn,50 to 69,112,M,Other Race,Not Span/Hispanic,6,Emergency,Short-term Hospital,2019,DIG019,OTHER SPECIFIED AND UNSPECIFIED LIVER DISEASE,GIS027,"UPPER GI THERAPEUTIC PROCEDURES, NEC (ENDOSCOPIC)",283,OTHER DISORDERS OF THE LIVER,07,DISEASES AND DISORDERS OF THE HEPATOBILIARY SYSTEM AND PANCREAS,4,Extreme,Major,Medical,Medicaid,,,,,true,122269.93,32252.29
New York City,Kings,7002053,001304,NYU Langone Hospital-Brooklyn,70 or Older,112,M,White,Not Span/Hispanic,6,Emergency,Hospice - Medical Facility,2019,DIG019,OTHER SPECIFIED AND UNSPECIFIED LIVER DISEASE,GIS006,PARACENTESIS,283,OTHER DISORDERS OF THE LIVER,07,DISEASES AND DISORDERS OF THE HEPATOBILIARY SYSTEM AND PANCREAS,4,Extreme,Extreme,Medical,Medicare,,,,,true,89792.04,29450.08
New York City,Kings,7002053,001304,NYU Langone Hospital-Brooklyn,70 or Older,112,F,Other Race,Spanish/Hispanic,5,Emergency,Home w/ Home Health Services,2019,DIG019,OTHER SPECIFIED AND UNSPECIFIED LIVER DISEASE,GIS006,PARACENTESIS,283,OTHER DISORDERS OF THE LIVER,07,DISEASES AND DISORDERS OF THE HEPATOBILIARY SYSTEM AND PANCREAS,3,Major,Major,Medical,Medicare,,,,,true,108702.36,31450.56
New York City,Kings,7002053,001304,NYU Langone Hospital-Brooklyn,30 to 49,112,F,Other Race,Not Span/Hispanic,4,Emergency,Home or Self Care,2019,INF007,HEPATITIS,,,283,OTHER DISORDERS OF THE LIVER,07,DISEASES AND DISORDERS OF THE HEPATOBILIARY SYSTEM AND PANCREAS,3,Major,Moderate,Medical,Medicaid,,,,,true,54999.51,15811.6
New York City,Kings,7002053,001304,NYU Langone Hospital-Brooklyn,50 to 69,112,M,Other Race,Not Span/Hispanic,2,Emergency,Home or Self Care,2019,DIG019,OTHER SPECIFIED AND UNSPECIFIED LIVER DISEASE,ADM021,"ADMINISTRATION OF THERAPEUTIC SUBSTANCES, NEC",283,OTHER DISORDERS OF THE LIVER,07,DISEASES AND DISORDERS OF THE HEPATOBILIARY SYSTEM AND PANCREAS,3,Major,Moderate,Medical,Medicaid,,,,,true,40056.54,9409.25
