Hospital Service Area,Hospital County,Operating Certificate Number,Permanent Facility Id,Facility Name,Age Group,Zip Code - 3 digits,Gender,Race,Ethnicity,Length of Stay,Type of Admission,Patient Disposition,Discharge Year,CCS Diagnosis Code,CCS Diagnosis Description,CCS Procedure Code,CCS Procedure Description,APR DRG Code,APR DRG Description,APR MDC Code,APR MDC Description,APR Severity of Illness Code,APR Severity of Illness Description,APR Risk of Mortality,APR Medical Surgical Description,Payment Typology 1,Payment Typology 2,Payment Typology 3,Birth Weight,Abortion Edit Indicator,Emergency Department Indicator,Total Charges,Total Costs
New York City,Bronx,7000006,001169,Montefiore Medical Center - Henry & Lucy Moses Div,30 to 49,104,F,Other Race,Spanish/Hispanic,5,Emergency,Home or Self Care,2020,INF007,HEPATITIS,,,283,OTHER DISORDERS OF THE LIVER,07,DISEASES AND DISORDERS OF THE HEPATOBILIARY SYSTEM AND PANCREAS,2,Moderate,Minor,Medical,Private Health Insurance,,,,,Y,59267.98,9016.48
New York City,Bronx,7000006,001169,Montefiore Medical Center - Henry & Lucy Moses Div,18 to 29,104,M,Other Race,Spanish/Hispanic,4,Emergency,Left Against Medical Advice,2020,INF007,HEPATITIS,,,283,OTHER DISORDERS OF THE LIVER,07,DISEASES AND DISORDERS OF THE HEPATOBILIARY SYSTEM AND PANCREAS,2,Moderate,Minor,Medical,Medicaid,,,,,Y,75366.93,14362.03
New York City,Manhattan,7002024,001456,Mount Sinai Hospital,50 to 69,114,F,Other Race,Not Span/Hispanic,4,Emergency,Skilled Nursing Home,2020,DIG019,OTHER SPECIFIED AND UNSPECIFIED LIVER DISEASE,GIS006,PARACENTESIS,283,OTHER DISORDERS OF THE LIVER,07,DISEASES AND DISORDERS OF THE HEPATOBILIARY SYSTEM AND PANCREAS,3,Major,Major,Medical,Medicare,Medicare,Medicaid,,,Y,58278.4,14502.84
Capital/Adirond,Otsego,3801000,000739,A.O. Fox Memorial Hospital,50 to 69,138,M,White,Not Span/Hispanic,3,Emergency,Home or Self Care,2020,DIG019,OTHER SPECIFIED AND UNSPECIFIED LIVER DISEASE,,,283,OTHER DISORDERS OF THE LIVER,07,DISEASES AND DISORDERS OF THE HEPATOBILIARY SYSTEM AND PANCREAS,3,Major,Moderate,Medical,Private Health Insurance,,,,,Y,11888.14,5656.29
New York City,Bronx,7000006,001169,Montefiore Medical Center - Henry & Lucy Moses Div,70 or Older,107,M,White,Unknown,17,Emergency,Home w/ Home Health Services,2020,INF007,HEPATITIS,GNR004,ENDOSCOPIC CONTROL OF BLEEDING,283,OTHER DISORDERS OF THE LIVER,07,DISEASES AND DISORDERS OF THE HEPATOBILIARY SYSTEM AND PANCREAS,3,Major,Extreme,Medical,Medicare,Private Health Insurance,,,,Y,257692.75,49441.29
New York City,Bronx,7000006,001169,Montefiore Medical Center - Henry & Lucy Moses Div,30 to 49,104,F,Other Race,Spanish/Hispanic,7,Emergency,Home or Self Care,2020,INF007,HEPATITIS,,,283,OTHER DISORDERS OF THE LIVER,07,DISEASES AND DISORDERS OF THE HEPATOBILIARY SYSTEM AND PANCREAS,3,Major,Major,Medical,Medicare,Medicaid,,,,Y,102041.84,18135.29
New York City,Bronx,7000006,001169,Montefiore Medical Center - Henry & Lucy Moses Div,70 or Older,104,F,Other Race,Spanish/Hispanic,4,Emergency,Home or Self Care,2020,DIG019,OTHER SPECIFIED AND UNSPECIFIED LIVER DISEASE,RES005,CHEST TUBE PLACEMENT AND THERAPEUTIC THORACENTESIS,283,OTHER DISORDERS OF THE LIVER,07,DISEASES AND DISORDERS OF THE HEPATOBILIARY SYSTEM AND PANCREAS,4,Extreme,Major,Medical,Medicare,Medicaid,,,,Y,78904.19,12263.68
New York City,Manhattan,7002024,001456,Mount Sinai Hospital,30 to 49,100,M,Other Race,Spanish/Hispanic,4,Emergency,Home or Self Care,2020,DIG023,NONINFECTIOUS HEPATITIS,GIS006,PARACENTESIS,283,OTHER DISORDERS OF THE LIVER,07,DISEASES AND DISORDERS OF THE HEPATOBILIARY SYSTEM AND PANCREAS,2,Moderate,Moderate,Medical,Medicaid,Medicaid,Self-Pay,,,Y,63417.15,14236.06
New York City,Manhattan,7002024,001456,Mount Sinai Hospital,50 to 69,104,M,Other Race,Unknown,2,Urgent,Home or Self Care,2020,DIG019,OTHER SPECIFIED AND UNSPECIFIED LIVER DISEASE,IMG006,COMPUTERIZED TOMOGRAPHY (CT) WITH CONTRAST,283,OTHER DISORDERS OF THE LIVER,07,DISEASES AND DISORDERS OF THE HEPATOBILIARY SYSTEM AND PANCREAS,3,Major,Major,Medical,Medicare,Medicaid,Self-Pay,,,N,47997.02,12215.56
New York City,Bronx,7000006,003058,Montefiore Med Center - Jack D Weiler Hosp of A Einstein College Div,50 to 69,104,M,Other Race,Spanish/Hispanic,5,Emergency,Home w/ Home Health Services,2020,DIG019,OTHER SPECIFIED AND UNSPECIFIED LIVER DISEASE,IMG008,ULTRASONOGRAPHY,283,OTHER DISORDERS OF THE LIVER,07,DISEASES AND DISORDERS OF THE HEPATOBILIARY SYSTEM AND PANCREAS,3,Major,Major,Medical,Medicare,Medicaid,,,,Y,59089.6,8132.45
New York City,Manhattan,7002032,001466,Mount Sinai West,30 to 49,112,M,Other Race,Not Span/Hispanic,1,Emergency,Home or Self Care,2020,INF007,HEPATITIS,ADM021,"ADMINISTRATION OF THERAPEUTIC SUBSTANCES, NEC",283,OTHER DISORDERS OF THE LIVER,07,DISEASES AND DISORDERS OF THE HEPATOBILIARY SYSTEM AND PANCREAS,2,Moderate,Minor,Medical,Medicaid,Medicaid,Self-Pay,,,N,18024.99,3348.19
New York City,Manhattan,7002002,001439,Mount Sinai Beth Israel,70 or Older,,F,Other Race,Not Span/Hispanic,8,Emergency,Home w/ Home Health Services,2020,DIG019,OTHER SPECIFIED AND UNSPECIFIED LIVER DISEASE,GIS006,PARACENTESIS,283,OTHER DISORDERS OF THE LIVER,07,DISEASES AND DISORDERS OF THE HEPATOBILIARY SYSTEM AND PANCREAS,4,Extreme,Extreme,Medical,Medicare,Miscellaneous/Other,Self-Pay,,,Y,151681.19,36700.52
New York City,Manhattan,7002002,001439,Mount Sinai Beth Israel,30 to 49,113,M,Other Race,Spanish/Hispanic,1,Emergency,Home or Self Care,2020,INF007,HEPATITIS,IMG008,ULTRASONOGRAPHY,283,OTHER DISORDERS OF THE LIVER,07,DISEASES AND DISORDERS OF THE HEPATOBILIARY SYSTEM AND PANCREAS,1,Minor,Minor,Medical,Medicaid,Self-Pay,,,,N,18321.6,3230.19
New York City,Bronx,7000006,001168,Montefiore Medical Center-Wakefield Hospital,70 or Older,104,F,Black/African American,Not Span/Hispanic,2,Emergency,Home w/ Home Health Services,2020,INF007,HEPATITIS,,,283,OTHER DISORDERS OF THE LIVER,07,DISEASES AND DISORDERS OF THE HEPATOBILIARY SYSTEM AND PANCREAS,3,Major,Major,Medical,Medicare,Medicaid,,,,Y,54648,8487.32
New York City,Manhattan,7002024,001456,Mount Sinai Hospital,70 or Older,112,M,Black/African American,Not Span/Hispanic,13,Emergency,Expired,2020,DIG019,OTHER SPECIFIED AND UNSPECIFIED LIVER DISEASE,GIS006,PARACENTESIS,283,OTHER DISORDERS OF THE LIVER,07,DISEASES AND DISORDERS OF THE HEPATOBILIARY SYSTEM AND PANCREAS,4,Extreme,Extreme,Medical,Medicare,Medicare,Self-Pay,,,Y,251235.43,60264.27
New York City,Manhattan,7002024,001456,Mount Sinai Hospital,70 or Older,100,F,Other Race,Spanish/Hispanic,9,Emergency,Home w/ Home Health Services,2020,DIG019,OTHER SPECIFIED AND UNSPECIFIED LIVER DISEASE,GIS006,PARACENTESIS,283,OTHER DISORDERS OF THE LIVER,07,DISEASES AND DISORDERS OF THE HEPATOBILIARY SYSTEM AND PANCREAS,3,Major,Major,Medical,Medicare,Medicaid,Self-Pay,,,Y,119201.12,31399.28
New York City,Manhattan,7002024,001456,Mount Sinai Hospital,18 to 29,107,F,Other Race,Spanish/Hispanic,2,Urgent,Home or Self Care,2020,DIG023,NONINFECTIOUS HEPATITIS,IMG009,PLAIN RADIOGRAPHY,283,OTHER DISORDERS OF THE LIVER,07,DISEASES AND DISORDERS OF THE HEPATOBILIARY SYSTEM AND PANCREAS,4,Extreme,Major,Medical,Medicaid,Medicaid,Self-Pay,,,N,24603.99,6122.61
New York City,Bronx,7000006,001169,Montefiore Medical Center - Henry & Lucy Moses Div,50 to 69,104,M,Other Race,Spanish/Hispanic,3,Emergency,Home or Self Care,2020,DIG019,OTHER SPECIFIED AND UNSPECIFIED LIVER DISEASE,GIS004,GI SYSTEM ENDOSCOPY WITHOUT BIOPSY (DIAGNOSTIC),283,OTHER DISORDERS OF THE LIVER,07,DISEASES AND DISORDERS OF THE HEPATOBILIARY SYSTEM AND PANCREAS,3,Major,Major,Medical,Medicare,Medicaid,,,,Y,107540.18,22005.6
New York City,Manhattan,7002054,003975,New York Presbyterian Hospital - Allen Hospital,18 to 29,104,F,White,Not Span/Hispanic,2,Emergency,Home or Self Care,2020,INF007,HEPATITIS,IMG008,ULTRASONOGRAPHY,283,OTHER DISORDERS OF THE LIVER,07,DISEASES AND DISORDERS OF THE HEPATOBILIARY SYSTEM AND PANCREAS,2,Moderate,Major,Medical,Blue Cross/Blue Shield,Self-Pay,,,,Y,30255.15,6330.89
New York City,Manhattan,7002054,003975,New York Presbyterian Hospital - Allen Hospital,70 or Older,100,F,Other Race,Multi-ethnic,7,Emergency,Home w/ Home Health Services,2020,DIG019,OTHER SPECIFIED AND UNSPECIFIED LIVER DISEASE,HEP001,LIVER BIOPSY,283,OTHER DISORDERS OF THE LIVER,07,DISEASES AND DISORDERS OF THE HEPATOBILIARY SYSTEM AND PANCREAS,2,Moderate,Minor,Medical,Medicaid,Medicaid,Self-Pay,,,Y,90861.94,18715.3
New York City,Manhattan,7002054,003975,New York Presbyterian Hospital - Allen Hospital,30 to 49,,M,Black/African American,Not Span/Hispanic,2,Emergency,Home or Self Care,2020,INF007,HEPATITIS,,,283,OTHER DISORDERS OF THE LIVER,07,DISEASES AND DISORDERS OF THE HEPATOBILIARY SYSTEM AND PANCREAS,2,Moderate,Minor,Medical,Medicaid,Medicaid,Self-Pay,,,Y,30870.71,6464.84
New York City,Manhattan,7002054,001464,New York-Presbyterian Hospital - Columbia Presbyterian Center,50 to 69,100,F,Other Race,Spanish/Hispanic,3,Emergency,Home w/ Home Health Services,2020,DIG019,OTHER SPECIFIED AND UNSPECIFIED LIVER DISEASE,GIS006,PARACENTESIS,283,OTHER DISORDERS OF THE LIVER,07,DISEASES AND DISORDERS OF THE HEPATOBILIARY SYSTEM AND PANCREAS,3,Major,Major,Medical,Medicare,Medicare,Medicaid,,,Y,40470.76,8928.4
New York City,Manhattan,7002054,001464,New York-Presbyterian Hospital - Columbia Presbyterian Center,0 to 17,100,M,Multi-racial,Multi-ethnic,1,Emergency,Home or Self Care,2020,PNL007,HEMOLYTIC JAUNDICE AND PERINATAL JAUNDICE,,,283,OTHER DISORDERS OF THE LIVER,07,DISEASES AND DISORDERS OF THE HEPATOBILIARY SYSTEM AND PANCREAS,2,Moderate,Minor,Medical,Medicaid,Medicaid,Self-Pay,03000,,Y,17574.49,3992.51
New York City,Manhattan,7002054,001464,New York-Presbyterian Hospital - Columbia Presbyterian Center,50 to 69,,M,White,Spanish/Hispanic,1,Emergency,Left Against Medical Advice,2020,DIG019,OTHER SPECIFIED AND UNSPECIFIED LIVER DISEASE,,,283,OTHER DISORDERS OF THE LIVER,07,DISEASES AND DISORDERS OF THE HEPATOBILIARY SYSTEM AND PANCREAS,2,Moderate,Minor,Medical,Medicare,Self-Pay,,,,Y,21635.35,4510.85
New York City,Manhattan,7002054,001464,New York-Presbyterian Hospital - Columbia Presbyterian Center,70 or Older,104,F,Other Race,Not Span/Hispanic,5,Emergency,Skilled Nursing Home,2020,DIG019,OTHER SPECIFIED AND UNSPECIFIED LIVER DISEASE,GIS006,PARACENTESIS,283,OTHER DISORDERS OF THE LIVER,07,DISEASES AND DISORDERS OF THE HEPATOBILIARY SYSTEM AND PANCREAS,3,Major,Major,Medical,Medicare,Medicaid,Self-Pay,,,Y,76465.91,16755.66
New York City,Manhattan,7002054,001464,New York-Presbyterian Hospital - Columbia Presbyterian Center,70 or Older,100,M,Other Race,Spanish/Hispanic,6,Emergency,Home w/ Home Health Services,2020,DIG019,OTHER SPECIFIED AND UNSPECIFIED LIVER DISEASE,GIS006,PARACENTESIS,283,OTHER DISORDERS OF THE LIVER,07,DISEASES AND DISORDERS OF THE HEPATOBILIARY SYSTEM AND PANCREAS,2,Moderate,Major,Medical,Medicare,Medicaid,Self-Pay,,,Y,85854.21,19883.57
New York City,Manhattan,7002054,001464,New York-Presbyterian Hospital - Columbia Presbyterian Center,0 to 17,104,F,Multi-racial,Spanish/Hispanic,3,Emergency,Home or Self Care,2020,INF007,HEPATITIS,HEP001,LIVER BIOPSY,283,OTHER DISORDERS OF THE LIVER,07,DISEASES AND DISORDERS OF THE HEPATOBILIARY SYSTEM AND PANCREAS,1,Minor,Minor,Medical,Medicaid,Medicaid,Self-Pay,,,Y,59561.14,12559.58
New York City,Manhattan,7002054,001464,New York-Presbyterian Hospital - Columbia Presbyterian Center,70 or Older,104,F,White,Not Span/Hispanic,3,Emergency,Home w/ Home Health Services,2020,SYM006,ABDOMINAL PAIN AND OTHER DIGESTIVE/ABDOMEN SIGNS AND SYMPTOMS,GIS006,PARACENTESIS,283,OTHER DISORDERS OF THE LIVER,07,DISEASES AND DISORDERS OF THE HEPATOBILIARY SYSTEM AND PANCREAS,3,Major,Major,Medical,Medicare,Self-Pay,,,,Y,63616.68,13941.71
New York City,Manhattan,7002054,001464,New York-Presbyterian Hospital - Columbia Presbyterian Center,70 or Older,OOS,M,Other Race,Spanish/Hispanic,73,Urgent,Skilled Nursing Home,2020,DIG023,NONINFECTIOUS HEPATITIS,GIS006,PARACENTESIS,283,OTHER DISORDERS OF THE LIVER,07,DISEASES AND DISORDERS OF THE HEPATOBILIARY SYSTEM AND PANCREAS,4,Extreme,Extreme,Medical,Medicare,Blue Cross/Blue Shield,Self-Pay,,,N,923532.45,209618.97
New York City,Manhattan,7002024,001456,Mount Sinai Hospital,70 or Older,114,F,Multi-racial,Not Span/Hispanic,25,Urgent,Home w/ Home Health Services,2020,DIG019,OTHER SPECIFIED AND UNSPECIFIED LIVER DISEASE,HEP001,LIVER BIOPSY,283,OTHER DISORDERS OF THE LIVER,07,DISEASES AND DISORDERS OF THE HEPATOBILIARY SYSTEM AND PANCREAS,3,Major,Major,Medical,Medicaid,Medicaid,Self-Pay,,,N,564195.07,134383.17
New York City,Manhattan,7002024,001456,Mount Sinai Hospital,30 to 49,100,M,Other Race,Spanish/Hispanic,2,Elective,Home or Self Care,2020,DIG019,OTHER SPECIFIED AND UNSPECIFIED LIVER DISEASE,GIS006,PARACENTESIS,283,OTHER DISORDERS OF THE LIVER,07,DISEASES AND DISORDERS OF THE HEPATOBILIARY SYSTEM AND PANCREAS,3,Major,Major,Medical,Medicaid,Medicaid,Self-Pay,,,N,34010.65,9100.37
New York City,Manhattan,7002024,001456,Mount Sinai Hospital,30 to 49,112,F,Black/African American,Not Span/Hispanic,2,Urgent,Home w/ Home Health Services,2020,SYM017,ABNORMAL FINDINGS WITHOUT DIAGNOSIS,IMG008,ULTRASONOGRAPHY,283,OTHER DISORDERS OF THE LIVER,07,DISEASES AND DISORDERS OF THE HEPATOBILIARY SYSTEM AND PANCREAS,3,Major,Moderate,Medical,Medicaid,Medicaid,Self-Pay,,,N,25566.14,6495.67
New York City,Queens,7003010,001637,New York - Presbyterian/Queens,30 to 49,115,F,Other Race,Not Span/Hispanic,3,Emergency,Home or Self Care,2020,INF007,HEPATITIS,ADM021,"ADMINISTRATION OF THERAPEUTIC SUBSTANCES, NEC",283,OTHER DISORDERS OF THE LIVER,07,DISEASES AND DISORDERS OF THE HEPATOBILIARY SYSTEM AND PANCREAS,2,Moderate,Minor,Medical,"Managed Care, Unspecified",Medicaid,Self-Pay,,,Y,31083.37,6667.7
New York City,Queens,7003010,001637,New York - Presbyterian/Queens,70 or Older,113,M,Other Race,Not Span/Hispanic,11,Emergency,Skilled Nursing Home,2020,DIG019,OTHER SPECIFIED AND UNSPECIFIED LIVER DISEASE,GNR004,ENDOSCOPIC CONTROL OF BLEEDING,283,OTHER DISORDERS OF THE LIVER,07,DISEASES AND DISORDERS OF THE HEPATOBILIARY SYSTEM AND PANCREAS,4,Extreme,Extreme,Medical,Medicare,Medicaid,Self-Pay,,,Y,102665.71,25624.22
New York City,Queens,7003010,001637,New York - Presbyterian/Queens,50 to 69,104,F,Other Race,Not Span/Hispanic,1,Emergency,Home or Self Care,2020,SYM006,ABDOMINAL PAIN AND OTHER DIGESTIVE/ABDOMEN SIGNS AND SYMPTOMS,GIS006,PARACENTESIS,283,OTHER DISORDERS OF THE LIVER,07,DISEASES AND DISORDERS OF THE HEPATOBILIARY SYSTEM AND PANCREAS,2,Moderate,Minor,Medical,"Managed Care, Unspecified",Medicaid,Self-Pay,,,Y,15897.06,2969.59
New York City,Queens,7003010,001637,New York - Presbyterian/Queens,70 or Older,113,M,White,Not Span/Hispanic,5,Emergency,Home or Self Care,2020,DIG019,OTHER SPECIFIED AND UNSPECIFIED LIVER DISEASE,GIS027,"UPPER GI THERAPEUTIC PROCEDURES, NEC (ENDOSCOPIC)",283,OTHER DISORDERS OF THE LIVER,07,DISEASES AND DISORDERS OF THE HEPATOBILIARY SYSTEM AND PANCREAS,3,Major,Major,Medical,Medicare,Medicare,Self-Pay,,,Y,48084.78,12341.43
New York City,Queens,7003010,001637,New York - Presbyterian/Queens,70 or Older,,F,Other Race,Spanish/Hispanic,25,Emergency,Expired,2020,DIG023,NONINFECTIOUS HEPATITIS,GIS027,"UPPER GI THERAPEUTIC PROCEDURES, NEC (ENDOSCOPIC)",283,OTHER DISORDERS OF THE LIVER,07,DISEASES AND DISORDERS OF THE HEPATOBILIARY SYSTEM AND PANCREAS,4,Extreme,Extreme,Medical,Medicare,Medicare,Self-Pay,,,Y,421177.44,108071.85
New York City,Queens,7003010,001637,New York - Presbyterian/Queens,50 to 69,113,F,Other Race,Not Span/Hispanic,11,Emergency,Skilled Nursing Home,2020,SYM006,ABDOMINAL PAIN AND OTHER DIGESTIVE/ABDOMEN SIGNS AND SYMPTOMS,GIS006,PARACENTESIS,283,OTHER DISORDERS OF THE LIVER,07,DISEASES AND DISORDERS OF THE HEPATOBILIARY SYSTEM AND PANCREAS,2,Moderate,Moderate,Medical,Medicare,Medicare,Medicaid,,,Y,88986.36,21605.78
New York City,Kings,7001037,001320,University Hospital of Brooklyn,50 to 69,112,M,Black/African American,Not Span/Hispanic,1,Emergency,Expired,2020,DIG019,OTHER SPECIFIED AND UNSPECIFIED LIVER DISEASE,GIS027,"UPPER GI THERAPEUTIC PROCEDURES, NEC (ENDOSCOPIC)",283,OTHER DISORDERS OF THE LIVER,07,DISEASES AND DISORDERS OF THE HEPATOBILIARY SYSTEM AND PANCREAS,3,Major,Extreme,Medical,Self-Pay,Self-Pay,,,,Y,57272,22510.73
New York City,Kings,7001037,001320,University Hospital of Brooklyn,18 to 29,114,F,Black/African American,Not Span/Hispanic,2,Emergency,Home or Self Care,2020,DIG023,NONINFECTIOUS HEPATITIS,,,283,OTHER DISORDERS OF THE LIVER,07,DISEASES AND DISORDERS OF THE HEPATOBILIARY SYSTEM AND PANCREAS,1,Minor,Minor,Medical,Medicaid,Medicaid,Self-Pay,,,Y,9515,20940.82
New York City,Manhattan,7002054,001458,New York-Presbyterian Hospital - New York Weill Cornell Center,18 to 29,116,M,Black/African American,Not Span/Hispanic,2,Emergency,Home or Self Care,2020,INF007,HEPATITIS,ADM010,VACCINATIONS,283,OTHER DISORDERS OF THE LIVER,07,DISEASES AND DISORDERS OF THE HEPATOBILIARY SYSTEM AND PANCREAS,1,Minor,Minor,Medical,Medicaid,Self-Pay,,,,N,40644.54,17779.87
New York City,Manhattan,7002054,001458,New York-Presbyterian Hospital - New York Weill Cornell Center,70 or Older,101,M,White,Not Span/Hispanic,24,Emergency,Hospice - Home,2020,DIG019,OTHER SPECIFIED AND UNSPECIFIED LIVER DISEASE,HEP001,LIVER BIOPSY,283,OTHER DISORDERS OF THE LIVER,07,DISEASES AND DISORDERS OF THE HEPATOBILIARY SYSTEM AND PANCREAS,2,Moderate,Minor,Medical,Medicare,Private Health Insurance,Self-Pay,,,Y,316146.77,70173.01
New York City,Manhattan,7002054,001458,New York-Presbyterian Hospital - New York Weill Cornell Center,50 to 69,113,F,White,Not Span/Hispanic,3,Emergency,Home w/ Home Health Services,2020,DIG019,OTHER SPECIFIED AND UNSPECIFIED LIVER DISEASE,GIS006,PARACENTESIS,283,OTHER DISORDERS OF THE LIVER,07,DISEASES AND DISORDERS OF THE HEPATOBILIARY SYSTEM AND PANCREAS,3,Major,Major,Medical,Medicare,Medicare,Medicaid,,,Y,61138.4,13580.35
New York City,Manhattan,7002054,001458,New York-Presbyterian Hospital - New York Weill Cornell Center,50 to 69,113,F,White,Not Span/Hispanic,4,Emergency,Home or Self Care,2020,DIG019,OTHER SPECIFIED AND UNSPECIFIED LIVER DISEASE,GIS006,PARACENTESIS,283,OTHER DISORDERS OF THE LIVER,07,DISEASES AND DISORDERS OF THE HEPATOBILIARY SYSTEM AND PANCREAS,3,Major,Moderate,Medical,Medicare,Medicare,Medicaid,,,Y,65111.82,14962.41
New York City,Manhattan,7002054,001458,New York-Presbyterian Hospital - New York Weill Cornell Center,50 to 69,104,M,Black/African American,Spanish/Hispanic,4,Emergency,Home or Self Care,2020,SYM006,ABDOMINAL PAIN AND OTHER DIGESTIVE/ABDOMEN SIGNS AND SYMPTOMS,GIS006,PARACENTESIS,283,OTHER DISORDERS OF THE LIVER,07,DISEASES AND DISORDERS OF THE HEPATOBILIARY SYSTEM AND PANCREAS,3,Major,Major,Medical,Private Health Insurance,Medicare,Self-Pay,,,Y,73536.07,35454.54
New York City,Manhattan,7002054,001458,New York-Presbyterian Hospital - New York Weill Cornell Center,50 to 69,103,M,Multi-racial,Not Span/Hispanic,5,Emergency,Home or Self Care,2020,DIG019,OTHER SPECIFIED AND UNSPECIFIED LIVER DISEASE,GIS006,PARACENTESIS,283,OTHER DISORDERS OF THE LIVER,07,DISEASES AND DISORDERS OF THE HEPATOBILIARY SYSTEM AND PANCREAS,3,Major,Major,Medical,"Managed Care, Unspecified",Medicaid,Self-Pay,,,Y,76284.68,17117.47
New York City,Kings,7001021,001306,New York - Presbyterian Brooklyn Methodist Hospital,70 or Older,112,M,White,Spanish/Hispanic,2,Emergency,Home or Self Care,2020,DIG019,OTHER SPECIFIED AND UNSPECIFIED LIVER DISEASE,,,283,OTHER DISORDERS OF THE LIVER,07,DISEASES AND DISORDERS OF THE HEPATOBILIARY SYSTEM AND PANCREAS,2,Moderate,Moderate,Medical,Medicare,Medicare,Self-Pay,,,Y,28717.72,6121.77
New York City,Manhattan,7002054,001458,New York-Presbyterian Hospital - New York Weill Cornell Center,30 to 49,101,M,Other Race,Spanish/Hispanic,1,Emergency,Left Against Medical Advice,2020,SYM006,ABDOMINAL PAIN AND OTHER DIGESTIVE/ABDOMEN SIGNS AND SYMPTOMS,,,283,OTHER DISORDERS OF THE LIVER,07,DISEASES AND DISORDERS OF THE HEPATOBILIARY SYSTEM AND PANCREAS,2,Moderate,Minor,Medical,Medicare,Medicare,Medicaid,,,Y,30876.91,5971.82
New York City,Kings,7001021,001306,New York - Presbyterian Brooklyn Methodist Hospital,50 to 69,116,M,Multi-racial,Spanish/Hispanic,30,Emergency,Skilled Nursing Home,2020,DIG019,OTHER SPECIFIED AND UNSPECIFIED LIVER DISEASE,GIS006,PARACENTESIS,283,OTHER DISORDERS OF THE LIVER,07,DISEASES AND DISORDERS OF THE HEPATOBILIARY SYSTEM AND PANCREAS,4,Extreme,Extreme,Medical,Medicaid,Self-Pay,,,,Y,199878.23,50227.67
New York City,Manhattan,7002054,001458,New York-Presbyterian Hospital - New York Weill Cornell Center,50 to 69,112,F,Other Race,Not Span/Hispanic,4,Emergency,Home or Self Care,2020,DIG019,OTHER SPECIFIED AND UNSPECIFIED LIVER DISEASE,GIS006,PARACENTESIS,283,OTHER DISORDERS OF THE LIVER,07,DISEASES AND DISORDERS OF THE HEPATOBILIARY SYSTEM AND PANCREAS,3,Major,Moderate,Medical,"Managed Care, Unspecified",Medicaid,Self-Pay,,,Y,64309.41,14184.37
New York City,Manhattan,7002054,001458,New York-Presbyterian Hospital - New York Weill Cornell Center,70 or Older,104,F,Multi-racial,Spanish/Hispanic,2,Emergency,Home or Self Care,2020,DIG019,OTHER SPECIFIED AND UNSPECIFIED LIVER DISEASE,RES005,CHEST TUBE PLACEMENT AND THERAPEUTIC THORACENTESIS,283,OTHER DISORDERS OF THE LIVER,07,DISEASES AND DISORDERS OF THE HEPATOBILIARY SYSTEM AND PANCREAS,3,Major,Moderate,Medical,Medicare,Medicare,Medicaid,,,Y,56980.79,13722.95
New York City,Kings,7001021,001306,New York - Presbyterian Brooklyn Methodist Hospital,70 or Older,112,F,Black/African American,Not Span/Hispanic,2,Emergency,Home w/ Home Health Services,2020,DIG019,OTHER SPECIFIED AND UNSPECIFIED LIVER DISEASE,GIS006,PARACENTESIS,283,OTHER DISORDERS OF THE LIVER,07,DISEASES AND DISORDERS OF THE HEPATOBILIARY SYSTEM AND PANCREAS,2,Moderate,Major,Medical,Medicare,Medicaid,Self-Pay,,,Y,17161.25,3791.2
New York City,Manhattan,7002054,001458,New York-Presbyterian Hospital - New York Weill Cornell Center,30 to 49,100,M,Multi-racial,Not Span/Hispanic,4,Emergency,Left Against Medical Advice,2020,DIG019,OTHER SPECIFIED AND UNSPECIFIED LIVER DISEASE,GIS006,PARACENTESIS,283,OTHER DISORDERS OF THE LIVER,07,DISEASES AND DISORDERS OF THE HEPATOBILIARY SYSTEM AND PANCREAS,4,Extreme,Major,Medical,Medicaid,Self-Pay,,,,Y,46225.44,10049.73
New York City,Kings,7001021,001306,New York - Presbyterian Brooklyn Methodist Hospital,50 to 69,112,F,White,Not Span/Hispanic,4,Emergency,Skilled Nursing Home,2020,DIG023,NONINFECTIOUS HEPATITIS,GIS006,PARACENTESIS,283,OTHER DISORDERS OF THE LIVER,07,DISEASES AND DISORDERS OF THE HEPATOBILIARY SYSTEM AND PANCREAS,3,Major,Major,Medical,Medicare,Medicaid,Self-Pay,,,Y,32230.1,7610.39
New York City,Kings,7001021,001306,New York - Presbyterian Brooklyn Methodist Hospital,30 to 49,OOS,M,White,Not Span/Hispanic,10,Emergency,Home or Self Care,2020,NEO073,BENIGN NEOPLASMS,HEP001,LIVER BIOPSY,283,OTHER DISORDERS OF THE LIVER,07,DISEASES AND DISORDERS OF THE HEPATOBILIARY SYSTEM AND PANCREAS,1,Minor,Minor,Medical,Blue Cross/Blue Shield,Self-Pay,,,,Y,83252.8,23308.5
New York City,Manhattan,7002024,001456,Mount Sinai Hospital,30 to 49,100,M,Other Race,Spanish/Hispanic,3,Emergency,Home or Self Care,2020,DIG019,OTHER SPECIFIED AND UNSPECIFIED LIVER DISEASE,GIS006,PARACENTESIS,283,OTHER DISORDERS OF THE LIVER,07,DISEASES AND DISORDERS OF THE HEPATOBILIARY SYSTEM AND PANCREAS,3,Major,Major,Medical,Medicaid,Medicaid,Self-Pay,,,Y,57194.89,14527.85
New York City,Bronx,7000006,001169,Montefiore Medical Center - Henry & Lucy Moses Div,50 to 69,107,F,Black/African American,Not Span/Hispanic,2,Emergency,Home or Self Care,2020,INF007,HEPATITIS,,,283,OTHER DISORDERS OF THE LIVER,07,DISEASES AND DISORDERS OF THE HEPATOBILIARY SYSTEM AND PANCREAS,2,Moderate,Minor,Medical,Private Health Insurance,,,,,N,58661.55,9852.13