Hospital Service Area,Hospital County,Operating Certificate Number,Permanent Facility Id,Facility Name,Age Group,Zip Code - 3 digits,Gender,Race,Ethnicity,Length of Stay,Type of Admission,Patient Disposition,Discharge Year,CCS Diagnosis Code,CCS Diagnosis Description,CCS Procedure Code,CCS Procedure Description,APR DRG Code,APR DRG Description,APR MDC Code,APR MDC Description,APR Severity of Illness Code,APR Severity of Illness Description,APR Risk of Mortality,APR Medical Surgical Description,Payment Typology 1,Payment Typology 2,Payment Typology 3,Birth Weight,Abortion Edit Indicator,Emergency Department Indicator,Total Charges,Total Costs
New York City,Kings,7002053,001304,NYU Langone Hospital-Brooklyn,18 to 29,112,F,Black/African American,Not Span/Hispanic,3,Emergency,Home or Self Care,2020,DIG019,OTHER SPECIFIED AND UNSPECIFIED LIVER DISEASE,SKB001,SKIN BIOPSY AND DIAGNOSTIC DRAINAGE,283,OTHER DISORDERS OF THE LIVER,07,DISEASES AND DISORDERS OF THE HEPATOBILIARY SYSTEM AND PANCREAS,2,Moderate,Moderate,Medical,Private Health Insurance,,,,,Y,51034.99,12571.24
New York City,Kings,7002053,001304,NYU Langone Hospital-Brooklyn,70 or Older,112,M,White,Not Span/Hispanic,2,Emergency,Home w/ Home Health Services,2020,DIG019,OTHER SPECIFIED AND UNSPECIFIED LIVER DISEASE,GIS006,PARACENTESIS,283,OTHER DISORDERS OF THE LIVER,07,DISEASES AND DISORDERS OF THE HEPATOBILIARY SYSTEM AND PANCREAS,2,Moderate,Moderate,Medical,Medicare,Medicaid,,,,Y,46894.98,9796.6
New York City,Kings,7002053,001304,NYU Langone Hospital-Brooklyn,50 to 69,112,F,Other Race,Unknown,3,Emergency,Home or Self Care,2020,DIG019,OTHER SPECIFIED AND UNSPECIFIED LIVER DISEASE,GIS006,PARACENTESIS,283,OTHER DISORDERS OF THE LIVER,07,DISEASES AND DISORDERS OF THE HEPATOBILIARY SYSTEM AND PANCREAS,3,Major,Major,Medical,Blue Cross/Blue Shield,,,,,Y,77993.75,18299.25
New York City,Kings,7002053,001304,NYU Langone Hospital-Brooklyn,70 or Older,112,F,Other Race,Spanish/Hispanic,2,Emergency,Home or Self Care,2020,DIG019,OTHER SPECIFIED AND UNSPECIFIED LIVER DISEASE,PLC002,PACKING AND DRESSING PROCEDURES,283,OTHER DISORDERS OF THE LIVER,07,DISEASES AND DISORDERS OF THE HEPATOBILIARY SYSTEM AND PANCREAS,2,Moderate,Major,Medical,Medicare,Medicare,,,,Y,56580.51,14316.54
New York City,Kings,7002053,001304,NYU Langone Hospital-Brooklyn,50 to 69,112,F,White,Not Span/Hispanic,1,Emergency,Home or Self Care,2020,DIG019,OTHER SPECIFIED AND UNSPECIFIED LIVER DISEASE,GIS004,GI SYSTEM ENDOSCOPY WITHOUT BIOPSY (DIAGNOSTIC),283,OTHER DISORDERS OF THE LIVER,07,DISEASES AND DISORDERS OF THE HEPATOBILIARY SYSTEM AND PANCREAS,2,Moderate,Moderate,Medical,Medicaid,,,,,Y,47137.86,7892.31
New York City,Kings,7002053,001304,NYU Langone Hospital-Brooklyn,70 or Older,112,M,White,Not Span/Hispanic,21,Emergency,Skilled Nursing Home,2020,DIG019,OTHER SPECIFIED AND UNSPECIFIED LIVER DISEASE,ADM021,"ADMINISTRATION OF THERAPEUTIC SUBSTANCES, NEC",283,OTHER DISORDERS OF THE LIVER,07,DISEASES AND DISORDERS OF THE HEPATOBILIARY SYSTEM AND PANCREAS,4,Extreme,Extreme,Medical,Medicare,Medicare,,,,Y,380885.49,99051.04
New York City,Kings,7002053,001304,NYU Langone Hospital-Brooklyn,18 to 29,112,F,Black/African American,Not Span/Hispanic,1,Emergency,Home or Self Care,2020,DIG019,OTHER SPECIFIED AND UNSPECIFIED LIVER DISEASE,,,283,OTHER DISORDERS OF THE LIVER,07,DISEASES AND DISORDERS OF THE HEPATOBILIARY SYSTEM AND PANCREAS,2,Moderate,Minor,Medical,Medicaid,,,,,Y,34948.26,6192.68
New York City,Kings,7002053,001304,NYU Langone Hospital-Brooklyn,30 to 49,112,M,White,Not Span/Hispanic,1,Emergency,Left Against Medical Advice,2020,INF007,HEPATITIS,,,283,OTHER DISORDERS OF THE LIVER,07,DISEASES AND DISORDERS OF THE HEPATOBILIARY SYSTEM AND PANCREAS,1,Minor,Minor,Medical,Blue Cross/Blue Shield,,,,,Y,19966.29,4645.6
New York City,Kings,7002053,001304,NYU Langone Hospital-Brooklyn,70 or Older,112,F,White,Unknown,6,Emergency,Skilled Nursing Home,2020,DIG019,OTHER SPECIFIED AND UNSPECIFIED LIVER DISEASE,GIS006,PARACENTESIS,283,OTHER DISORDERS OF THE LIVER,07,DISEASES AND DISORDERS OF THE HEPATOBILIARY SYSTEM AND PANCREAS,3,Major,Extreme,Medical,Medicare,Blue Cross/Blue Shield,,,,Y,222421.32,31009.28
New York City,Kings,7002053,001304,NYU Langone Hospital-Brooklyn,50 to 69,112,M,Other Race,Unknown,4,Emergency,Home w/ Home Health Services,2020,DIG019,OTHER SPECIFIED AND UNSPECIFIED LIVER DISEASE,GIS027,"UPPER GI THERAPEUTIC PROCEDURES, NEC (ENDOSCOPIC)",283,OTHER DISORDERS OF THE LIVER,07,DISEASES AND DISORDERS OF THE HEPATOBILIARY SYSTEM AND PANCREAS,4,Extreme,Extreme,Medical,Medicaid,,,,,Y,174196.41,36007.34
New York City,Kings,7002053,001304,NYU Langone Hospital-Brooklyn,50 to 69,112,M,Other Race,Spanish/Hispanic,2,Emergency,Left Against Medical Advice,2020,DIG019,OTHER SPECIFIED AND UNSPECIFIED LIVER DISEASE,GIS006,PARACENTESIS,283,OTHER DISORDERS OF THE LIVER,07,DISEASES AND DISORDERS OF THE HEPATOBILIARY SYSTEM AND PANCREAS,3,Major,Major,Medical,Medicaid,,,,,Y,31415.39,8281.75
New York City,Kings,7002053,001304,NYU Langone Hospital-Brooklyn,70 or Older,112,M,White,Not Span/Hispanic,12,Emergency,Home w/ Home Health Services,2020,DIG019,OTHER SPECIFIED AND UNSPECIFIED LIVER DISEASE,ADM021,"ADMINISTRATION OF THERAPEUTIC SUBSTANCES, NEC",283,OTHER DISORDERS OF THE LIVER,07,DISEASES AND DISORDERS OF THE HEPATOBILIARY SYSTEM AND PANCREAS,3,Major,Major,Medical,Medicare,,,,,Y,221671.17,48000.53
New York City,Kings,7002053,001304,NYU Langone Hospital-Brooklyn,30 to 49,112,F,Other Race,Not Span/Hispanic,4,Emergency,Home or Self Care,2020,DIG019,OTHER SPECIFIED AND UNSPECIFIED LIVER DISEASE,ADM021,"ADMINISTRATION OF THERAPEUTIC SUBSTANCES, NEC",283,OTHER DISORDERS OF THE LIVER,07,DISEASES AND DISORDERS OF THE HEPATOBILIARY SYSTEM AND PANCREAS,2,Moderate,Moderate,Medical,Medicare,,,,,Y,115208.46,27164.93
New York City,Kings,7002053,001304,NYU Langone Hospital-Brooklyn,30 to 49,112,M,White,Unknown,2,Emergency,Home or Self Care,2020,INF007,HEPATITIS,,,283,OTHER DISORDERS OF THE LIVER,07,DISEASES AND DISORDERS OF THE HEPATOBILIARY SYSTEM AND PANCREAS,1,Minor,Minor,Medical,Medicaid,,,,,Y,45333.39,11505.38
New York City,Kings,7002053,001304,NYU Langone Hospital-Brooklyn,18 to 29,100,F,White,Not Span/Hispanic,1,Emergency,Home or Self Care,2020,INJ010,"INTERNAL ORGAN INJURY, INITIAL ENCOUNTER",,,283,OTHER DISORDERS OF THE LIVER,07,DISEASES AND DISORDERS OF THE HEPATOBILIARY SYSTEM AND PANCREAS,2,Moderate,Minor,Medical,Miscellaneous/Other,,,,,Y,54322.4,13321.22
New York City,Kings,7002053,001304,NYU Langone Hospital-Brooklyn,30 to 49,112,M,Other Race,Spanish/Hispanic,2,Emergency,Home or Self Care,2020,INF007,HEPATITIS,OTR004,ISOLATION PROCEDURES,283,OTHER DISORDERS OF THE LIVER,07,DISEASES AND DISORDERS OF THE HEPATOBILIARY SYSTEM AND PANCREAS,1,Minor,Minor,Medical,Medicaid,,,,,Y,44775.37,11971.18
New York City,Kings,7002053,001304,NYU Langone Hospital-Brooklyn,50 to 69,112,M,Other Race,Spanish/Hispanic,2,Emergency,Home or Self Care,2020,DIG019,OTHER SPECIFIED AND UNSPECIFIED LIVER DISEASE,GIS006,PARACENTESIS,283,OTHER DISORDERS OF THE LIVER,07,DISEASES AND DISORDERS OF THE HEPATOBILIARY SYSTEM AND PANCREAS,3,Major,Moderate,Medical,Medicaid,,,,,Y,67136.03,14313.62
New York City,Kings,7002053,001304,NYU Langone Hospital-Brooklyn,50 to 69,112,F,White,Spanish/Hispanic,3,Emergency,Home or Self Care,2020,DIG019,OTHER SPECIFIED AND UNSPECIFIED LIVER DISEASE,GIS006,PARACENTESIS,283,OTHER DISORDERS OF THE LIVER,07,DISEASES AND DISORDERS OF THE HEPATOBILIARY SYSTEM AND PANCREAS,3,Major,Moderate,Medical,Private Health Insurance,,,,,Y,78240.44,19420.18
New York City,Kings,7002053,001304,NYU Langone Hospital-Brooklyn,70 or Older,112,F,White,Not Span/Hispanic,3,Emergency,Home or Self Care,2020,DIG019,OTHER SPECIFIED AND UNSPECIFIED LIVER DISEASE,GIS006,PARACENTESIS,283,OTHER DISORDERS OF THE LIVER,07,DISEASES AND DISORDERS OF THE HEPATOBILIARY SYSTEM AND PANCREAS,2,Moderate,Moderate,Medical,Medicare,Medicare,,,,Y,75345.94,17973.24
New York City,Kings,7002053,001304,NYU Langone Hospital-Brooklyn,0 to 17,112,F,Other Race,Not Span/Hispanic,1,Emergency,Home or Self Care,2020,INJ010,"INTERNAL ORGAN INJURY, INITIAL ENCOUNTER",,,283,OTHER DISORDERS OF THE LIVER,07,DISEASES AND DISORDERS OF THE HEPATOBILIARY SYSTEM AND PANCREAS,2,Moderate,Minor,Medical,Medicaid,,,,,Y,43236.02,6414.35
New York City,Kings,7002053,001304,NYU Langone Hospital-Brooklyn,70 or Older,112,F,Other Race,Spanish/Hispanic,1,Emergency,Hospice - Medical Facility,2020,DIG019,OTHER SPECIFIED AND UNSPECIFIED LIVER DISEASE,OTR004,ISOLATION PROCEDURES,283,OTHER DISORDERS OF THE LIVER,07,DISEASES AND DISORDERS OF THE HEPATOBILIARY SYSTEM AND PANCREAS,4,Extreme,Extreme,Medical,Medicare,Private Health Insurance,,,,Y,102219.94,21558.93
New York City,Kings,7002053,001304,NYU Langone Hospital-Brooklyn,30 to 49,112,M,Other Race,Not Span/Hispanic,3,Emergency,Left Against Medical Advice,2020,INF007,HEPATITIS,ADM021,"ADMINISTRATION OF THERAPEUTIC SUBSTANCES, NEC",283,OTHER DISORDERS OF THE LIVER,07,DISEASES AND DISORDERS OF THE HEPATOBILIARY SYSTEM AND PANCREAS,2,Moderate,Minor,Medical,Medicaid,,,,,Y,59516.73,16471
New York City,Kings,7002053,001304,NYU Langone Hospital-Brooklyn,18 to 29,100,M,Other Race,Not Span/Hispanic,1,Emergency,Home or Self Care,2020,INJ010,"INTERNAL ORGAN INJURY, INITIAL ENCOUNTER",,,283,OTHER DISORDERS OF THE LIVER,07,DISEASES AND DISORDERS OF THE HEPATOBILIARY SYSTEM AND PANCREAS,2,Moderate,Minor,Medical,Blue Cross/Blue Shield,,,,,Y,34599.46,7744.88
New York City,Kings,7002053,001304,NYU Langone Hospital-Brooklyn,50 to 69,112,M,Multi-racial,Not Span/Hispanic,5,Emergency,Home or Self Care,2020,DIG019,OTHER SPECIFIED AND UNSPECIFIED LIVER DISEASE,ADM021,"ADMINISTRATION OF THERAPEUTIC SUBSTANCES, NEC",283,OTHER DISORDERS OF THE LIVER,07,DISEASES AND DISORDERS OF THE HEPATOBILIARY SYSTEM AND PANCREAS,3,Major,Extreme,Medical,Medicaid,,,,,Y,117558.59,30245.96
New York City,Kings,7002053,001304,NYU Langone Hospital-Brooklyn,70 or Older,112,M,White,Spanish/Hispanic,4,Emergency,Home w/ Home Health Services,2020,DIG019,OTHER SPECIFIED AND UNSPECIFIED LIVER DISEASE,,,283,OTHER DISORDERS OF THE LIVER,07,DISEASES AND DISORDERS OF THE HEPATOBILIARY SYSTEM AND PANCREAS,2,Moderate,Major,Medical,Medicare,Medicaid,,,,Y,74081.95,21452.01
New York City,Kings,7002053,001304,NYU Langone Hospital-Brooklyn,30 to 49,112,F,Other Race,Spanish/Hispanic,4,Emergency,Home or Self Care,2020,DIG023,NONINFECTIOUS HEPATITIS,HEP001,LIVER BIOPSY,283,OTHER DISORDERS OF THE LIVER,07,DISEASES AND DISORDERS OF THE HEPATOBILIARY SYSTEM AND PANCREAS,2,Moderate,Moderate,Medical,Medicaid,,,,,Y,104190.54,24712.58
New York City,Kings,7002053,001304,NYU Langone Hospital-Brooklyn,30 to 49,112,F,Other Race,Spanish/Hispanic,3,Emergency,Home or Self Care,2020,SYM006,ABDOMINAL PAIN AND OTHER DIGESTIVE/ABDOMEN SIGNS AND SYMPTOMS,HEP003,DIAGNOSTIC ERCP WITH OR WITHOUT BIOPSY,283,OTHER DISORDERS OF THE LIVER,07,DISEASES AND DISORDERS OF THE HEPATOBILIARY SYSTEM AND PANCREAS,1,Minor,Minor,Medical,Medicaid,,,,,Y,92280.87,19792.72
New York City,Kings,7002053,001304,NYU Langone Hospital-Brooklyn,50 to 69,112,F,White,Not Span/Hispanic,4,Emergency,Home or Self Care,2020,DIG019,OTHER SPECIFIED AND UNSPECIFIED LIVER DISEASE,ADM021,"ADMINISTRATION OF THERAPEUTIC SUBSTANCES, NEC",283,OTHER DISORDERS OF THE LIVER,07,DISEASES AND DISORDERS OF THE HEPATOBILIARY SYSTEM AND PANCREAS,2,Moderate,Minor,Medical,Medicaid,,,,,Y,80538.78,21915.05
New York City,Kings,7002053,001304,NYU Langone Hospital-Brooklyn,50 to 69,112,F,White,Spanish/Hispanic,4,Emergency,Home or Self Care,2020,DIG019,OTHER SPECIFIED AND UNSPECIFIED LIVER DISEASE,GIS006,PARACENTESIS,283,OTHER DISORDERS OF THE LIVER,07,DISEASES AND DISORDERS OF THE HEPATOBILIARY SYSTEM AND PANCREAS,2,Moderate,Moderate,Medical,Medicaid,,,,,Y,76481.23,22513.76
New York City,Kings,7002053,001304,NYU Langone Hospital-Brooklyn,70 or Older,112,M,White,Not Span/Hispanic,11,Emergency,Home w/ Home Health Services,2020,INF007,HEPATITIS,ADM021,"ADMINISTRATION OF THERAPEUTIC SUBSTANCES, NEC",283,OTHER DISORDERS OF THE LIVER,07,DISEASES AND DISORDERS OF THE HEPATOBILIARY SYSTEM AND PANCREAS,2,Moderate,Moderate,Medical,Medicare,Medicaid,,,,Y,159595.39,54180.32
New York City,Kings,7002053,001304,NYU Langone Hospital-Brooklyn,50 to 69,112,F,Other Race,Not Span/Hispanic,2,Emergency,Home or Self Care,2020,END016,OTHER SPECIFIED AND UNSPECIFIED NUTRITIONAL AND METABOLIC DISORDERS,OTR004,ISOLATION PROCEDURES,283,OTHER DISORDERS OF THE LIVER,07,DISEASES AND DISORDERS OF THE HEPATOBILIARY SYSTEM AND PANCREAS,2,Moderate,Minor,Medical,Medicaid,,,,,Y,63767.62,13304.98
New York City,Kings,7002053,001304,NYU Langone Hospital-Brooklyn,70 or Older,112,M,Other Race,Not Span/Hispanic,4,Emergency,Home or Self Care,2020,DIG019,OTHER SPECIFIED AND UNSPECIFIED LIVER DISEASE,GIS004,GI SYSTEM ENDOSCOPY WITHOUT BIOPSY (DIAGNOSTIC),283,OTHER DISORDERS OF THE LIVER,07,DISEASES AND DISORDERS OF THE HEPATOBILIARY SYSTEM AND PANCREAS,3,Major,Major,Medical,Medicare,,,,,Y,98138.18,24878.32
New York City,Kings,7002053,001304,NYU Langone Hospital-Brooklyn,50 to 69,103,M,Other Race,Spanish/Hispanic,3,Emergency,Home or Self Care,2020,DIG019,OTHER SPECIFIED AND UNSPECIFIED LIVER DISEASE,,,283,OTHER DISORDERS OF THE LIVER,07,DISEASES AND DISORDERS OF THE HEPATOBILIARY SYSTEM AND PANCREAS,1,Minor,Minor,Medical,Private Health Insurance,,,,,Y,73016.18,18655.81
New York City,Kings,7002053,001304,NYU Langone Hospital-Brooklyn,50 to 69,112,F,Black/African American,Not Span/Hispanic,3,Emergency,Home or Self Care,2020,DIG019,OTHER SPECIFIED AND UNSPECIFIED LIVER DISEASE,GIS006,PARACENTESIS,283,OTHER DISORDERS OF THE LIVER,07,DISEASES AND DISORDERS OF THE HEPATOBILIARY SYSTEM AND PANCREAS,3,Major,Major,Medical,Medicare,Medicaid,,,,Y,73689.31,18193.28
New York City,Kings,7002053,001304,NYU Langone Hospital-Brooklyn,50 to 69,112,M,Multi-racial,Not Span/Hispanic,4,Emergency,Psychiatric Hospital or Unit of Hosp,2020,DIG019,OTHER SPECIFIED AND UNSPECIFIED LIVER DISEASE,GIS006,PARACENTESIS,283,OTHER DISORDERS OF THE LIVER,07,DISEASES AND DISORDERS OF THE HEPATOBILIARY SYSTEM AND PANCREAS,3,Major,Major,Medical,Medicaid,,,,,Y,128011.85,25782.67
New York City,Kings,7002053,001304,NYU Langone Hospital-Brooklyn,30 to 49,112,F,Other Race,Spanish/Hispanic,2,Emergency,Home or Self Care,2020,NEO073,BENIGN NEOPLASMS,IMG005,MAGNETIC RESONANCE IMAGING (MRI),283,OTHER DISORDERS OF THE LIVER,07,DISEASES AND DISORDERS OF THE HEPATOBILIARY SYSTEM AND PANCREAS,2,Moderate,Minor,Medical,Medicaid,,,,,Y,50116.07,12243.2
