Hospital Service Area,Hospital County,Operating Certificate Number,Permanent Facility Id,Facility Name,Age Group,Zip Code - 3 digits,Gender,Race,Ethnicity,Length of Stay,Type of Admission,Patient Disposition,Discharge Year,CCS Diagnosis Code,CCS Diagnosis Description,CCS Procedure Code,CCS Procedure Description,APR DRG Code,APR DRG Description,APR MDC Code,APR MDC Description,APR Severity of Illness Code,APR Severity of Illness Description,APR Risk of Mortality,APR Medical Surgical Description,Payment Typology 1,Payment Typology 2,Payment Typology 3,Birth Weight,Abortion Edit Indicator,Emergency Department Indicator,Total Charges,Total Costs
New York City,Manhattan,7002054,001458,New York-Presbyterian Hospital - New York Weill Cornell Center,70 or Older,100,M,White,Not Span/Hispanic,4,Emergency,Home or Self Care,2018,DIG017,BILIARY TRACT DISEASE,ADM015,ADMINISTRATION OF ANTIBIOTICS,284,DISORDERS OF GALLBLADDER & BILIARY TRACT,07,DISEASES AND DISORDERS OF THE HEPATOBILIARY SYSTEM AND PANCREAS,3,Major,Major,Medical,Medicare,Private Health Insurance,Self-Pay,,,true,54228.39,12025.97
Hudson Valley,Westchester,5920000,001117,Northern Westchester Hospital,70 or Older,105,M,White,Not Span/Hispanic,1,Emergency,Home w/ Home Health Services,2018,DIG017,BILIARY TRACT DISEASE,,,284,DISORDERS OF GALLBLADDER & BILIARY TRACT,07,DISEASES AND DISORDERS OF THE HEPATOBILIARY SYSTEM AND PANCREAS,2,Moderate,Moderate,Medical,Medicare,Self-Pay,,,,true,19314.48,6413.71
New York City,Manhattan,7002054,001458,New York-Presbyterian Hospital - New York Weill Cornell Center,70 or Older,100,M,White,Not Span/Hispanic,3,Emergency,Home w/ Home Health Services,2018,DIG017,BILIARY TRACT DISEASE,GIS004,GI SYSTEM ENDOSCOPY WITHOUT BIOPSY (DIAGNOSTIC),284,DISORDERS OF GALLBLADDER & BILIARY TRACT,07,DISEASES AND DISORDERS OF THE HEPATOBILIARY SYSTEM AND PANCREAS,3,Major,Moderate,Medical,Medicare,Medicaid,Self-Pay,,,true,63430.64,17715.02
Long Island,Nassau,7003004,000518,Long Island Jewish Valley Stream,50 to 69,116,F,Black/African American,Not Span/Hispanic,3,Emergency,Inpatient Rehabilitation Facility,2018,DIG017,BILIARY TRACT DISEASE,,,284,DISORDERS OF GALLBLADDER & BILIARY TRACT,07,DISEASES AND DISORDERS OF THE HEPATOBILIARY SYSTEM AND PANCREAS,2,Moderate,Minor,Medical,Medicaid,,,,,true,53868.04,9294.5
New York City,Bronx,7000001,001178,BronxCare Hospital Center,50 to 69,112,M,Other Race,Spanish/Hispanic,3,Emergency,Home or Self Care,2018,DIG017,BILIARY TRACT DISEASE,ESA001,HEMODIALYSIS,284,DISORDERS OF GALLBLADDER & BILIARY TRACT,07,DISEASES AND DISORDERS OF THE HEPATOBILIARY SYSTEM AND PANCREAS,3,Major,Moderate,Medical,Medicaid,Medicaid,,,,true,12117.27,13844.41
New York City,Manhattan,7002054,001464,New York-Presbyterian Hospital - Columbia Presbyterian Center,50 to 69,100,M,Black/African American,Spanish/Hispanic,2,Emergency,Home w/ Home Health Services,2018,DIG017,BILIARY TRACT DISEASE,IMG005,MAGNETIC RESONANCE IMAGING (MRI),284,DISORDERS OF GALLBLADDER & BILIARY TRACT,07,DISEASES AND DISORDERS OF THE HEPATOBILIARY SYSTEM AND PANCREAS,2,Moderate,Moderate,Medical,Blue Cross/Blue Shield,Self-Pay,,,,false,23744.71,5061.27
New York City,Manhattan,7002001,001438,Bellevue Hospital Center,70 or Older,100,M,Black/African American,Not Span/Hispanic,6,Emergency,Left Against Medical Advice,2018,DIG017,BILIARY TRACT DISEASE,HEP007,BILIARY AND PANCREATIC CALCULUS REMOVAL,284,DISORDERS OF GALLBLADDER & BILIARY TRACT,07,DISEASES AND DISORDERS OF THE HEPATOBILIARY SYSTEM AND PANCREAS,2,Moderate,Moderate,Medical,Medicare,Medicare,,,,true,41862.7,27821.95
Western NY,Erie,1401014,003067,Millard Fillmore Suburban Hospital,70 or Older,141,F,White,Not Span/Hispanic,7,Emergency,Skilled Nursing Home,2018,DIG017,BILIARY TRACT DISEASE,HEP010,HEPATOBILIARY AND PANCREATIC DRAINAGE,284,DISORDERS OF GALLBLADDER & BILIARY TRACT,07,DISEASES AND DISORDERS OF THE HEPATOBILIARY SYSTEM AND PANCREAS,3,Major,Moderate,Medical,Medicare,Private Health Insurance,Self-Pay,,,true,26770.36,11341.31
New York City,Bronx,7000008,001172,Lincoln Medical & Mental Health Center,50 to 69,104,M,Other Race,Spanish/Hispanic,5,Emergency,Home or Self Care,2018,DIG017,BILIARY TRACT DISEASE,HEP010,HEPATOBILIARY AND PANCREATIC DRAINAGE,284,DISORDERS OF GALLBLADDER & BILIARY TRACT,07,DISEASES AND DISORDERS OF THE HEPATOBILIARY SYSTEM AND PANCREAS,2,Moderate,Minor,Medical,Medicaid,,,,,false,28861.55,17044.39
Finger Lakes,Monroe,2701003,000411,Rochester General Hospital,30 to 49,146,F,White,Not Span/Hispanic,5,Emergency,Home or Self Care,2018,DIG017,BILIARY TRACT DISEASE,HEP007,BILIARY AND PANCREATIC CALCULUS REMOVAL,284,DISORDERS OF GALLBLADDER & BILIARY TRACT,07,DISEASES AND DISORDERS OF THE HEPATOBILIARY SYSTEM AND PANCREAS,1,Minor,Minor,Medical,Medicaid,,,,,true,24584.31,10832.32
Finger Lakes,Monroe,2701003,000411,Rochester General Hospital,50 to 69,146,F,Black/African American,Not Span/Hispanic,2,Emergency,Left Against Medical Advice,2018,DIG017,BILIARY TRACT DISEASE,,,284,DISORDERS OF GALLBLADDER & BILIARY TRACT,07,DISEASES AND DISORDERS OF THE HEPATOBILIARY SYSTEM AND PANCREAS,2,Moderate,Minor,Medical,Medicaid,,,,,true,7936.91,3290.99
New York City,Bronx,7000008,001172,Lincoln Medical & Mental Health Center,50 to 69,104,M,Other Race,Spanish/Hispanic,13,Emergency,Home or Self Care,2018,DIG017,BILIARY TRACT DISEASE,HEP003,DIAGNOSTIC ERCP WITH OR WITHOUT BIOPSY,284,DISORDERS OF GALLBLADDER & BILIARY TRACT,07,DISEASES AND DISORDERS OF THE HEPATOBILIARY SYSTEM AND PANCREAS,4,Extreme,Major,Medical,Medicare,Medicare,,,,true,79676.82,47053.7
New York City,Manhattan,7002054,001464,New York-Presbyterian Hospital - Columbia Presbyterian Center,70 or Older,105,M,White,Not Span/Hispanic,12,Emergency,Home w/ Home Health Services,2018,DIG017,BILIARY TRACT DISEASE,HEP010,HEPATOBILIARY AND PANCREATIC DRAINAGE,284,DISORDERS OF GALLBLADDER & BILIARY TRACT,07,DISEASES AND DISORDERS OF THE HEPATOBILIARY SYSTEM AND PANCREAS,4,Extreme,Extreme,Medical,Medicare,Blue Cross/Blue Shield,Self-Pay,,,false,154557.69,35326.49
Finger Lakes,Monroe,2701003,000411,Rochester General Hospital,50 to 69,145,M,White,Not Span/Hispanic,6,Emergency,Home w/ Home Health Services,2018,DIG017,BILIARY TRACT DISEASE,HEP007,BILIARY AND PANCREATIC CALCULUS REMOVAL,284,DISORDERS OF GALLBLADDER & BILIARY TRACT,07,DISEASES AND DISORDERS OF THE HEPATOBILIARY SYSTEM AND PANCREAS,2,Moderate,Minor,Medical,Medicare,,,,,true,37214.29,15123.44
New York City,Manhattan,7002054,001437,New York-Presbyterian/Lower Manhattan Hospital,70 or Older,100,F,Other Race,Not Span/Hispanic,6,Emergency,Home w/ Home Health Services,2018,DIG017,BILIARY TRACT DISEASE,HEP007,BILIARY AND PANCREATIC CALCULUS REMOVAL,284,DISORDERS OF GALLBLADDER & BILIARY TRACT,07,DISEASES AND DISORDERS OF THE HEPATOBILIARY SYSTEM AND PANCREAS,3,Major,Moderate,Medical,Medicare,Medicaid,Self-Pay,,,true,85562.6,21708.31
New York City,Queens,7003004,001630,Long Island Jewish Medical Center,70 or Older,113,F,White,Not Span/Hispanic,8,Emergency,Home w/ Home Health Services,2018,DIG017,BILIARY TRACT DISEASE,HEP007,BILIARY AND PANCREATIC CALCULUS REMOVAL,284,DISORDERS OF GALLBLADDER & BILIARY TRACT,07,DISEASES AND DISORDERS OF THE HEPATOBILIARY SYSTEM AND PANCREAS,2,Moderate,Major,Medical,Medicare,Blue Cross/Blue Shield,Self-Pay,,,false,92663.26,18366.86
Central NY,Onondaga,3301007,000635,University Hospital SUNY Health Science Center,50 to 69,130,F,White,Not Span/Hispanic,3,Emergency,Home or Self Care,2018,DIG017,BILIARY TRACT DISEASE,HEP008,COMMON BILE DUCT SPHINCTEROTOMY AND STENTING,284,DISORDERS OF GALLBLADDER & BILIARY TRACT,07,DISEASES AND DISORDERS OF THE HEPATOBILIARY SYSTEM AND PANCREAS,2,Moderate,Minor,Medical,Private Health Insurance,,,,,true,25479.8,8177.34
Central NY,Onondaga,3301003,000630,St. Joseph's Hospital Health Center,70 or Older,138,F,White,Not Span/Hispanic,5,Urgent,Home w/ Home Health Services,2018,DIG017,BILIARY TRACT DISEASE,HEP010,HEPATOBILIARY AND PANCREATIC DRAINAGE,284,DISORDERS OF GALLBLADDER & BILIARY TRACT,07,DISEASES AND DISORDERS OF THE HEPATOBILIARY SYSTEM AND PANCREAS,1,Minor,Moderate,Medical,Medicare,Private Health Insurance,,,,false,22799.49,7435.79
New York City,Bronx,7000006,003058,Montefiore Med Center - Jack D Weiler Hosp of A Einstein College Div,50 to 69,104,F,Multi-racial,Unknown,2,Emergency,Home or Self Care,2018,DIG017,BILIARY TRACT DISEASE,IMG008,ULTRASONOGRAPHY,284,DISORDERS OF GALLBLADDER & BILIARY TRACT,07,DISEASES AND DISORDERS OF THE HEPATOBILIARY SYSTEM AND PANCREAS,2,Moderate,Minor,Medical,Medicare,,,,,true,29696.16,4646.69
New York City,Queens,7003010,001637,New York - Presbyterian/Queens,50 to 69,114,F,White,Not Span/Hispanic,7,Emergency,Home or Self Care,2018,DIG017,BILIARY TRACT DISEASE,HEP007,BILIARY AND PANCREATIC CALCULUS REMOVAL,284,DISORDERS OF GALLBLADDER & BILIARY TRACT,07,DISEASES AND DISORDERS OF THE HEPATOBILIARY SYSTEM AND PANCREAS,2,Moderate,Minor,Medical,Medicaid,Self-Pay,,,,true,56710.83,16981.17
New York City,Bronx,7000008,001172,Lincoln Medical & Mental Health Center,50 to 69,104,M,Other Race,Spanish/Hispanic,5,Emergency,Home or Self Care,2018,DIG017,BILIARY TRACT DISEASE,,,284,DISORDERS OF GALLBLADDER & BILIARY TRACT,07,DISEASES AND DISORDERS OF THE HEPATOBILIARY SYSTEM AND PANCREAS,1,Minor,Minor,Medical,Medicare,Medicaid,,,,true,30368.86,17934.54
New York City,Kings,7001020,001305,Maimonides Medical Center,70 or Older,112,F,White,Unknown,7,Emergency,Home w/ Home Health Services,2018,DIG017,BILIARY TRACT DISEASE,HEP008,COMMON BILE DUCT SPHINCTEROTOMY AND STENTING,284,DISORDERS OF GALLBLADDER & BILIARY TRACT,07,DISEASES AND DISORDERS OF THE HEPATOBILIARY SYSTEM AND PANCREAS,3,Major,Moderate,Medical,Medicare,Blue Cross/Blue Shield,Medicaid,,,true,90143.09,33282.74
New York City,Bronx,7000006,001169,Montefiore Medical Center - Henry & Lucy Moses Div,50 to 69,106,M,White,Not Span/Hispanic,9,Emergency,Home or Self Care,2018,DIG017,BILIARY TRACT DISEASE,URN005,NEPHROSTOMY AND URETEROSTOMY PROCEDURES (INCLUDING STENTS),284,DISORDERS OF GALLBLADDER & BILIARY TRACT,07,DISEASES AND DISORDERS OF THE HEPATOBILIARY SYSTEM AND PANCREAS,3,Major,Moderate,Medical,Private Health Insurance,,,,,false,233107.46,42002.78
New York City,Kings,7001009,001294,Coney Island Hospital,50 to 69,103,F,Other Race,Spanish/Hispanic,2,Emergency,Home or Self Care,2018,DIG017,BILIARY TRACT DISEASE,HEP008,COMMON BILE DUCT SPHINCTEROTOMY AND STENTING,284,DISORDERS OF GALLBLADDER & BILIARY TRACT,07,DISEASES AND DISORDERS OF THE HEPATOBILIARY SYSTEM AND PANCREAS,1,Minor,Minor,Medical,Medicaid,,,,,true,20598.09,11529.35
New York City,Bronx,7000024,001186,North Central Bronx Hospital,30 to 49,104,M,Black/African American,Not Span/Hispanic,1,Emergency,Home or Self Care,2018,DIG017,BILIARY TRACT DISEASE,,,284,DISORDERS OF GALLBLADDER & BILIARY TRACT,07,DISEASES AND DISORDERS OF THE HEPATOBILIARY SYSTEM AND PANCREAS,2,Moderate,Minor,Medical,Medicare,Medicare,,,,true,9213.88,5531.18
New York City,Manhattan,7002002,001439,Mount Sinai Beth Israel,50 to 69,,F,Other Race,Multi-ethnic,2,Emergency,Home or Self Care,2018,DIG017,BILIARY TRACT DISEASE,ADM015,ADMINISTRATION OF ANTIBIOTICS,284,DISORDERS OF GALLBLADDER & BILIARY TRACT,07,DISEASES AND DISORDERS OF THE HEPATOBILIARY SYSTEM AND PANCREAS,1,Minor,Minor,Medical,Blue Cross/Blue Shield,Self-Pay,,,,true,29585.15,6522.27
Long Island,Nassau,2953000,000563,St. Francis Hospital & Heart Center,70 or Older,115,M,White,Not Span/Hispanic,4,Emergency,Home or Self Care,2018,DIG017,BILIARY TRACT DISEASE,,,284,DISORDERS OF GALLBLADDER & BILIARY TRACT,07,DISEASES AND DISORDERS OF THE HEPATOBILIARY SYSTEM AND PANCREAS,2,Moderate,Moderate,Medical,Medicare,Private Health Insurance,,,,true,43752,8288.3
Capital/Adirond,Saratoga,4501000,000818,Saratoga Hospital,70 or Older,120,M,White,Not Span/Hispanic,2,Emergency,Home or Self Care,2018,DIG017,BILIARY TRACT DISEASE,,,284,DISORDERS OF GALLBLADDER & BILIARY TRACT,07,DISEASES AND DISORDERS OF THE HEPATOBILIARY SYSTEM AND PANCREAS,2,Moderate,Moderate,Medical,Medicare,,,,,true,18837.97,3436.97
New York City,Kings,7001020,001305,Maimonides Medical Center,30 to 49,112,F,White,Not Span/Hispanic,3,Emergency,Home or Self Care,2018,DIG017,BILIARY TRACT DISEASE,IMG005,MAGNETIC RESONANCE IMAGING (MRI),284,DISORDERS OF GALLBLADDER & BILIARY TRACT,07,DISEASES AND DISORDERS OF THE HEPATOBILIARY SYSTEM AND PANCREAS,2,Moderate,Minor,Medical,Medicaid,Medicaid,Self-Pay,,,false,20458.01,5320.69
New York City,Queens,7003007,001633,Queens Hospital Center,30 to 49,114,M,Other Race,Spanish/Hispanic,2,Emergency,Home or Self Care,2018,DIG017,BILIARY TRACT DISEASE,IMG008,ULTRASONOGRAPHY,284,DISORDERS OF GALLBLADDER & BILIARY TRACT,07,DISEASES AND DISORDERS OF THE HEPATOBILIARY SYSTEM AND PANCREAS,1,Minor,Minor,Medical,Medicaid,,,,,true,17544.92,9368.44
New York City,Manhattan,7002021,001454,Metropolitan Hospital Center,70 or Older,104,F,Other Race,Spanish/Hispanic,2,Emergency,Short-term Hospital,2018,DIG017,BILIARY TRACT DISEASE,IMG007,COMPUTERIZED TOMOGRAPHY (CT) WITHOUT CONTRAST,284,DISORDERS OF GALLBLADDER & BILIARY TRACT,07,DISEASES AND DISORDERS OF THE HEPATOBILIARY SYSTEM AND PANCREAS,2,Moderate,Major,Medical,Medicare,Medicare,Medicaid,,,true,13901.31,11231.56
Central NY,Oneida,3201002,000589,"Rome Memorial Hospital, Inc",18 to 29,134,F,White,Not Span/Hispanic,3,Emergency,Home or Self Care,2018,DIG017,BILIARY TRACT DISEASE,HEP007,BILIARY AND PANCREATIC CALCULUS REMOVAL,284,DISORDERS OF GALLBLADDER & BILIARY TRACT,07,DISEASES AND DISORDERS OF THE HEPATOBILIARY SYSTEM AND PANCREAS,2,Moderate,Moderate,Medical,Medicaid,Medicaid,,,,true,22490,6247.31
New York City,Bronx,7000001,001178,BronxCare Hospital Center,30 to 49,104,F,Other Race,Spanish/Hispanic,3,Emergency,Home or Self Care,2018,DIG017,BILIARY TRACT DISEASE,,,284,DISORDERS OF GALLBLADDER & BILIARY TRACT,07,DISEASES AND DISORDERS OF THE HEPATOBILIARY SYSTEM AND PANCREAS,1,Minor,Minor,Medical,Medicaid,,,,,true,10506.06,13003.72
New York City,Bronx,7000001,001178,BronxCare Hospital Center,30 to 49,104,F,Other Race,Spanish/Hispanic,5,Emergency,Home or Self Care,2018,DIG017,BILIARY TRACT DISEASE,HEP008,COMMON BILE DUCT SPHINCTEROTOMY AND STENTING,284,DISORDERS OF GALLBLADDER & BILIARY TRACT,07,DISEASES AND DISORDERS OF THE HEPATOBILIARY SYSTEM AND PANCREAS,1,Minor,Minor,Medical,Self-Pay,,,,,true,19140.77,24607.08
New York City,Queens,7003010,001637,New York - Presbyterian/Queens,30 to 49,114,F,Black/African American,Not Span/Hispanic,3,Emergency,Home or Self Care,2018,DIG017,BILIARY TRACT DISEASE,ADM015,ADMINISTRATION OF ANTIBIOTICS,284,DISORDERS OF GALLBLADDER & BILIARY TRACT,07,DISEASES AND DISORDERS OF THE HEPATOBILIARY SYSTEM AND PANCREAS,1,Minor,Minor,Medical,Private Health Insurance,Self-Pay,,,,true,25279.04,6095.65
New York City,Bronx,7000001,001178,BronxCare Hospital Center,30 to 49,104,F,Other Race,Unknown,2,Emergency,Home or Self Care,2018,DIG017,BILIARY TRACT DISEASE,,,284,DISORDERS OF GALLBLADDER & BILIARY TRACT,07,DISEASES AND DISORDERS OF THE HEPATOBILIARY SYSTEM AND PANCREAS,2,Moderate,Minor,Medical,Blue Cross/Blue Shield,,,,,true,8480.94,9648.63
New York City,Bronx,7000006,001169,Montefiore Medical Center - Henry & Lucy Moses Div,50 to 69,104,M,Other Race,Spanish/Hispanic,6,Emergency,Home or Self Care,2018,DIG024,POSTPROCEDURAL OR POSTOPERATIVE DIGESTIVE SYSTEM COMPLICATION,GIS001,ESOPHAGOGASTRODUODENOSCOPY (EGD) WITH BIOPSY,284,DISORDERS OF GALLBLADDER & BILIARY TRACT,07,DISEASES AND DISORDERS OF THE HEPATOBILIARY SYSTEM AND PANCREAS,3,Major,Moderate,Medical,Private Health Insurance,,,,,true,63087.39,14442.32
Long Island,Nassau,2952005,000552,Plainview Hospital,70 or Older,118,M,White,Not Span/Hispanic,2,Emergency,Short-term Hospital,2018,DIG017,BILIARY TRACT DISEASE,,,284,DISORDERS OF GALLBLADDER & BILIARY TRACT,07,DISEASES AND DISORDERS OF THE HEPATOBILIARY SYSTEM AND PANCREAS,1,Minor,Minor,Medical,Medicare,Private Health Insurance,,,,true,24614.16,7778.55
New York City,Kings,7001021,001306,New York - Presbyterian Brooklyn Methodist Hospital,70 or Older,112,M,White,Spanish/Hispanic,4,Emergency,Home or Self Care,2018,DIG017,BILIARY TRACT DISEASE,HEP007,BILIARY AND PANCREATIC CALCULUS REMOVAL,284,DISORDERS OF GALLBLADDER & BILIARY TRACT,07,DISEASES AND DISORDERS OF THE HEPATOBILIARY SYSTEM AND PANCREAS,2,Moderate,Moderate,Medical,Medicare,Medicare,Self-Pay,,,true,35742.29,9373.01
Finger Lakes,Monroe,2701003,000411,Rochester General Hospital,50 to 69,146,F,White,Not Span/Hispanic,4,Emergency,Home w/ Home Health Services,2018,DIG017,BILIARY TRACT DISEASE,HEP010,HEPATOBILIARY AND PANCREATIC DRAINAGE,284,DISORDERS OF GALLBLADDER & BILIARY TRACT,07,DISEASES AND DISORDERS OF THE HEPATOBILIARY SYSTEM AND PANCREAS,2,Moderate,Moderate,Medical,Medicare,,,,,true,21223.57,6915.45
Finger Lakes,Monroe,2701003,000411,Rochester General Hospital,50 to 69,130,F,White,Not Span/Hispanic,6,Urgent,Home or Self Care,2018,DIG017,BILIARY TRACT DISEASE,HEP002,PANCREATICOBILIARY BIOPSY,284,DISORDERS OF GALLBLADDER & BILIARY TRACT,07,DISEASES AND DISORDERS OF THE HEPATOBILIARY SYSTEM AND PANCREAS,3,Major,Minor,Medical,Medicare,,,,,false,24520.33,12068.53
Capital/Adirond,Montgomery,2801001,000484,St. Mary's Healthcare,70 or Older,121,F,White,Not Span/Hispanic,5,Emergency,Home or Self Care,2018,DIG017,BILIARY TRACT DISEASE,HEP008,COMMON BILE DUCT SPHINCTEROTOMY AND STENTING,284,DISORDERS OF GALLBLADDER & BILIARY TRACT,07,DISEASES AND DISORDERS OF THE HEPATOBILIARY SYSTEM AND PANCREAS,3,Major,Moderate,Medical,Medicare,Medicare,Blue Cross/Blue Shield,,,true,42755.96,13805.84
Central NY,Oneida,3201002,000589,"Rome Memorial Hospital, Inc",50 to 69,134,M,White,Spanish/Hispanic,1,Emergency,Home or Self Care,2018,DIG017,BILIARY TRACT DISEASE,,,284,DISORDERS OF GALLBLADDER & BILIARY TRACT,07,DISEASES AND DISORDERS OF THE HEPATOBILIARY SYSTEM AND PANCREAS,2,Moderate,Minor,Medical,Private Health Insurance,,,,,true,16226.97,2655.29
New York City,Bronx,7000006,003058,Montefiore Med Center - Jack D Weiler Hosp of A Einstein College Div,30 to 49,104,M,Other Race,Spanish/Hispanic,2,Emergency,Home or Self Care,2018,DIG017,BILIARY TRACT DISEASE,,,284,DISORDERS OF GALLBLADDER & BILIARY TRACT,07,DISEASES AND DISORDERS OF THE HEPATOBILIARY SYSTEM AND PANCREAS,2,Moderate,Moderate,Medical,Private Health Insurance,,,,,true,27066.87,5129.27
New York City,Bronx,7000006,001168,Montefiore Medical Center-Wakefield Hospital,30 to 49,104,F,Other Race,Spanish/Hispanic,3,Emergency,Home or Self Care,2018,DIG017,BILIARY TRACT DISEASE,HEP008,COMMON BILE DUCT SPHINCTEROTOMY AND STENTING,284,DISORDERS OF GALLBLADDER & BILIARY TRACT,07,DISEASES AND DISORDERS OF THE HEPATOBILIARY SYSTEM AND PANCREAS,1,Minor,Minor,Medical,Private Health Insurance,,,,,true,55652.78,12438.1
Western NY,Erie,1404000,000267,Kenmore Mercy Hospital,30 to 49,142,F,White,Not Span/Hispanic,1,Emergency,Home or Self Care,2018,DIG017,BILIARY TRACT DISEASE,,,284,DISORDERS OF GALLBLADDER & BILIARY TRACT,07,DISEASES AND DISORDERS OF THE HEPATOBILIARY SYSTEM AND PANCREAS,1,Minor,Minor,Medical,Blue Cross/Blue Shield,,,,,true,4748.4,1621.67
Western NY,Erie,1404000,000267,Kenmore Mercy Hospital,30 to 49,143,F,White,Not Span/Hispanic,1,Emergency,Home or Self Care,2018,DIG017,BILIARY TRACT DISEASE,,,284,DISORDERS OF GALLBLADDER & BILIARY TRACT,07,DISEASES AND DISORDERS OF THE HEPATOBILIARY SYSTEM AND PANCREAS,1,Minor,Minor,Medical,Medicare,Medicare,Medicaid,,,true,5441.18,1690.24
New York City,Manhattan,7002032,001466,Mount Sinai West,50 to 69,100,F,Other Race,Spanish/Hispanic,3,Emergency,Home or Self Care,2018,DIG017,BILIARY TRACT DISEASE,OTR004,ISOLATION PROCEDURES,284,DISORDERS OF GALLBLADDER & BILIARY TRACT,07,DISEASES AND DISORDERS OF THE HEPATOBILIARY SYSTEM AND PANCREAS,2,Moderate,Moderate,Medical,Medicaid,Medicaid,Self-Pay,,,true,35996.06,8461.98
Finger Lakes,Monroe,2701003,000411,Rochester General Hospital,50 to 69,146,M,White,Not Span/Hispanic,1,Emergency,Home or Self Care,2018,DIG017,BILIARY TRACT DISEASE,,,284,DISORDERS OF GALLBLADDER & BILIARY TRACT,07,DISEASES AND DISORDERS OF THE HEPATOBILIARY SYSTEM AND PANCREAS,1,Minor,Minor,Medical,Medicare,,,,,true,8581.85,2547.92
Western NY,Genesee,1801000,000339,United Memorial Medical Center North Street Campus,70 or Older,141,F,White,Not Span/Hispanic,6,Elective,Skilled Nursing Home,2018,DIG017,BILIARY TRACT DISEASE,,,284,DISORDERS OF GALLBLADDER & BILIARY TRACT,07,DISEASES AND DISORDERS OF THE HEPATOBILIARY SYSTEM AND PANCREAS,3,Major,Major,Medical,Medicare,Private Health Insurance,,,,false,6352.08,3819.91
Long Island,Nassau,2952005,000552,Plainview Hospital,50 to 69,117,M,White,Not Span/Hispanic,6,Emergency,Home or Self Care,2018,DIG017,BILIARY TRACT DISEASE,HEP007,BILIARY AND PANCREATIC CALCULUS REMOVAL,284,DISORDERS OF GALLBLADDER & BILIARY TRACT,07,DISEASES AND DISORDERS OF THE HEPATOBILIARY SYSTEM AND PANCREAS,2,Moderate,Moderate,Medical,Medicare,Medicare,,,,true,70994.74,24408.06
New York City,Richmond,7004003,001740,Staten Island University Hosp-North,70 or Older,103,M,White,Not Span/Hispanic,4,Emergency,Home or Self Care,2018,DIG017,BILIARY TRACT DISEASE,GIS005,EXPLORATION OF PERITONEAL CAVITY,284,DISORDERS OF GALLBLADDER & BILIARY TRACT,07,DISEASES AND DISORDERS OF THE HEPATOBILIARY SYSTEM AND PANCREAS,3,Major,Major,Medical,Medicare,Private Health Insurance,,,,true,42328.73,8763.42
Western NY,Erie,1401014,003067,Millard Fillmore Suburban Hospital,70 or Older,140,F,White,Not Span/Hispanic,5,Emergency,Home or Self Care,2018,DIG017,BILIARY TRACT DISEASE,HEP007,BILIARY AND PANCREATIC CALCULUS REMOVAL,284,DISORDERS OF GALLBLADDER & BILIARY TRACT,07,DISEASES AND DISORDERS OF THE HEPATOBILIARY SYSTEM AND PANCREAS,3,Major,Major,Medical,Medicare,Self-Pay,,,,true,23440.71,10792.92
New York City,Manhattan,7002017,001450,Lenox Hill Hospital,18 to 29,112,F,White,Not Span/Hispanic,3,Emergency,Left Against Medical Advice,2018,DIG017,BILIARY TRACT DISEASE,,,284,DISORDERS OF GALLBLADDER & BILIARY TRACT,07,DISEASES AND DISORDERS OF THE HEPATOBILIARY SYSTEM AND PANCREAS,2,Moderate,Minor,Medical,Medicaid,Medicaid,,,,true,30271.64,4743.94
New York City,Manhattan,7002054,001464,New York-Presbyterian Hospital - Columbia Presbyterian Center,70 or Older,109,M,Other Race,Not Span/Hispanic,3,Emergency,Hospice - Home,2018,DIG017,BILIARY TRACT DISEASE,HEP008,COMMON BILE DUCT SPHINCTEROTOMY AND STENTING,284,DISORDERS OF GALLBLADDER & BILIARY TRACT,07,DISEASES AND DISORDERS OF THE HEPATOBILIARY SYSTEM AND PANCREAS,3,Major,Major,Medical,Medicare,Blue Cross/Blue Shield,Self-Pay,,,true,50911.59,15287.96
New York City,Queens,7003000,001626,Elmhurst Hospital Center,50 to 69,113,M,Other Race,Spanish/Hispanic,3,Emergency,Home or Self Care,2018,DIG017,BILIARY TRACT DISEASE,,,284,DISORDERS OF GALLBLADDER & BILIARY TRACT,07,DISEASES AND DISORDERS OF THE HEPATOBILIARY SYSTEM AND PANCREAS,1,Minor,Minor,Medical,Medicaid,,,,,true,18255.03,10861.12
Central NY,Onondaga,3301007,000635,University Hospital SUNY Health Science Center,70 or Older,OOS,M,White,Not Span/Hispanic,8,Emergency,Home or Self Care,2018,DIG017,BILIARY TRACT DISEASE,HEP008,COMMON BILE DUCT SPHINCTEROTOMY AND STENTING,284,DISORDERS OF GALLBLADDER & BILIARY TRACT,07,DISEASES AND DISORDERS OF THE HEPATOBILIARY SYSTEM AND PANCREAS,3,Major,Moderate,Medical,Medicare,,,,,true,48333.84,13532.79
New York City,Manhattan,7002017,001450,Lenox Hill Hospital,30 to 49,111,M,Black/African American,Not Span/Hispanic,1,Emergency,Home or Self Care,2018,DIG017,BILIARY TRACT DISEASE,,,284,DISORDERS OF GALLBLADDER & BILIARY TRACT,07,DISEASES AND DISORDERS OF THE HEPATOBILIARY SYSTEM AND PANCREAS,1,Minor,Minor,Medical,Blue Cross/Blue Shield,,,,,true,20895.22,2990.94