Hospital Service Area,Hospital County,Operating Certificate Number,Permanent Facility Id,Facility Name,Age Group,Zip Code - 3 digits,Gender,Race,Ethnicity,Length of Stay,Type of Admission,Patient Disposition,Discharge Year,CCS Diagnosis Code,CCS Diagnosis Description,CCS Procedure Code,CCS Procedure Description,APR DRG Code,APR DRG Description,APR MDC Code,APR MDC Description,APR Severity of Illness Code,APR Severity of Illness Description,APR Risk of Mortality,APR Medical Surgical Description,Payment Typology 1,Payment Typology 2,Payment Typology 3,Birth Weight,Abortion Edit Indicator,Emergency Department Indicator,Total Charges,Total Costs
New York City,Manhattan,7002053,001463,NYU Langone Hospitals,70 or Older,100,F,Other Race,Unknown,5,Emergency,Inpatient Rehabilitation Facility,2020,INJ008,"TRAUMATIC BRAIN INJURY (TBI); CONCUSSION, INITIAL ENCOUNTER",CNS004,INTRACRANIAL EPIDURAL AND SUBDURAL SPACE DRAINAGE,029,OTHER PERCUTANEOUS INTRACRANIAL PROCEDURES,01,DISEASES AND DISORDERS OF THE NERVOUS SYSTEM,2,Moderate,Moderate,Surgical,Medicare,Blue Cross/Blue Shield,,,,Y,114238.23,29460.83
New York City,Manhattan,7002053,001463,NYU Langone Hospitals,70 or Older,103,M,White,Not Span/Hispanic,1,Elective,Home or Self Care,2020,NVS004,PARKINSON`S DISEASE,CNS012,CNS NEUROSTIMULATOR PROCEDURES,029,OTHER PERCUTANEOUS INTRACRANIAL PROCEDURES,01,DISEASES AND DISORDERS OF THE NERVOUS SYSTEM,2,Moderate,Minor,Surgical,Medicaid,,,,,N,164076.58,25123.22
New York City,Manhattan,7002053,001463,NYU Langone Hospitals,50 to 69,117,F,White,Not Span/Hispanic,1,Elective,Home or Self Care,2020,NVS004,PARKINSON`S DISEASE,CNS012,CNS NEUROSTIMULATOR PROCEDURES,029,OTHER PERCUTANEOUS INTRACRANIAL PROCEDURES,01,DISEASES AND DISORDERS OF THE NERVOUS SYSTEM,1,Minor,Moderate,Surgical,Medicare,Medicare,,,,N,176687.23,26490.2
New York City,Manhattan,7002053,001463,NYU Langone Hospitals,50 to 69,105,M,White,Not Span/Hispanic,2,Elective,Home or Self Care,2020,INJ008,"TRAUMATIC BRAIN INJURY (TBI); CONCUSSION, INITIAL ENCOUNTER",CNS004,INTRACRANIAL EPIDURAL AND SUBDURAL SPACE DRAINAGE,029,OTHER PERCUTANEOUS INTRACRANIAL PROCEDURES,01,DISEASES AND DISORDERS OF THE NERVOUS SYSTEM,1,Minor,Minor,Surgical,Private Health Insurance,,,,,N,97253.24,20122.9
New York City,Manhattan,7002053,001463,NYU Langone Hospitals,0 to 17,105,M,Other Race,Spanish/Hispanic,5,Emergency,Home or Self Care,2020,NVS021,POSTPROCEDURAL OR POSTOPERATIVE NERVOUS SYSTEM COMPLICATION,CNS014,"CNS PROCEDURES, NEC",029,OTHER PERCUTANEOUS INTRACRANIAL PROCEDURES,01,DISEASES AND DISORDERS OF THE NERVOUS SYSTEM,2,Moderate,Minor,Surgical,Blue Cross/Blue Shield,,,,,Y,116943.06,21956.11
New York City,Manhattan,7002053,001463,NYU Langone Hospitals,70 or Older,110,M,White,Not Span/Hispanic,1,Elective,Home or Self Care,2020,NVS004,PARKINSON`S DISEASE,CNS012,CNS NEUROSTIMULATOR PROCEDURES,029,OTHER PERCUTANEOUS INTRACRANIAL PROCEDURES,01,DISEASES AND DISORDERS OF THE NERVOUS SYSTEM,1,Minor,Moderate,Surgical,Private Health Insurance,,,,,N,177688.63,26975.52
New York City,Manhattan,7002053,001463,NYU Langone Hospitals,70 or Older,100,M,Other Race,Not Span/Hispanic,2,Emergency,Home w/ Home Health Services,2020,INJ008,"TRAUMATIC BRAIN INJURY (TBI); CONCUSSION, INITIAL ENCOUNTER",CNS004,INTRACRANIAL EPIDURAL AND SUBDURAL SPACE DRAINAGE,029,OTHER PERCUTANEOUS INTRACRANIAL PROCEDURES,01,DISEASES AND DISORDERS OF THE NERVOUS SYSTEM,2,Moderate,Minor,Surgical,Medicare,Medicaid,,,,Y,62766.18,14253.54
New York City,Manhattan,7002053,001463,NYU Langone Hospitals,50 to 69,112,M,White,Not Span/Hispanic,1,Elective,Home or Self Care,2020,NVS006,OTHER SPECIFIED HEREDITARY AND DEGENERATIVE NERVOUS SYSTEM CONDITIONS,CNS012,CNS NEUROSTIMULATOR PROCEDURES,029,OTHER PERCUTANEOUS INTRACRANIAL PROCEDURES,01,DISEASES AND DISORDERS OF THE NERVOUS SYSTEM,1,Minor,Minor,Surgical,Private Health Insurance,,,,,N,180456.35,27116.04
New York City,Manhattan,7002053,001463,NYU Langone Hospitals,70 or Older,117,M,White,Not Span/Hispanic,4,Elective,Home or Self Care,2020,NEO073,BENIGN NEOPLASMS,CNS007,CNS EXCISION PROCEDURES,029,OTHER PERCUTANEOUS INTRACRANIAL PROCEDURES,01,DISEASES AND DISORDERS OF THE NERVOUS SYSTEM,3,Major,Extreme,Surgical,Medicare,Medicare,,,,N,164436.22,31293.51
New York City,Manhattan,7002053,001463,NYU Langone Hospitals,0 to 17,100,F,White,Not Span/Hispanic,1,Elective,Home or Self Care,2020,NVS006,OTHER SPECIFIED HEREDITARY AND DEGENERATIVE NERVOUS SYSTEM CONDITIONS,CNS012,CNS NEUROSTIMULATOR PROCEDURES,029,OTHER PERCUTANEOUS INTRACRANIAL PROCEDURES,01,DISEASES AND DISORDERS OF THE NERVOUS SYSTEM,1,Minor,Minor,Surgical,Blue Cross/Blue Shield,,,,,N,248848.41,37013.87
New York City,Manhattan,7002053,001463,NYU Langone Hospitals,50 to 69,OOS,M,White,Unknown,1,Elective,Home or Self Care,2020,NVS004,PARKINSON`S DISEASE,CNS012,CNS NEUROSTIMULATOR PROCEDURES,029,OTHER PERCUTANEOUS INTRACRANIAL PROCEDURES,01,DISEASES AND DISORDERS OF THE NERVOUS SYSTEM,1,Minor,Minor,Surgical,Private Health Insurance,Private Health Insurance,,,,N,183942.2,27433.49
New York City,Manhattan,7002053,001463,NYU Langone Hospitals,18 to 29,115,F,White,Not Span/Hispanic,9,Elective,Home or Self Care,2020,NVS009,EPILEPSY; CONVULSIONS,CNS012,CNS NEUROSTIMULATOR PROCEDURES,029,OTHER PERCUTANEOUS INTRACRANIAL PROCEDURES,01,DISEASES AND DISORDERS OF THE NERVOUS SYSTEM,2,Moderate,Moderate,Surgical,Private Health Insurance,,,,,N,462639.01,87065.77
New York City,Manhattan,7002053,001463,NYU Langone Hospitals,50 to 69,OOS,F,Other Race,Spanish/Hispanic,1,Elective,Home or Self Care,2020,NVS004,PARKINSON`S DISEASE,CNS012,CNS NEUROSTIMULATOR PROCEDURES,029,OTHER PERCUTANEOUS INTRACRANIAL PROCEDURES,01,DISEASES AND DISORDERS OF THE NERVOUS SYSTEM,1,Minor,Minor,Surgical,Medicare,Blue Cross/Blue Shield,,,,N,158722.14,24234.04
New York City,Manhattan,7002053,001463,NYU Langone Hospitals,0 to 17,OOS,F,White,Not Span/Hispanic,7,Elective,Home w/ Home Health Services,2020,NEO048,NERVOUS SYSTEM CANCERS - BRAIN,CNS007,CNS EXCISION PROCEDURES,029,OTHER PERCUTANEOUS INTRACRANIAL PROCEDURES,01,DISEASES AND DISORDERS OF THE NERVOUS SYSTEM,2,Moderate,Minor,Surgical,Private Health Insurance,,,,,N,305930.63,54160.74
New York City,Manhattan,7002053,001463,NYU Langone Hospitals,50 to 69,113,M,White,Not Span/Hispanic,1,Elective,Home or Self Care,2020,NVS004,PARKINSON`S DISEASE,CNS012,CNS NEUROSTIMULATOR PROCEDURES,029,OTHER PERCUTANEOUS INTRACRANIAL PROCEDURES,01,DISEASES AND DISORDERS OF THE NERVOUS SYSTEM,1,Minor,Minor,Surgical,Medicaid,,,,,N,183151.45,27649.99
New York City,Manhattan,7002053,001463,NYU Langone Hospitals,70 or Older,119,M,White,Not Span/Hispanic,1,Elective,Home or Self Care,2020,NVS004,PARKINSON`S DISEASE,CNS012,CNS NEUROSTIMULATOR PROCEDURES,029,OTHER PERCUTANEOUS INTRACRANIAL PROCEDURES,01,DISEASES AND DISORDERS OF THE NERVOUS SYSTEM,1,Minor,Minor,Surgical,Medicare,Blue Cross/Blue Shield,,,,N,218680.81,31204.38
New York City,Manhattan,7002053,001463,NYU Langone Hospitals,50 to 69,OOS,F,White,Not Span/Hispanic,1,Elective,Home or Self Care,2020,NVS006,OTHER SPECIFIED HEREDITARY AND DEGENERATIVE NERVOUS SYSTEM CONDITIONS,CNS012,CNS NEUROSTIMULATOR PROCEDURES,029,OTHER PERCUTANEOUS INTRACRANIAL PROCEDURES,01,DISEASES AND DISORDERS OF THE NERVOUS SYSTEM,1,Minor,Minor,Surgical,Medicare,,,,,N,173769.89,25971.72
New York City,Manhattan,7002053,001463,NYU Langone Hospitals,50 to 69,104,F,Other Race,Spanish/Hispanic,1,Elective,Home w/ Home Health Services,2020,NVS006,OTHER SPECIFIED HEREDITARY AND DEGENERATIVE NERVOUS SYSTEM CONDITIONS,CNS012,CNS NEUROSTIMULATOR PROCEDURES,029,OTHER PERCUTANEOUS INTRACRANIAL PROCEDURES,01,DISEASES AND DISORDERS OF THE NERVOUS SYSTEM,1,Minor,Minor,Surgical,Medicare,Medicaid,,,,N,174800.05,26441.39
New York City,Manhattan,7002053,001463,NYU Langone Hospitals,50 to 69,100,F,Other Race,Not Span/Hispanic,7,Emergency,Home or Self Care,2020,NEO073,BENIGN NEOPLASMS,CNS007,CNS EXCISION PROCEDURES,029,OTHER PERCUTANEOUS INTRACRANIAL PROCEDURES,01,DISEASES AND DISORDERS OF THE NERVOUS SYSTEM,3,Major,Extreme,Surgical,Medicaid,,,,,Y,219631.5,46243.45
New York City,Manhattan,7002053,001463,NYU Langone Hospitals,50 to 69,OOS,F,White,Not Span/Hispanic,4,Emergency,Home or Self Care,2020,NEO048,NERVOUS SYSTEM CANCERS - BRAIN,CNS007,CNS EXCISION PROCEDURES,029,OTHER PERCUTANEOUS INTRACRANIAL PROCEDURES,01,DISEASES AND DISORDERS OF THE NERVOUS SYSTEM,4,Extreme,Extreme,Surgical,Blue Cross/Blue Shield,,,,,Y,161769.35,30103.28
New York City,Manhattan,7002053,001463,NYU Langone Hospitals,70 or Older,100,F,White,Not Span/Hispanic,1,Elective,Home or Self Care,2020,NVS004,PARKINSON`S DISEASE,CNS012,CNS NEUROSTIMULATOR PROCEDURES,029,OTHER PERCUTANEOUS INTRACRANIAL PROCEDURES,01,DISEASES AND DISORDERS OF THE NERVOUS SYSTEM,1,Minor,Minor,Surgical,Medicare,Blue Cross/Blue Shield,,,,N,170479.99,25900.32
New York City,Manhattan,7002053,001463,NYU Langone Hospitals,30 to 49,112,M,Other Race,Not Span/Hispanic,1,Elective,Home or Self Care,2020,NVS004,PARKINSON`S DISEASE,CNS012,CNS NEUROSTIMULATOR PROCEDURES,029,OTHER PERCUTANEOUS INTRACRANIAL PROCEDURES,01,DISEASES AND DISORDERS OF THE NERVOUS SYSTEM,1,Minor,Minor,Surgical,Medicare,Medicaid,,,,N,169107.57,25709.28
New York City,Manhattan,7002053,001463,NYU Langone Hospitals,50 to 69,117,F,White,Not Span/Hispanic,1,Elective,Home w/ Home Health Services,2020,NVS004,PARKINSON`S DISEASE,CNS012,CNS NEUROSTIMULATOR PROCEDURES,029,OTHER PERCUTANEOUS INTRACRANIAL PROCEDURES,01,DISEASES AND DISORDERS OF THE NERVOUS SYSTEM,1,Minor,Minor,Surgical,Medicare,Medicare,,,,N,176699.41,26412.26
New York City,Manhattan,7002053,001463,NYU Langone Hospitals,50 to 69,100,M,White,Not Span/Hispanic,1,Elective,Home or Self Care,2020,NEO048,NERVOUS SYSTEM CANCERS - BRAIN,RAD004,"RADIATION THERAPY, NEC",029,OTHER PERCUTANEOUS INTRACRANIAL PROCEDURES,01,DISEASES AND DISORDERS OF THE NERVOUS SYSTEM,3,Major,Major,Surgical,Private Health Insurance,Private Health Insurance,,,,N,288678.23,43429.24
New York City,Manhattan,7002053,001463,NYU Langone Hospitals,0 to 17,100,M,Other Race,Unknown,11,Elective,Home w/ Home Health Services,2020,NVS009,EPILEPSY; CONVULSIONS,CNS014,"CNS PROCEDURES, NEC",029,OTHER PERCUTANEOUS INTRACRANIAL PROCEDURES,01,DISEASES AND DISORDERS OF THE NERVOUS SYSTEM,2,Moderate,Moderate,Surgical,Private Health Insurance,,,,,N,737602.1,114749.77
New York City,Manhattan,7002053,001463,NYU Langone Hospitals,50 to 69,,F,White,Not Span/Hispanic,1,Elective,Home or Self Care,2020,NEO070,SECONDARY MALIGNANCIES,CNS014,"CNS PROCEDURES, NEC",029,OTHER PERCUTANEOUS INTRACRANIAL PROCEDURES,01,DISEASES AND DISORDERS OF THE NERVOUS SYSTEM,2,Moderate,Moderate,Surgical,Private Health Insurance,,,,,N,107856.53,16976.55
New York City,Manhattan,7002053,001463,NYU Langone Hospitals,0 to 17,112,F,Other Race,Spanish/Hispanic,10,Emergency,Home or Self Care,2020,CIR021,ACUTE HEMORRHAGIC CEREBROVASCULAR DISEASE,CNS004,INTRACRANIAL EPIDURAL AND SUBDURAL SPACE DRAINAGE,029,OTHER PERCUTANEOUS INTRACRANIAL PROCEDURES,01,DISEASES AND DISORDERS OF THE NERVOUS SYSTEM,3,Major,Moderate,Surgical,Medicaid,,,,,Y,220657.54,46199.11
New York City,Manhattan,7002053,001463,NYU Langone Hospitals,30 to 49,111,M,White,Not Span/Hispanic,1,Elective,Home or Self Care,2020,NEO048,NERVOUS SYSTEM CANCERS - BRAIN,CNS001,MINIMALLY INVASIVE CNS BIOPSY,029,OTHER PERCUTANEOUS INTRACRANIAL PROCEDURES,01,DISEASES AND DISORDERS OF THE NERVOUS SYSTEM,3,Major,Extreme,Surgical,Blue Cross/Blue Shield,,,,,N,308993,45596.49
New York City,Manhattan,7002053,001463,NYU Langone Hospitals,0 to 17,112,F,Black/African American,Not Span/Hispanic,45,Emergency,Home or Self Care,2020,NVS020,OTHER SPECIFIED NERVOUS SYSTEM DISORDERS,CNS004,INTRACRANIAL EPIDURAL AND SUBDURAL SPACE DRAINAGE,029,OTHER PERCUTANEOUS INTRACRANIAL PROCEDURES,01,DISEASES AND DISORDERS OF THE NERVOUS SYSTEM,3,Major,Moderate,Surgical,Medicaid,,,,,Y,1071940.88,164695.89
New York City,Manhattan,7002053,001463,NYU Langone Hospitals,70 or Older,105,F,White,Not Span/Hispanic,5,Urgent,Home or Self Care,2020,NEO070,SECONDARY MALIGNANCIES,CNS007,CNS EXCISION PROCEDURES,029,OTHER PERCUTANEOUS INTRACRANIAL PROCEDURES,01,DISEASES AND DISORDERS OF THE NERVOUS SYSTEM,3,Major,Extreme,Surgical,Medicare,Blue Cross/Blue Shield,,,,N,254073.23,46546.94
New York City,Manhattan,7002053,001463,NYU Langone Hospitals,30 to 49,112,F,White,Not Span/Hispanic,2,Elective,Home or Self Care,2020,NEO048,NERVOUS SYSTEM CANCERS - BRAIN,RAD004,"RADIATION THERAPY, NEC",029,OTHER PERCUTANEOUS INTRACRANIAL PROCEDURES,01,DISEASES AND DISORDERS OF THE NERVOUS SYSTEM,3,Major,Extreme,Surgical,Blue Cross/Blue Shield,,,,,N,311201.94,48493.44
New York City,Manhattan,7002053,001463,NYU Langone Hospitals,50 to 69,113,F,White,Not Span/Hispanic,1,Elective,Home or Self Care,2020,NVS004,PARKINSON`S DISEASE,CNS012,CNS NEUROSTIMULATOR PROCEDURES,029,OTHER PERCUTANEOUS INTRACRANIAL PROCEDURES,01,DISEASES AND DISORDERS OF THE NERVOUS SYSTEM,1,Minor,Minor,Surgical,Medicare,Blue Cross/Blue Shield,,,,N,176762.43,26725.37
New York City,Manhattan,7002053,001463,NYU Langone Hospitals,50 to 69,112,M,White,Not Span/Hispanic,1,Elective,Home or Self Care,2020,NVS004,PARKINSON`S DISEASE,CNS012,CNS NEUROSTIMULATOR PROCEDURES,029,OTHER PERCUTANEOUS INTRACRANIAL PROCEDURES,01,DISEASES AND DISORDERS OF THE NERVOUS SYSTEM,1,Minor,Minor,Surgical,Private Health Insurance,,,,,N,193276.48,29133.16
New York City,Manhattan,7002053,001463,NYU Langone Hospitals,50 to 69,OOS,F,White,Not Span/Hispanic,1,Elective,Home or Self Care,2020,NVS004,PARKINSON`S DISEASE,CNS012,CNS NEUROSTIMULATOR PROCEDURES,029,OTHER PERCUTANEOUS INTRACRANIAL PROCEDURES,01,DISEASES AND DISORDERS OF THE NERVOUS SYSTEM,1,Minor,Minor,Surgical,Private Health Insurance,,,,,N,184483.65,27810.23
New York City,Manhattan,7002053,001463,NYU Langone Hospitals,50 to 69,OOS,M,White,Not Span/Hispanic,1,Elective,Home or Self Care,2020,NVS006,OTHER SPECIFIED HEREDITARY AND DEGENERATIVE NERVOUS SYSTEM CONDITIONS,CNS012,CNS NEUROSTIMULATOR PROCEDURES,029,OTHER PERCUTANEOUS INTRACRANIAL PROCEDURES,01,DISEASES AND DISORDERS OF THE NERVOUS SYSTEM,1,Minor,Minor,Surgical,Private Health Insurance,Private Health Insurance,,,,N,174079.8,27373.87
New York City,Manhattan,7002053,001463,NYU Langone Hospitals,70 or Older,113,F,Other Race,Not Span/Hispanic,1,Elective,Home or Self Care,2020,NVS004,PARKINSON`S DISEASE,CNS012,CNS NEUROSTIMULATOR PROCEDURES,029,OTHER PERCUTANEOUS INTRACRANIAL PROCEDURES,01,DISEASES AND DISORDERS OF THE NERVOUS SYSTEM,1,Minor,Minor,Surgical,Medicare,Medicare,,,,N,171389.99,26741.72
New York City,Manhattan,7002053,001463,NYU Langone Hospitals,70 or Older,117,F,White,Not Span/Hispanic,1,Elective,Home or Self Care,2020,NVS006,OTHER SPECIFIED HEREDITARY AND DEGENERATIVE NERVOUS SYSTEM CONDITIONS,CNS012,CNS NEUROSTIMULATOR PROCEDURES,029,OTHER PERCUTANEOUS INTRACRANIAL PROCEDURES,01,DISEASES AND DISORDERS OF THE NERVOUS SYSTEM,1,Minor,Minor,Surgical,Medicare,Private Health Insurance,,,,N,195354.01,30250.63
New York City,Manhattan,7002053,001463,NYU Langone Hospitals,30 to 49,100,M,White,Not Span/Hispanic,1,Elective,Home or Self Care,2020,INJ030,DRUG INDUCED OR TOXIC RELATED CONDITION,CNS012,CNS NEUROSTIMULATOR PROCEDURES,029,OTHER PERCUTANEOUS INTRACRANIAL PROCEDURES,01,DISEASES AND DISORDERS OF THE NERVOUS SYSTEM,1,Minor,Minor,Surgical,Blue Cross/Blue Shield,,,,,N,244175.5,36815.67
New York City,Manhattan,7002053,001463,NYU Langone Hospitals,70 or Older,119,M,White,Not Span/Hispanic,1,Elective,Home or Self Care,2020,NVS004,PARKINSON`S DISEASE,CNS012,CNS NEUROSTIMULATOR PROCEDURES,029,OTHER PERCUTANEOUS INTRACRANIAL PROCEDURES,01,DISEASES AND DISORDERS OF THE NERVOUS SYSTEM,1,Minor,Minor,Surgical,Medicare,Blue Cross/Blue Shield,,,,N,214546.36,32438.26
New York City,Manhattan,7002053,001463,NYU Langone Hospitals,18 to 29,OOS,M,White,Not Span/Hispanic,8,Emergency,Home w/ Home Health Services,2020,NVS006,OTHER SPECIFIED HEREDITARY AND DEGENERATIVE NERVOUS SYSTEM CONDITIONS,CNS012,CNS NEUROSTIMULATOR PROCEDURES,029,OTHER PERCUTANEOUS INTRACRANIAL PROCEDURES,01,DISEASES AND DISORDERS OF THE NERVOUS SYSTEM,3,Major,Major,Surgical,Private Health Insurance,,,,,Y,663504.85,115959.75
New York City,Manhattan,7002053,001463,NYU Langone Hospitals,50 to 69,OOS,M,White,Not Span/Hispanic,1,Elective,Home or Self Care,2020,NVS006,OTHER SPECIFIED HEREDITARY AND DEGENERATIVE NERVOUS SYSTEM CONDITIONS,CNS012,CNS NEUROSTIMULATOR PROCEDURES,029,OTHER PERCUTANEOUS INTRACRANIAL PROCEDURES,01,DISEASES AND DISORDERS OF THE NERVOUS SYSTEM,1,Minor,Minor,Surgical,Private Health Insurance,Private Health Insurance,,,,N,180412.38,28341.64
New York City,Manhattan,7002053,001463,NYU Langone Hospitals,0 to 17,OOS,M,White,Not Span/Hispanic,1,Elective,Home w/ Home Health Services,2020,MBD014,NEURODEVELOPMENTAL DISORDERS,CNS012,CNS NEUROSTIMULATOR PROCEDURES,029,OTHER PERCUTANEOUS INTRACRANIAL PROCEDURES,01,DISEASES AND DISORDERS OF THE NERVOUS SYSTEM,1,Minor,Minor,Surgical,Blue Cross/Blue Shield,,,,,N,248129.82,36954.91
New York City,Manhattan,7002053,001463,NYU Langone Hospitals,50 to 69,117,M,White,Not Span/Hispanic,1,Elective,Home or Self Care,2020,NVS004,PARKINSON`S DISEASE,CNS012,CNS NEUROSTIMULATOR PROCEDURES,029,OTHER PERCUTANEOUS INTRACRANIAL PROCEDURES,01,DISEASES AND DISORDERS OF THE NERVOUS SYSTEM,1,Minor,Minor,Surgical,Private Health Insurance,,,,,N,183449.08,28578.73
New York City,Manhattan,7002053,001463,NYU Langone Hospitals,30 to 49,OOS,M,White,Not Span/Hispanic,1,Elective,Home or Self Care,2020,NVS004,PARKINSON`S DISEASE,CNS012,CNS NEUROSTIMULATOR PROCEDURES,029,OTHER PERCUTANEOUS INTRACRANIAL PROCEDURES,01,DISEASES AND DISORDERS OF THE NERVOUS SYSTEM,1,Minor,Minor,Surgical,Private Health Insurance,,,,,N,234391.97,35851.95
New York City,Manhattan,7002053,001463,NYU Langone Hospitals,18 to 29,117,M,White,Not Span/Hispanic,2,Elective,Home or Self Care,2020,NVS009,EPILEPSY; CONVULSIONS,CNS012,CNS NEUROSTIMULATOR PROCEDURES,029,OTHER PERCUTANEOUS INTRACRANIAL PROCEDURES,01,DISEASES AND DISORDERS OF THE NERVOUS SYSTEM,2,Moderate,Minor,Surgical,Private Health Insurance,,,,,N,512410.55,77074.48
New York City,Manhattan,7002053,001463,NYU Langone Hospitals,50 to 69,112,M,White,Not Span/Hispanic,1,Elective,Home w/ Home Health Services,2020,NVS004,PARKINSON`S DISEASE,CNS012,CNS NEUROSTIMULATOR PROCEDURES,029,OTHER PERCUTANEOUS INTRACRANIAL PROCEDURES,01,DISEASES AND DISORDERS OF THE NERVOUS SYSTEM,1,Minor,Minor,Surgical,Private Health Insurance,,,,,N,182683.28,28450.49
New York City,Manhattan,7002053,001463,NYU Langone Hospitals,70 or Older,119,F,White,Unknown,1,Elective,Home or Self Care,2020,NVS006,OTHER SPECIFIED HEREDITARY AND DEGENERATIVE NERVOUS SYSTEM CONDITIONS,CNS012,CNS NEUROSTIMULATOR PROCEDURES,029,OTHER PERCUTANEOUS INTRACRANIAL PROCEDURES,01,DISEASES AND DISORDERS OF THE NERVOUS SYSTEM,1,Minor,Minor,Surgical,Medicare,Blue Cross/Blue Shield,,,,N,174262.6,27195.08
New York City,Manhattan,7002053,001463,NYU Langone Hospitals,50 to 69,115,F,White,Not Span/Hispanic,1,Elective,Home or Self Care,2020,NVS006,OTHER SPECIFIED HEREDITARY AND DEGENERATIVE NERVOUS SYSTEM CONDITIONS,CNS012,CNS NEUROSTIMULATOR PROCEDURES,029,OTHER PERCUTANEOUS INTRACRANIAL PROCEDURES,01,DISEASES AND DISORDERS OF THE NERVOUS SYSTEM,1,Minor,Minor,Surgical,Private Health Insurance,,,,,N,250766.17,37709.23
New York City,Manhattan,7002053,001463,NYU Langone Hospitals,70 or Older,116,F,White,Not Span/Hispanic,1,Elective,Home w/ Home Health Services,2020,NVS004,PARKINSON`S DISEASE,CNS012,CNS NEUROSTIMULATOR PROCEDURES,029,OTHER PERCUTANEOUS INTRACRANIAL PROCEDURES,01,DISEASES AND DISORDERS OF THE NERVOUS SYSTEM,2,Moderate,Minor,Surgical,Medicare,Private Health Insurance,,,,N,165255.68,26156.23
New York City,Manhattan,7002053,001463,NYU Langone Hospitals,50 to 69,124,M,White,Unknown,1,Elective,Home or Self Care,2020,NVS004,PARKINSON`S DISEASE,CNS012,CNS NEUROSTIMULATOR PROCEDURES,029,OTHER PERCUTANEOUS INTRACRANIAL PROCEDURES,01,DISEASES AND DISORDERS OF THE NERVOUS SYSTEM,1,Minor,Minor,Surgical,Medicare,,,,,N,175572.81,27641.42
New York City,Manhattan,7002053,001463,NYU Langone Hospitals,18 to 29,117,M,White,Not Span/Hispanic,9,Elective,Home or Self Care,2020,NVS009,EPILEPSY; CONVULSIONS,CNS014,"CNS PROCEDURES, NEC",029,OTHER PERCUTANEOUS INTRACRANIAL PROCEDURES,01,DISEASES AND DISORDERS OF THE NERVOUS SYSTEM,3,Major,Major,Surgical,Blue Cross/Blue Shield,,,,,N,644995.03,106029.86
New York City,Manhattan,7002053,001463,NYU Langone Hospitals,70 or Older,113,M,White,Not Span/Hispanic,1,Elective,Home or Self Care,2020,NVS004,PARKINSON`S DISEASE,CNS012,CNS NEUROSTIMULATOR PROCEDURES,029,OTHER PERCUTANEOUS INTRACRANIAL PROCEDURES,01,DISEASES AND DISORDERS OF THE NERVOUS SYSTEM,1,Minor,Minor,Surgical,Medicare,Blue Cross/Blue Shield,Blue Cross/Blue Shield,,,N,167569.49,26462.99
New York City,Manhattan,7002053,001463,NYU Langone Hospitals,70 or Older,OOS,M,White,Not Span/Hispanic,1,Elective,Home or Self Care,2020,NVS004,PARKINSON`S DISEASE,CNS012,CNS NEUROSTIMULATOR PROCEDURES,029,OTHER PERCUTANEOUS INTRACRANIAL PROCEDURES,01,DISEASES AND DISORDERS OF THE NERVOUS SYSTEM,1,Minor,Minor,Surgical,Medicare,Blue Cross/Blue Shield,,,,N,175719.76,27537.81
New York City,Manhattan,7002053,001463,NYU Langone Hospitals,50 to 69,112,M,Other Race,Not Span/Hispanic,1,Elective,Home or Self Care,2020,NVS004,PARKINSON`S DISEASE,CNS012,CNS NEUROSTIMULATOR PROCEDURES,029,OTHER PERCUTANEOUS INTRACRANIAL PROCEDURES,01,DISEASES AND DISORDERS OF THE NERVOUS SYSTEM,1,Minor,Minor,Surgical,Medicaid,,,,,N,186189.1,29067.46
New York City,Manhattan,7002053,001463,NYU Langone Hospitals,70 or Older,117,F,White,Not Span/Hispanic,1,Elective,Home or Self Care,2020,NVS006,OTHER SPECIFIED HEREDITARY AND DEGENERATIVE NERVOUS SYSTEM CONDITIONS,CNS012,CNS NEUROSTIMULATOR PROCEDURES,029,OTHER PERCUTANEOUS INTRACRANIAL PROCEDURES,01,DISEASES AND DISORDERS OF THE NERVOUS SYSTEM,1,Minor,Minor,Surgical,Medicare,Private Health Insurance,,,,N,166950.63,26408.04
New York City,Manhattan,7002053,001463,NYU Langone Hospitals,0 to 17,119,M,White,Not Span/Hispanic,1,Elective,Home or Self Care,2020,NVS020,OTHER SPECIFIED NERVOUS SYSTEM DISORDERS,CNS014,"CNS PROCEDURES, NEC",029,OTHER PERCUTANEOUS INTRACRANIAL PROCEDURES,01,DISEASES AND DISORDERS OF THE NERVOUS SYSTEM,1,Minor,Minor,Surgical,Private Health Insurance,,,,,N,48702.46,9455.67
New York City,Manhattan,7002053,001463,NYU Langone Hospitals,70 or Older,119,F,White,Unknown,1,Elective,Home or Self Care,2020,NVS006,OTHER SPECIFIED HEREDITARY AND DEGENERATIVE NERVOUS SYSTEM CONDITIONS,CNS012,CNS NEUROSTIMULATOR PROCEDURES,029,OTHER PERCUTANEOUS INTRACRANIAL PROCEDURES,01,DISEASES AND DISORDERS OF THE NERVOUS SYSTEM,1,Minor,Minor,Surgical,Medicare,Blue Cross/Blue Shield,,,,N,170103.21,26803.3
New York City,Manhattan,7002053,001463,NYU Langone Hospitals,0 to 17,113,M,Other Race,Spanish/Hispanic,5,Emergency,Home or Self Care,2020,INJ037,"COMPLICATION OF OTHER SURGICAL OR MEDICAL CARE, INJURY, INITIAL ENCOUNTER",GIS024,OTHER PERITONEAL CAVITY PROCEDURES,029,OTHER PERCUTANEOUS INTRACRANIAL PROCEDURES,01,DISEASES AND DISORDERS OF THE NERVOUS SYSTEM,2,Moderate,Minor,Surgical,Medicaid,,,,,Y,212145.18,52582.3
New York City,Manhattan,7002053,001463,NYU Langone Hospitals,50 to 69,124,M,White,Unknown,1,Elective,Home or Self Care,2020,NVS004,PARKINSON`S DISEASE,CNS012,CNS NEUROSTIMULATOR PROCEDURES,029,OTHER PERCUTANEOUS INTRACRANIAL PROCEDURES,01,DISEASES AND DISORDERS OF THE NERVOUS SYSTEM,1,Minor,Minor,Surgical,Medicare,,,,,N,189255,29549.09
New York City,Manhattan,7002053,001463,NYU Langone Hospitals,70 or Older,115,M,White,Not Span/Hispanic,1,Elective,Home or Self Care,2020,NVS004,PARKINSON`S DISEASE,CNS012,CNS NEUROSTIMULATOR PROCEDURES,029,OTHER PERCUTANEOUS INTRACRANIAL PROCEDURES,01,DISEASES AND DISORDERS OF THE NERVOUS SYSTEM,1,Minor,Minor,Surgical,Medicare,Blue Cross/Blue Shield,,,,N,181485.21,28318.62