Hospital Service Area,Hospital County,Operating Certificate Number,Permanent Facility Id,Facility Name,Age Group,Zip Code - 3 digits,Gender,Race,Ethnicity,Length of Stay,Type of Admission,Patient Disposition,Discharge Year,CCS Diagnosis Code,CCS Diagnosis Description,CCS Procedure Code,CCS Procedure Description,APR DRG Code,APR DRG Description,APR MDC Code,APR MDC Description,APR Severity of Illness Code,APR Severity of Illness Description,APR Risk of Mortality,APR Medical Surgical Description,Payment Typology 1,Payment Typology 2,Payment Typology 3,Birth Weight,Abortion Edit Indicator,Emergency Department Indicator,Total Charges,Total Costs
Long Island,Suffolk,5123000,000885,Brookhaven Memorial Hospital Medical Center Inc,70 or Older,117,F,White,Not Span/Hispanic,4,Emergency,Skilled Nursing Home,2017,226,Fracture of neck of femur (hip),153,"HIP REPLACEMENT,TOT/PRT",301,Hip joint replacement,08,Diseases and Disorders of the Musculoskeletal System and Conn Tissue,3,Major,Major,Surgical,Medicare,Medicare,Private Health Insurance,,N,Y,110403.85,16107.74
Long Island,Suffolk,5123000,000885,Brookhaven Memorial Hospital Medical Center Inc,50 to 69,117,F,White,Not Span/Hispanic,6,Emergency,Skilled Nursing Home,2017,226,Fracture of neck of femur (hip),153,"HIP REPLACEMENT,TOT/PRT",301,Hip joint replacement,08,Diseases and Disorders of the Musculoskeletal System and Conn Tissue,2,Moderate,Major,Surgical,Medicare,Medicare,Private Health Insurance,,N,Y,121101.19,18596.68
Long Island,Suffolk,5123000,000885,Brookhaven Memorial Hospital Medical Center Inc,70 or Older,117,F,White,Not Span/Hispanic,4,Elective,Skilled Nursing Home,2017,203,Osteoarthritis,153,"HIP REPLACEMENT,TOT/PRT",301,Hip joint replacement,08,Diseases and Disorders of the Musculoskeletal System and Conn Tissue,2,Moderate,Moderate,Surgical,Medicare,Medicare,Private Health Insurance,,N,N,81462.70,16643.60
Long Island,Suffolk,5123000,000885,Brookhaven Memorial Hospital Medical Center Inc,50 to 69,119,M,White,Not Span/Hispanic,2,Elective,Skilled Nursing Home,2017,203,Osteoarthritis,153,"HIP REPLACEMENT,TOT/PRT",301,Hip joint replacement,08,Diseases and Disorders of the Musculoskeletal System and Conn Tissue,1,Minor,Minor,Surgical,Blue Cross/Blue Shield,,,,N,N,77360.56,15352.17
Long Island,Suffolk,5123000,000885,Brookhaven Memorial Hospital Medical Center Inc,70 or Older,117,M,White,Not Span/Hispanic,5,Emergency,Skilled Nursing Home,2017,226,Fracture of neck of femur (hip),153,"HIP REPLACEMENT,TOT/PRT",301,Hip joint replacement,08,Diseases and Disorders of the Musculoskeletal System and Conn Tissue,1,Minor,Moderate,Surgical,Medicare,Medicare,Blue Cross/Blue Shield,,N,Y,91499.99,18091.61
Long Island,Suffolk,5123000,000885,Brookhaven Memorial Hospital Medical Center Inc,70 or Older,119,F,White,Not Span/Hispanic,19,Emergency,Skilled Nursing Home,2017,226,Fracture of neck of femur (hip),153,"HIP REPLACEMENT,TOT/PRT",301,Hip joint replacement,08,Diseases and Disorders of the Musculoskeletal System and Conn Tissue,4,Extreme,Extreme,Surgical,Medicare,Medicare,Blue Cross/Blue Shield,,N,Y,193540.71,37339.09
Long Island,Suffolk,5123000,000885,Brookhaven Memorial Hospital Medical Center Inc,50 to 69,117,M,White,Not Span/Hispanic,10,Emergency,Skilled Nursing Home,2017,226,Fracture of neck of femur (hip),153,"HIP REPLACEMENT,TOT/PRT",301,Hip joint replacement,08,Diseases and Disorders of the Musculoskeletal System and Conn Tissue,1,Minor,Minor,Surgical,Medicaid,,,,N,Y,94535.37,20238.03
Long Island,Suffolk,5123000,000885,Brookhaven Memorial Hospital Medical Center Inc,70 or Older,117,M,White,Not Span/Hispanic,6,Emergency,Skilled Nursing Home,2017,226,Fracture of neck of femur (hip),153,"HIP REPLACEMENT,TOT/PRT",301,Hip joint replacement,08,Diseases and Disorders of the Musculoskeletal System and Conn Tissue,1,Minor,Moderate,Surgical,Medicare,Medicare,Private Health Insurance,,N,Y,113651.13,20862.52
Long Island,Suffolk,5123000,000885,Brookhaven Memorial Hospital Medical Center Inc,70 or Older,117,F,White,Not Span/Hispanic,4,Elective,Skilled Nursing Home,2017,203,Osteoarthritis,153,"HIP REPLACEMENT,TOT/PRT",301,Hip joint replacement,08,Diseases and Disorders of the Musculoskeletal System and Conn Tissue,1,Minor,Minor,Surgical,Medicare,Medicare,Private Health Insurance,,N,N,92972.92,18954.56
Long Island,Suffolk,5123000,000885,Brookhaven Memorial Hospital Medical Center Inc,70 or Older,117,M,White,Not Span/Hispanic,6,Emergency,Skilled Nursing Home,2017,226,Fracture of neck of femur (hip),153,"HIP REPLACEMENT,TOT/PRT",301,Hip joint replacement,08,Diseases and Disorders of the Musculoskeletal System and Conn Tissue,1,Minor,Moderate,Surgical,Medicare,Medicare,Private Health Insurance,,N,Y,101347.33,20010.46
Long Island,Suffolk,5123000,000885,Brookhaven Memorial Hospital Medical Center Inc,70 or Older,117,F,White,Not Span/Hispanic,4,Emergency,Skilled Nursing Home,2017,226,Fracture of neck of femur (hip),153,"HIP REPLACEMENT,TOT/PRT",301,Hip joint replacement,08,Diseases and Disorders of the Musculoskeletal System and Conn Tissue,1,Minor,Moderate,Surgical,Medicare,Medicare,Blue Cross/Blue Shield,,N,Y,90279.04,17663.22
Long Island,Suffolk,5123000,000885,Brookhaven Memorial Hospital Medical Center Inc,70 or Older,117,F,White,Not Span/Hispanic,5,Elective,Skilled Nursing Home,2017,203,Osteoarthritis,153,"HIP REPLACEMENT,TOT/PRT",301,Hip joint replacement,08,Diseases and Disorders of the Musculoskeletal System and Conn Tissue,3,Major,Moderate,Surgical,Medicare,Medicare,Private Health Insurance,,N,N,91290.42,18687.71
Long Island,Suffolk,5123000,000885,Brookhaven Memorial Hospital Medical Center Inc,50 to 69,117,F,White,Not Span/Hispanic,5,Elective,Home w/ Home Health Services,2017,203,Osteoarthritis,153,"HIP REPLACEMENT,TOT/PRT",301,Hip joint replacement,08,Diseases and Disorders of the Musculoskeletal System and Conn Tissue,3,Major,Extreme,Surgical,Blue Cross/Blue Shield,Medicare,Medicare,,N,N,94200.04,18218.04
Long Island,Suffolk,5123000,000885,Brookhaven Memorial Hospital Medical Center Inc,50 to 69,117,F,White,Not Span/Hispanic,11,Emergency,Skilled Nursing Home,2017,226,Fracture of neck of femur (hip),153,"HIP REPLACEMENT,TOT/PRT",301,Hip joint replacement,08,Diseases and Disorders of the Musculoskeletal System and Conn Tissue,2,Moderate,Major,Surgical,Medicare,Medicare,Medicaid,,N,Y,177441.36,34232.54
Long Island,Suffolk,5123000,000885,Brookhaven Memorial Hospital Medical Center Inc,70 or Older,117,F,White,Not Span/Hispanic,6,Emergency,Skilled Nursing Home,2017,226,Fracture of neck of femur (hip),153,"HIP REPLACEMENT,TOT/PRT",301,Hip joint replacement,08,Diseases and Disorders of the Musculoskeletal System and Conn Tissue,1,Minor,Moderate,Surgical,Medicare,,,,N,Y,85894.05,17575.35
Long Island,Suffolk,5123000,000885,Brookhaven Memorial Hospital Medical Center Inc,50 to 69,117,M,White,Not Span/Hispanic,21,Emergency,Expired,2017,226,Fracture of neck of femur (hip),153,"HIP REPLACEMENT,TOT/PRT",301,Hip joint replacement,08,Diseases and Disorders of the Musculoskeletal System and Conn Tissue,4,Extreme,Extreme,Surgical,Medicare,Medicare,,,N,Y,255406.13,49129.47
Long Island,Suffolk,5123000,000885,Brookhaven Memorial Hospital Medical Center Inc,50 to 69,119,F,White,Not Span/Hispanic,4,Elective,Home w/ Home Health Services,2017,203,Osteoarthritis,153,"HIP REPLACEMENT,TOT/PRT",301,Hip joint replacement,08,Diseases and Disorders of the Musculoskeletal System and Conn Tissue,3,Major,Major,Surgical,Private Health Insurance,,,,N,N,91592.72,18017.46
Long Island,Suffolk,5123000,000885,Brookhaven Memorial Hospital Medical Center Inc,70 or Older,117,M,White,Not Span/Hispanic,12,Elective,Skilled Nursing Home,2017,203,Osteoarthritis,153,"HIP REPLACEMENT,TOT/PRT",301,Hip joint replacement,08,Diseases and Disorders of the Musculoskeletal System and Conn Tissue,3,Major,Major,Surgical,Medicare,Medicare,Private Health Insurance,,N,N,153484.27,28755.56
Long Island,Suffolk,5123000,000885,Brookhaven Memorial Hospital Medical Center Inc,50 to 69,117,M,White,Not Span/Hispanic,12,Emergency,Skilled Nursing Home,2017,226,Fracture of neck of femur (hip),153,"HIP REPLACEMENT,TOT/PRT",301,Hip joint replacement,08,Diseases and Disorders of the Musculoskeletal System and Conn Tissue,4,Extreme,Major,Surgical,Blue Cross/Blue Shield,Medicare,Medicare,,N,Y,176916.84,31138.81
Long Island,Suffolk,5123000,000885,Brookhaven Memorial Hospital Medical Center Inc,70 or Older,119,F,White,Not Span/Hispanic,6,Elective,Skilled Nursing Home,2017,203,Osteoarthritis,153,"HIP REPLACEMENT,TOT/PRT",301,Hip joint replacement,08,Diseases and Disorders of the Musculoskeletal System and Conn Tissue,2,Moderate,Moderate,Surgical,Medicare,Medicare,Private Health Insurance,,N,N,86524.04,18432.43
Long Island,Suffolk,5123000,000885,Brookhaven Memorial Hospital Medical Center Inc,50 to 69,119,M,White,Not Span/Hispanic,5,Elective,Skilled Nursing Home,2017,203,Osteoarthritis,153,"HIP REPLACEMENT,TOT/PRT",301,Hip joint replacement,08,Diseases and Disorders of the Musculoskeletal System and Conn Tissue,2,Moderate,Minor,Surgical,Blue Cross/Blue Shield,Medicare,,,N,N,79953.91,16716.55
Long Island,Suffolk,5123000,000885,Brookhaven Memorial Hospital Medical Center Inc,70 or Older,117,F,White,Not Span/Hispanic,13,Emergency,Skilled Nursing Home,2017,226,Fracture of neck of femur (hip),153,"HIP REPLACEMENT,TOT/PRT",301,Hip joint replacement,08,Diseases and Disorders of the Musculoskeletal System and Conn Tissue,2,Moderate,Moderate,Surgical,Medicare,Medicare,,,N,Y,146234.62,28016.76
Long Island,Suffolk,5123000,000885,Brookhaven Memorial Hospital Medical Center Inc,70 or Older,117,F,White,Not Span/Hispanic,8,Emergency,Skilled Nursing Home,2017,207,Pathological fracture,153,"HIP REPLACEMENT,TOT/PRT",301,Hip joint replacement,08,Diseases and Disorders of the Musculoskeletal System and Conn Tissue,2,Moderate,Moderate,Surgical,Medicare,Medicare,Private Health Insurance,,N,Y,150644.06,25972.28
Long Island,Suffolk,5123000,000885,Brookhaven Memorial Hospital Medical Center Inc,50 to 69,117,M,White,Not Span/Hispanic,5,Elective,Skilled Nursing Home,2017,203,Osteoarthritis,153,"HIP REPLACEMENT,TOT/PRT",301,Hip joint replacement,08,Diseases and Disorders of the Musculoskeletal System and Conn Tissue,2,Moderate,Minor,Surgical,Medicare,Medicare,Blue Cross/Blue Shield,,N,N,78978.66,16285.14
Long Island,Suffolk,5123000,000885,Brookhaven Memorial Hospital Medical Center Inc,50 to 69,119,M,White,Not Span/Hispanic,4,Elective,Skilled Nursing Home,2017,212,Other bone disease and musculoskeletal deformities,153,"HIP REPLACEMENT,TOT/PRT",301,Hip joint replacement,08,Diseases and Disorders of the Musculoskeletal System and Conn Tissue,2,Moderate,Minor,Surgical,Medicare,Medicare,Private Health Insurance,,N,N,80999.61,16630.49
Long Island,Suffolk,5123000,000885,Brookhaven Memorial Hospital Medical Center Inc,50 to 69,119,M,White,Not Span/Hispanic,5,Emergency,Home w/ Home Health Services,2017,226,Fracture of neck of femur (hip),153,"HIP REPLACEMENT,TOT/PRT",301,Hip joint replacement,08,Diseases and Disorders of the Musculoskeletal System and Conn Tissue,1,Minor,Moderate,Surgical,Private Health Insurance,,,,N,Y,103034.50,17521.45
Long Island,Suffolk,5123000,000885,Brookhaven Memorial Hospital Medical Center Inc,70 or Older,117,M,Black/African American,Not Span/Hispanic,4,Emergency,Skilled Nursing Home,2017,226,Fracture of neck of femur (hip),153,"HIP REPLACEMENT,TOT/PRT",301,Hip joint replacement,08,Diseases and Disorders of the Musculoskeletal System and Conn Tissue,2,Moderate,Major,Surgical,Medicare,Medicare,,,N,Y,92220.12,14951.72
Long Island,Suffolk,5123000,000885,Brookhaven Memorial Hospital Medical Center Inc,70 or Older,117,F,White,Not Span/Hispanic,6,Emergency,Skilled Nursing Home,2017,226,Fracture of neck of femur (hip),153,"HIP REPLACEMENT,TOT/PRT",301,Hip joint replacement,08,Diseases and Disorders of the Musculoskeletal System and Conn Tissue,1,Minor,Moderate,Surgical,Medicare,Medicare,Medicaid,,N,Y,117009.38,19622.58
Long Island,Suffolk,5123000,000885,Brookhaven Memorial Hospital Medical Center Inc,70 or Older,117,M,White,Not Span/Hispanic,3,Elective,Skilled Nursing Home,2017,203,Osteoarthritis,153,"HIP REPLACEMENT,TOT/PRT",301,Hip joint replacement,08,Diseases and Disorders of the Musculoskeletal System and Conn Tissue,1,Minor,Minor,Surgical,Medicare,Medicare,Blue Cross/Blue Shield,,N,N,69235.23,13909.41
Long Island,Suffolk,5123000,000885,Brookhaven Memorial Hospital Medical Center Inc,70 or Older,117,F,White,Not Span/Hispanic,7,Emergency,Skilled Nursing Home,2017,226,Fracture of neck of femur (hip),153,"HIP REPLACEMENT,TOT/PRT",301,Hip joint replacement,08,Diseases and Disorders of the Musculoskeletal System and Conn Tissue,1,Minor,Minor,Surgical,Medicare,,,,N,Y,132905.59,21321.27
Long Island,Suffolk,5123000,000885,Brookhaven Memorial Hospital Medical Center Inc,50 to 69,119,F,Black/African American,Not Span/Hispanic,4,Elective,Skilled Nursing Home,2017,203,Osteoarthritis,153,"HIP REPLACEMENT,TOT/PRT",301,Hip joint replacement,08,Diseases and Disorders of the Musculoskeletal System and Conn Tissue,2,Moderate,Minor,Surgical,Medicare,Medicare,Medicaid,,N,N,76130.71,15565.17
Long Island,Suffolk,5123000,000885,Brookhaven Memorial Hospital Medical Center Inc,70 or Older,117,F,White,Not Span/Hispanic,13,Emergency,Skilled Nursing Home,2017,226,Fracture of neck of femur (hip),153,"HIP REPLACEMENT,TOT/PRT",301,Hip joint replacement,08,Diseases and Disorders of the Musculoskeletal System and Conn Tissue,2,Moderate,Major,Surgical,Medicare,Medicare,Blue Cross/Blue Shield,,N,Y,136767.47,25975.68
Long Island,Suffolk,5123000,000885,Brookhaven Memorial Hospital Medical Center Inc,70 or Older,117,F,White,Not Span/Hispanic,7,Emergency,Skilled Nursing Home,2017,212,Other bone disease and musculoskeletal deformities,153,"HIP REPLACEMENT,TOT/PRT",301,Hip joint replacement,08,Diseases and Disorders of the Musculoskeletal System and Conn Tissue,3,Major,Moderate,Surgical,Medicare,Medicare,Blue Cross/Blue Shield,,N,Y,96621.13,19765.15
Long Island,Suffolk,5123000,000885,Brookhaven Memorial Hospital Medical Center Inc,50 to 69,117,M,White,Not Span/Hispanic,5,Elective,Skilled Nursing Home,2017,203,Osteoarthritis,153,"HIP REPLACEMENT,TOT/PRT",301,Hip joint replacement,08,Diseases and Disorders of the Musculoskeletal System and Conn Tissue,1,Minor,Minor,Surgical,Medicare,Medicare,,,N,N,80733.42,16910.96
Long Island,Suffolk,5123000,000885,Brookhaven Memorial Hospital Medical Center Inc,70 or Older,117,M,White,Not Span/Hispanic,9,Emergency,Skilled Nursing Home,2017,226,Fracture of neck of femur (hip),153,"HIP REPLACEMENT,TOT/PRT",301,Hip joint replacement,08,Diseases and Disorders of the Musculoskeletal System and Conn Tissue,2,Moderate,Major,Surgical,Medicare,Medicare,Private Health Insurance,,N,Y,104974.57,17966.14
Long Island,Suffolk,5123000,000885,Brookhaven Memorial Hospital Medical Center Inc,70 or Older,117,F,White,Not Span/Hispanic,6,Emergency,Skilled Nursing Home,2017,207,Pathological fracture,153,"HIP REPLACEMENT,TOT/PRT",301,Hip joint replacement,08,Diseases and Disorders of the Musculoskeletal System and Conn Tissue,1,Minor,Minor,Surgical,Medicare,Medicare,Private Health Insurance,,N,Y,110244.44,17864.47
Long Island,Suffolk,5123000,000885,Brookhaven Memorial Hospital Medical Center Inc,70 or Older,117,M,White,Not Span/Hispanic,13,Emergency,Skilled Nursing Home,2017,226,Fracture of neck of femur (hip),153,"HIP REPLACEMENT,TOT/PRT",301,Hip joint replacement,08,Diseases and Disorders of the Musculoskeletal System and Conn Tissue,2,Moderate,Major,Surgical,Medicare,Medicare,,,N,Y,148826.40,28168.40
Long Island,Suffolk,5123000,000885,Brookhaven Memorial Hospital Medical Center Inc,70 or Older,117,F,White,Not Span/Hispanic,11,Emergency,Skilled Nursing Home,2017,226,Fracture of neck of femur (hip),153,"HIP REPLACEMENT,TOT/PRT",301,Hip joint replacement,08,Diseases and Disorders of the Musculoskeletal System and Conn Tissue,2,Moderate,Major,Surgical,Medicare,Medicare,Private Health Insurance,,N,Y,155966.26,25975.84
Long Island,Suffolk,5123000,000885,Brookhaven Memorial Hospital Medical Center Inc,50 to 69,119,M,Black/African American,Not Span/Hispanic,7,Elective,Skilled Nursing Home,2017,203,Osteoarthritis,153,"HIP REPLACEMENT,TOT/PRT",301,Hip joint replacement,08,Diseases and Disorders of the Musculoskeletal System and Conn Tissue,1,Minor,Minor,Surgical,Private Health Insurance,,,,N,N,89553.61,19191.34
Long Island,Suffolk,5123000,000885,Brookhaven Memorial Hospital Medical Center Inc,70 or Older,117,F,White,Not Span/Hispanic,7,Emergency,Skilled Nursing Home,2017,226,Fracture of neck of femur (hip),153,"HIP REPLACEMENT,TOT/PRT",301,Hip joint replacement,08,Diseases and Disorders of the Musculoskeletal System and Conn Tissue,1,Minor,Moderate,Surgical,Medicare,,,,N,Y,115072.64,19986.87
Long Island,Suffolk,5123000,000885,Brookhaven Memorial Hospital Medical Center Inc,70 or Older,119,F,White,Not Span/Hispanic,4,Emergency,Skilled Nursing Home,2017,226,Fracture of neck of femur (hip),153,"HIP REPLACEMENT,TOT/PRT",301,Hip joint replacement,08,Diseases and Disorders of the Musculoskeletal System and Conn Tissue,1,Minor,Minor,Surgical,Medicare,Medicare,Blue Cross/Blue Shield,,N,Y,103555.22,17169.18
Long Island,Suffolk,5123000,000885,Brookhaven Memorial Hospital Medical Center Inc,70 or Older,117,F,White,Not Span/Hispanic,6,Emergency,Skilled Nursing Home,2017,226,Fracture of neck of femur (hip),153,"HIP REPLACEMENT,TOT/PRT",301,Hip joint replacement,08,Diseases and Disorders of the Musculoskeletal System and Conn Tissue,1,Minor,Moderate,Surgical,Medicare,Medicare,Medicaid,,N,Y,102731.24,17667.08
Long Island,Suffolk,5123000,000885,Brookhaven Memorial Hospital Medical Center Inc,70 or Older,117,F,White,Not Span/Hispanic,5,Emergency,Skilled Nursing Home,2017,226,Fracture of neck of femur (hip),153,"HIP REPLACEMENT,TOT/PRT",301,Hip joint replacement,08,Diseases and Disorders of the Musculoskeletal System and Conn Tissue,1,Minor,Moderate,Surgical,Medicare,Medicare,Private Health Insurance,,N,Y,105452.71,16849.01
Long Island,Suffolk,5123000,000885,Brookhaven Memorial Hospital Medical Center Inc,70 or Older,117,M,White,Not Span/Hispanic,5,Emergency,Skilled Nursing Home,2017,226,Fracture of neck of femur (hip),153,"HIP REPLACEMENT,TOT/PRT",301,Hip joint replacement,08,Diseases and Disorders of the Musculoskeletal System and Conn Tissue,1,Minor,Moderate,Surgical,Medicare,Medicare,Private Health Insurance,,N,Y,106436.54,16507.92
Long Island,Suffolk,5123000,000885,Brookhaven Memorial Hospital Medical Center Inc,70 or Older,119,M,White,Not Span/Hispanic,15,Emergency,Skilled Nursing Home,2017,226,Fracture of neck of femur (hip),153,"HIP REPLACEMENT,TOT/PRT",301,Hip joint replacement,08,Diseases and Disorders of the Musculoskeletal System and Conn Tissue,4,Extreme,Extreme,Surgical,Medicare,Medicare,Private Health Insurance,,N,Y,227655.57,41931.65
Long Island,Suffolk,5123000,000885,Brookhaven Memorial Hospital Medical Center Inc,50 to 69,117,M,White,Not Span/Hispanic,4,Elective,Skilled Nursing Home,2017,203,Osteoarthritis,153,"HIP REPLACEMENT,TOT/PRT",301,Hip joint replacement,08,Diseases and Disorders of the Musculoskeletal System and Conn Tissue,2,Moderate,Minor,Surgical,Medicare,Medicare,Blue Cross/Blue Shield,,N,N,82298.56,16877.67
Long Island,Suffolk,5123000,000885,Brookhaven Memorial Hospital Medical Center Inc,50 to 69,117,M,White,Not Span/Hispanic,5,Elective,Skilled Nursing Home,2017,203,Osteoarthritis,153,"HIP REPLACEMENT,TOT/PRT",301,Hip joint replacement,08,Diseases and Disorders of the Musculoskeletal System and Conn Tissue,2,Moderate,Moderate,Surgical,Private Health Insurance,Medicaid,,,N,N,91748.49,19333.15
Long Island,Suffolk,5123000,000885,Brookhaven Memorial Hospital Medical Center Inc,70 or Older,117,F,White,Not Span/Hispanic,4,Elective,Skilled Nursing Home,2017,203,Osteoarthritis,153,"HIP REPLACEMENT,TOT/PRT",301,Hip joint replacement,08,Diseases and Disorders of the Musculoskeletal System and Conn Tissue,2,Moderate,Minor,Surgical,Medicare,Medicare,Private Health Insurance,,N,N,78750.94,16237.76
Long Island,Suffolk,5123000,000885,Brookhaven Memorial Hospital Medical Center Inc,70 or Older,117,F,White,Not Span/Hispanic,8,Emergency,Skilled Nursing Home,2017,226,Fracture of neck of femur (hip),153,"HIP REPLACEMENT,TOT/PRT",301,Hip joint replacement,08,Diseases and Disorders of the Musculoskeletal System and Conn Tissue,2,Moderate,Major,Surgical,Medicare,Medicare,Medicaid,,N,Y,112400.31,19800.47
Long Island,Suffolk,5123000,000885,Brookhaven Memorial Hospital Medical Center Inc,70 or Older,117,F,White,Not Span/Hispanic,6,Emergency,Skilled Nursing Home,2017,226,Fracture of neck of femur (hip),153,"HIP REPLACEMENT,TOT/PRT",301,Hip joint replacement,08,Diseases and Disorders of the Musculoskeletal System and Conn Tissue,1,Minor,Moderate,Surgical,Medicare,Medicare,,,N,Y,105742.78,17310.86
Long Island,Suffolk,5123000,000885,Brookhaven Memorial Hospital Medical Center Inc,70 or Older,117,F,White,Not Span/Hispanic,7,Emergency,Skilled Nursing Home,2017,226,Fracture of neck of femur (hip),153,"HIP REPLACEMENT,TOT/PRT",301,Hip joint replacement,08,Diseases and Disorders of the Musculoskeletal System and Conn Tissue,1,Minor,Major,Surgical,Medicare,Medicare,Private Health Insurance,,N,Y,131101.66,22598.64
Long Island,Suffolk,5123000,000885,Brookhaven Memorial Hospital Medical Center Inc,50 to 69,117,F,White,Not Span/Hispanic,8,Emergency,Inpatient Rehabilitation Facility,2017,226,Fracture of neck of femur (hip),153,"HIP REPLACEMENT,TOT/PRT",301,Hip joint replacement,08,Diseases and Disorders of the Musculoskeletal System and Conn Tissue,1,Minor,Minor,Surgical,Private Health Insurance,,,,N,Y,135928.40,22192.97
Long Island,Suffolk,5123000,000885,Brookhaven Memorial Hospital Medical Center Inc,70 or Older,117,F,White,Not Span/Hispanic,7,Emergency,Skilled Nursing Home,2017,226,Fracture of neck of femur (hip),153,"HIP REPLACEMENT,TOT/PRT",301,Hip joint replacement,08,Diseases and Disorders of the Musculoskeletal System and Conn Tissue,2,Moderate,Major,Surgical,Medicare,Medicare,Blue Cross/Blue Shield,,N,Y,151208.40,23196.85
Long Island,Suffolk,5123000,000885,Brookhaven Memorial Hospital Medical Center Inc,70 or Older,117,M,White,Not Span/Hispanic,21,Elective,Skilled Nursing Home,2017,206,Osteoporosis,153,"HIP REPLACEMENT,TOT/PRT",301,Hip joint replacement,08,Diseases and Disorders of the Musculoskeletal System and Conn Tissue,3,Major,Major,Surgical,Medicare,Medicare,Medicaid,,N,N,155839.19,35716.12
Long Island,Suffolk,5123000,000885,Brookhaven Memorial Hospital Medical Center Inc,70 or Older,117,F,White,Not Span/Hispanic,4,Elective,Skilled Nursing Home,2017,203,Osteoarthritis,153,"HIP REPLACEMENT,TOT/PRT",301,Hip joint replacement,08,Diseases and Disorders of the Musculoskeletal System and Conn Tissue,1,Minor,Moderate,Surgical,Medicare,Medicare,,,N,N,83304.90,16826.84
Long Island,Suffolk,5123000,000885,Brookhaven Memorial Hospital Medical Center Inc,50 to 69,117,M,White,Not Span/Hispanic,5,Emergency,Skilled Nursing Home,2017,226,Fracture of neck of femur (hip),153,"HIP REPLACEMENT,TOT/PRT",301,Hip joint replacement,08,Diseases and Disorders of the Musculoskeletal System and Conn Tissue,1,Minor,Minor,Surgical,Medicare,Medicare,,,N,Y,112080.76,17591.87
Long Island,Suffolk,5123000,000885,Brookhaven Memorial Hospital Medical Center Inc,70 or Older,117,F,White,Not Span/Hispanic,14,Emergency,Skilled Nursing Home,2017,226,Fracture of neck of femur (hip),153,"HIP REPLACEMENT,TOT/PRT",301,Hip joint replacement,08,Diseases and Disorders of the Musculoskeletal System and Conn Tissue,2,Moderate,Major,Surgical,Medicare,Medicare,Medicaid,,N,Y,167286.28,29187.60