Hospital Service Area,Hospital County,Operating Certificate Number,Permanent Facility Id,Facility Name,Age Group,Zip Code - 3 digits,Gender,Race,Ethnicity,Length of Stay,Type of Admission,Patient Disposition,Discharge Year,CCS Diagnosis Code,CCS Diagnosis Description,CCS Procedure Code,CCS Procedure Description,APR DRG Code,APR DRG Description,APR MDC Code,APR MDC Description,APR Severity of Illness Code,APR Severity of Illness Description,APR Risk of Mortality,APR Medical Surgical Description,Payment Typology 1,Payment Typology 2,Payment Typology 3,Birth Weight,Abortion Edit Indicator,Emergency Department Indicator,Total Charges,Total Costs
New York City,Kings,7002053,001304,NYU Langone Hospital-Brooklyn,30 to 49,112,F,White,Not Span/Hispanic,2,Elective,Home w/ Home Health Services,2019,MUS006,OSTEOARTHRITIS,MST007,HIP ARTHROPLASTY,301,HIP JOINT REPLACEMENT,08,DISEASES AND DISORDERS OF THE MUSCULOSKELETAL SYSTEM AND CONNECTIVE TISSUE,1,Minor,Minor,Surgical,Medicaid,,,,,false,115118.32,20886.21
New York City,Kings,7002053,001304,NYU Langone Hospital-Brooklyn,30 to 49,112,F,Other Race,Spanish/Hispanic,4,Elective,Home w/ Home Health Services,2019,MUS006,OSTEOARTHRITIS,MST007,HIP ARTHROPLASTY,301,HIP JOINT REPLACEMENT,08,DISEASES AND DISORDERS OF THE MUSCULOSKELETAL SYSTEM AND CONNECTIVE TISSUE,3,Major,Minor,Surgical,Medicare,Medicaid,,,,false,159743.93,31686.73
New York City,Kings,7002053,001304,NYU Langone Hospital-Brooklyn,50 to 69,112,M,White,Not Span/Hispanic,2,Elective,Skilled Nursing Home,2019,MUS006,OSTEOARTHRITIS,MST007,HIP ARTHROPLASTY,301,HIP JOINT REPLACEMENT,08,DISEASES AND DISORDERS OF THE MUSCULOSKELETAL SYSTEM AND CONNECTIVE TISSUE,2,Moderate,Moderate,Surgical,Medicaid,,,,,false,112477.97,20502.75
New York City,Kings,7002053,001304,NYU Langone Hospital-Brooklyn,50 to 69,112,F,White,Not Span/Hispanic,2,Elective,Home w/ Home Health Services,2019,MUS006,OSTEOARTHRITIS,MST007,HIP ARTHROPLASTY,301,HIP JOINT REPLACEMENT,08,DISEASES AND DISORDERS OF THE MUSCULOSKELETAL SYSTEM AND CONNECTIVE TISSUE,1,Minor,Minor,Surgical,Medicaid,,,,,false,154884.88,26769.07
New York City,Kings,7002053,001304,NYU Langone Hospital-Brooklyn,50 to 69,112,F,Black/African American,Not Span/Hispanic,3,Elective,Home w/ Home Health Services,2019,MUS006,OSTEOARTHRITIS,MST007,HIP ARTHROPLASTY,301,HIP JOINT REPLACEMENT,08,DISEASES AND DISORDERS OF THE MUSCULOSKELETAL SYSTEM AND CONNECTIVE TISSUE,2,Moderate,Minor,Surgical,Private Health Insurance,,,,,false,99453.2,21242.89
New York City,Kings,7002053,001304,NYU Langone Hospital-Brooklyn,18 to 29,112,M,White,Not Span/Hispanic,2,Elective,Home w/ Home Health Services,2019,MUS006,OSTEOARTHRITIS,MST007,HIP ARTHROPLASTY,301,HIP JOINT REPLACEMENT,08,DISEASES AND DISORDERS OF THE MUSCULOSKELETAL SYSTEM AND CONNECTIVE TISSUE,2,Moderate,Minor,Surgical,Medicaid,,,,,false,105463.98,19335.4
New York City,Kings,7002053,001304,NYU Langone Hospital-Brooklyn,70 or Older,112,F,White,Not Span/Hispanic,3,Elective,Home w/ Home Health Services,2019,MUS006,OSTEOARTHRITIS,MST007,HIP ARTHROPLASTY,301,HIP JOINT REPLACEMENT,08,DISEASES AND DISORDERS OF THE MUSCULOSKELETAL SYSTEM AND CONNECTIVE TISSUE,2,Moderate,Minor,Surgical,Medicare,Blue Cross/Blue Shield,,,,false,147512.5,27965.35
New York City,Kings,7002053,001304,NYU Langone Hospital-Brooklyn,70 or Older,112,F,White,Unknown,5,Emergency,Skilled Nursing Home,2019,INJ006,"FRACTURE OF THE NECK OF THE FEMUR (HIP), INITIAL ENCOUNTER",MST007,HIP ARTHROPLASTY,301,HIP JOINT REPLACEMENT,08,DISEASES AND DISORDERS OF THE MUSCULOSKELETAL SYSTEM AND CONNECTIVE TISSUE,2,Moderate,Major,Surgical,Medicaid,,,,,true,207589.3,45084.07
New York City,Kings,7002053,001304,NYU Langone Hospital-Brooklyn,70 or Older,112,F,Other Race,Unknown,3,Elective,Skilled Nursing Home,2019,MUS006,OSTEOARTHRITIS,MST007,HIP ARTHROPLASTY,301,HIP JOINT REPLACEMENT,08,DISEASES AND DISORDERS OF THE MUSCULOSKELETAL SYSTEM AND CONNECTIVE TISSUE,2,Moderate,Minor,Surgical,Medicaid,,,,,false,106971.35,21611.89
New York City,Kings,7002053,001304,NYU Langone Hospital-Brooklyn,70 or Older,112,F,Black/African American,Not Span/Hispanic,3,Elective,Skilled Nursing Home,2019,MUS006,OSTEOARTHRITIS,MST007,HIP ARTHROPLASTY,301,HIP JOINT REPLACEMENT,08,DISEASES AND DISORDERS OF THE MUSCULOSKELETAL SYSTEM AND CONNECTIVE TISSUE,3,Major,Moderate,Surgical,Medicare,Medicaid,,,,false,113917.95,23455.14
New York City,Kings,7002053,001304,NYU Langone Hospital-Brooklyn,70 or Older,112,M,White,Not Span/Hispanic,3,Elective,Home w/ Home Health Services,2019,MUS006,OSTEOARTHRITIS,MST007,HIP ARTHROPLASTY,301,HIP JOINT REPLACEMENT,08,DISEASES AND DISORDERS OF THE MUSCULOSKELETAL SYSTEM AND CONNECTIVE TISSUE,1,Minor,Minor,Surgical,Medicare,Medicaid,,,,false,136478.32,26074.04
New York City,Kings,7002053,001304,NYU Langone Hospital-Brooklyn,70 or Older,112,M,White,Not Span/Hispanic,3,Elective,Home w/ Home Health Services,2019,MUS006,OSTEOARTHRITIS,MST007,HIP ARTHROPLASTY,301,HIP JOINT REPLACEMENT,08,DISEASES AND DISORDERS OF THE MUSCULOSKELETAL SYSTEM AND CONNECTIVE TISSUE,2,Moderate,Major,Surgical,Medicare,Medicaid,,,,false,96223.77,20350.86
New York City,Kings,7002053,001304,NYU Langone Hospital-Brooklyn,70 or Older,112,F,White,Not Span/Hispanic,6,Elective,Home w/ Home Health Services,2019,MUS006,OSTEOARTHRITIS,MST007,HIP ARTHROPLASTY,301,HIP JOINT REPLACEMENT,08,DISEASES AND DISORDERS OF THE MUSCULOSKELETAL SYSTEM AND CONNECTIVE TISSUE,2,Moderate,Major,Surgical,Medicare,Private Health Insurance,,,,false,136237.62,33408.88
New York City,Kings,7002053,001304,NYU Langone Hospital-Brooklyn,50 to 69,112,F,White,Spanish/Hispanic,1,Elective,Skilled Nursing Home,2019,MUS006,OSTEOARTHRITIS,MST007,HIP ARTHROPLASTY,301,HIP JOINT REPLACEMENT,08,DISEASES AND DISORDERS OF THE MUSCULOSKELETAL SYSTEM AND CONNECTIVE TISSUE,3,Major,Minor,Surgical,Medicare,Blue Cross/Blue Shield,Medicare,,,false,96516.79,15879.96
New York City,Kings,7002053,001304,NYU Langone Hospital-Brooklyn,50 to 69,112,M,Black/African American,Not Span/Hispanic,3,Elective,Home w/ Home Health Services,2019,MUS006,OSTEOARTHRITIS,MST007,HIP ARTHROPLASTY,301,HIP JOINT REPLACEMENT,08,DISEASES AND DISORDERS OF THE MUSCULOSKELETAL SYSTEM AND CONNECTIVE TISSUE,2,Moderate,Minor,Surgical,Private Health Insurance,,,,,false,141396.16,26940.8
New York City,Kings,7002053,001304,NYU Langone Hospital-Brooklyn,70 or Older,112,F,White,Not Span/Hispanic,2,Elective,Skilled Nursing Home,2019,MUS006,OSTEOARTHRITIS,MST007,HIP ARTHROPLASTY,301,HIP JOINT REPLACEMENT,08,DISEASES AND DISORDERS OF THE MUSCULOSKELETAL SYSTEM AND CONNECTIVE TISSUE,2,Moderate,Minor,Surgical,Medicare,Private Health Insurance,,,,false,100700.82,18630.73
New York City,Kings,7002053,001304,NYU Langone Hospital-Brooklyn,50 to 69,112,M,White,Not Span/Hispanic,2,Elective,Home w/ Home Health Services,2019,MUS006,OSTEOARTHRITIS,MST007,HIP ARTHROPLASTY,301,HIP JOINT REPLACEMENT,08,DISEASES AND DISORDERS OF THE MUSCULOSKELETAL SYSTEM AND CONNECTIVE TISSUE,2,Moderate,Minor,Surgical,Private Health Insurance,,,,,false,129612.82,23106.58
New York City,Kings,7002053,001304,NYU Langone Hospital-Brooklyn,70 or Older,112,F,White,Not Span/Hispanic,5,Emergency,Skilled Nursing Home,2019,MUS013,OSTEOPOROSIS,MST007,HIP ARTHROPLASTY,301,HIP JOINT REPLACEMENT,08,DISEASES AND DISORDERS OF THE MUSCULOSKELETAL SYSTEM AND CONNECTIVE TISSUE,2,Moderate,Major,Surgical,Medicare,Medicaid,,,,true,130076.71,29456.01
New York City,Kings,7002053,001304,NYU Langone Hospital-Brooklyn,70 or Older,112,M,Other Race,Not Span/Hispanic,15,Emergency,Skilled Nursing Home,2019,INJ006,"FRACTURE OF THE NECK OF THE FEMUR (HIP), INITIAL ENCOUNTER",MST007,HIP ARTHROPLASTY,301,HIP JOINT REPLACEMENT,08,DISEASES AND DISORDERS OF THE MUSCULOSKELETAL SYSTEM AND CONNECTIVE TISSUE,2,Moderate,Major,Surgical,Medicare,,,,,true,207590.84,63653.71
New York City,Kings,7002053,001304,NYU Langone Hospital-Brooklyn,50 to 69,112,M,Other Race,Not Span/Hispanic,8,Emergency,Inpatient Rehabilitation Facility,2019,MUS013,OSTEOPOROSIS,MST007,HIP ARTHROPLASTY,301,HIP JOINT REPLACEMENT,08,DISEASES AND DISORDERS OF THE MUSCULOSKELETAL SYSTEM AND CONNECTIVE TISSUE,2,Moderate,Major,Surgical,Medicare,Medicaid,,,,true,163182.57,40769.52
New York City,Kings,7002053,001304,NYU Langone Hospital-Brooklyn,70 or Older,112,M,White,Not Span/Hispanic,2,Elective,Home w/ Home Health Services,2019,MUS006,OSTEOARTHRITIS,MST007,HIP ARTHROPLASTY,301,HIP JOINT REPLACEMENT,08,DISEASES AND DISORDERS OF THE MUSCULOSKELETAL SYSTEM AND CONNECTIVE TISSUE,2,Moderate,Moderate,Surgical,Medicaid,,,,,false,121606.73,21919.84
New York City,Kings,7002053,001304,NYU Langone Hospital-Brooklyn,50 to 69,112,F,White,Not Span/Hispanic,2,Elective,Home w/ Home Health Services,2019,MUS006,OSTEOARTHRITIS,MST007,HIP ARTHROPLASTY,301,HIP JOINT REPLACEMENT,08,DISEASES AND DISORDERS OF THE MUSCULOSKELETAL SYSTEM AND CONNECTIVE TISSUE,2,Moderate,Moderate,Surgical,Medicaid,,,,,false,125612.27,22233.33
New York City,Kings,7002053,001304,NYU Langone Hospital-Brooklyn,30 to 49,112,F,White,Not Span/Hispanic,2,Elective,Home w/ Home Health Services,2019,MUS006,OSTEOARTHRITIS,MST007,HIP ARTHROPLASTY,301,HIP JOINT REPLACEMENT,08,DISEASES AND DISORDERS OF THE MUSCULOSKELETAL SYSTEM AND CONNECTIVE TISSUE,1,Minor,Minor,Surgical,Blue Cross/Blue Shield,Medicaid,,,,false,112207.66,20522.02
New York City,Kings,7002053,001304,NYU Langone Hospital-Brooklyn,70 or Older,112,M,Black/African American,Not Span/Hispanic,1,Elective,Home w/ Home Health Services,2019,INJ035,"COMPLICATION OF INTERNAL ORTHOPEDIC DEVICE OR IMPLANT, INITIAL ENCOUNTER",MST007,HIP ARTHROPLASTY,301,HIP JOINT REPLACEMENT,08,DISEASES AND DISORDERS OF THE MUSCULOSKELETAL SYSTEM AND CONNECTIVE TISSUE,1,Minor,Moderate,Surgical,Medicaid,,,,,false,97714.12,15858.18
New York City,Kings,7002053,001304,NYU Langone Hospital-Brooklyn,70 or Older,112,F,White,Spanish/Hispanic,4,Elective,Home w/ Home Health Services,2019,MUS006,OSTEOARTHRITIS,MST007,HIP ARTHROPLASTY,301,HIP JOINT REPLACEMENT,08,DISEASES AND DISORDERS OF THE MUSCULOSKELETAL SYSTEM AND CONNECTIVE TISSUE,3,Major,Moderate,Surgical,Medicaid,,,,,false,123151.03,25746.65
New York City,Kings,7002053,001304,NYU Langone Hospital-Brooklyn,70 or Older,112,F,Other Race,Spanish/Hispanic,2,Elective,Skilled Nursing Home,2019,MUS006,OSTEOARTHRITIS,MST007,HIP ARTHROPLASTY,301,HIP JOINT REPLACEMENT,08,DISEASES AND DISORDERS OF THE MUSCULOSKELETAL SYSTEM AND CONNECTIVE TISSUE,2,Moderate,Minor,Surgical,Medicare,,,,,false,100783.39,18554.96
New York City,Kings,7002053,001304,NYU Langone Hospital-Brooklyn,70 or Older,112,F,White,Not Span/Hispanic,3,Elective,Home w/ Home Health Services,2019,MUS006,OSTEOARTHRITIS,MST007,HIP ARTHROPLASTY,301,HIP JOINT REPLACEMENT,08,DISEASES AND DISORDERS OF THE MUSCULOSKELETAL SYSTEM AND CONNECTIVE TISSUE,2,Moderate,Moderate,Surgical,Medicare,Medicaid,,,,false,144893.75,27582.71
New York City,Kings,7002053,001304,NYU Langone Hospital-Brooklyn,70 or Older,112,F,White,Not Span/Hispanic,5,Elective,Home w/ Home Health Services,2019,MUS006,OSTEOARTHRITIS,MST007,HIP ARTHROPLASTY,301,HIP JOINT REPLACEMENT,08,DISEASES AND DISORDERS OF THE MUSCULOSKELETAL SYSTEM AND CONNECTIVE TISSUE,2,Moderate,Moderate,Surgical,Medicare,Blue Cross/Blue Shield,,,,false,131201.82,29959.72
New York City,Kings,7002053,001304,NYU Langone Hospital-Brooklyn,70 or Older,112,F,White,Not Span/Hispanic,2,Elective,Home w/ Home Health Services,2019,MUS006,OSTEOARTHRITIS,MST007,HIP ARTHROPLASTY,301,HIP JOINT REPLACEMENT,08,DISEASES AND DISORDERS OF THE MUSCULOSKELETAL SYSTEM AND CONNECTIVE TISSUE,2,Moderate,Minor,Surgical,Medicare,Medicaid,,,,false,136135.6,24015.6
New York City,Kings,7002053,001304,NYU Langone Hospital-Brooklyn,50 to 69,112,M,Black/African American,Not Span/Hispanic,5,Emergency,Skilled Nursing Home,2019,MUS013,OSTEOPOROSIS,MST007,HIP ARTHROPLASTY,301,HIP JOINT REPLACEMENT,08,DISEASES AND DISORDERS OF THE MUSCULOSKELETAL SYSTEM AND CONNECTIVE TISSUE,1,Minor,Moderate,Surgical,Medicare,,,,,true,184175.56,52063.21
New York City,Kings,7002053,001304,NYU Langone Hospital-Brooklyn,70 or Older,112,F,White,Not Span/Hispanic,4,Emergency,Skilled Nursing Home,2019,MUS013,OSTEOPOROSIS,MST007,HIP ARTHROPLASTY,301,HIP JOINT REPLACEMENT,08,DISEASES AND DISORDERS OF THE MUSCULOSKELETAL SYSTEM AND CONNECTIVE TISSUE,1,Minor,Moderate,Surgical,Medicare,Blue Cross/Blue Shield,,,,true,139276.79,29543.04
New York City,Kings,7002053,001304,NYU Langone Hospital-Brooklyn,70 or Older,,F,White,Not Span/Hispanic,5,Elective,Home w/ Home Health Services,2019,MUS006,OSTEOARTHRITIS,MST007,HIP ARTHROPLASTY,301,HIP JOINT REPLACEMENT,08,DISEASES AND DISORDERS OF THE MUSCULOSKELETAL SYSTEM AND CONNECTIVE TISSUE,2,Moderate,Moderate,Surgical,Medicare,Blue Cross/Blue Shield,,,,false,126092.61,29235.87
New York City,Kings,7002053,001304,NYU Langone Hospital-Brooklyn,70 or Older,112,F,White,Not Span/Hispanic,5,Emergency,Skilled Nursing Home,2019,INJ035,"COMPLICATION OF INTERNAL ORTHOPEDIC DEVICE OR IMPLANT, INITIAL ENCOUNTER",MST007,HIP ARTHROPLASTY,301,HIP JOINT REPLACEMENT,08,DISEASES AND DISORDERS OF THE MUSCULOSKELETAL SYSTEM AND CONNECTIVE TISSUE,2,Moderate,Minor,Surgical,Medicare,Medicare,,,,true,189227.58,38119.92
New York City,Kings,7002053,001304,NYU Langone Hospital-Brooklyn,70 or Older,112,M,White,Not Span/Hispanic,11,Emergency,Skilled Nursing Home,2019,MUS001,INFECTIVE ARTHRITIS,MST007,HIP ARTHROPLASTY,301,HIP JOINT REPLACEMENT,08,DISEASES AND DISORDERS OF THE MUSCULOSKELETAL SYSTEM AND CONNECTIVE TISSUE,2,Moderate,Moderate,Surgical,Medicare,Medicaid,,,,true,175851.68,49926.95
New York City,Kings,7002053,001304,NYU Langone Hospital-Brooklyn,50 to 69,112,F,White,Not Span/Hispanic,3,Emergency,Home w/ Home Health Services,2019,INJ006,"FRACTURE OF THE NECK OF THE FEMUR (HIP), INITIAL ENCOUNTER",MST007,HIP ARTHROPLASTY,301,HIP JOINT REPLACEMENT,08,DISEASES AND DISORDERS OF THE MUSCULOSKELETAL SYSTEM AND CONNECTIVE TISSUE,2,Moderate,Moderate,Surgical,Medicare,Medicaid,,,,true,167870.65,30249.23
New York City,Kings,7002053,001304,NYU Langone Hospital-Brooklyn,50 to 69,103,F,White,Not Span/Hispanic,1,Elective,Home w/ Home Health Services,2019,MUS006,OSTEOARTHRITIS,MST007,HIP ARTHROPLASTY,301,HIP JOINT REPLACEMENT,08,DISEASES AND DISORDERS OF THE MUSCULOSKELETAL SYSTEM AND CONNECTIVE TISSUE,2,Moderate,Minor,Surgical,Blue Cross/Blue Shield,,,,,false,101336.09,16648.26
New York City,Kings,7002053,001304,NYU Langone Hospital-Brooklyn,50 to 69,112,F,White,Not Span/Hispanic,2,Elective,Home w/ Home Health Services,2019,MUS006,OSTEOARTHRITIS,MST007,HIP ARTHROPLASTY,301,HIP JOINT REPLACEMENT,08,DISEASES AND DISORDERS OF THE MUSCULOSKELETAL SYSTEM AND CONNECTIVE TISSUE,2,Moderate,Minor,Surgical,Private Health Insurance,,,,,false,127462.8,22790.52
New York City,Kings,7002053,001304,NYU Langone Hospital-Brooklyn,70 or Older,103,F,White,Not Span/Hispanic,3,Elective,Home w/ Home Health Services,2019,MUS006,OSTEOARTHRITIS,MST007,HIP ARTHROPLASTY,301,HIP JOINT REPLACEMENT,08,DISEASES AND DISORDERS OF THE MUSCULOSKELETAL SYSTEM AND CONNECTIVE TISSUE,1,Minor,Minor,Surgical,Medicare,Medicaid,,,,false,107089.13,21959.74
New York City,Kings,7002053,001304,NYU Langone Hospital-Brooklyn,70 or Older,114,F,Black/African American,Not Span/Hispanic,5,Elective,Skilled Nursing Home,2019,MUS006,OSTEOARTHRITIS,MST007,HIP ARTHROPLASTY,301,HIP JOINT REPLACEMENT,08,DISEASES AND DISORDERS OF THE MUSCULOSKELETAL SYSTEM AND CONNECTIVE TISSUE,1,Minor,Minor,Surgical,Medicare,,,,,false,143681.01,30391.91
New York City,Kings,7002053,001304,NYU Langone Hospital-Brooklyn,50 to 69,,M,Other Race,Spanish/Hispanic,2,Elective,Home w/ Home Health Services,2019,MUS006,OSTEOARTHRITIS,MST007,HIP ARTHROPLASTY,301,HIP JOINT REPLACEMENT,08,DISEASES AND DISORDERS OF THE MUSCULOSKELETAL SYSTEM AND CONNECTIVE TISSUE,2,Moderate,Minor,Surgical,Medicaid,,,,,false,154644.6,26361.75
New York City,Kings,7002053,001304,NYU Langone Hospital-Brooklyn,70 or Older,112,F,White,Not Span/Hispanic,6,Emergency,Skilled Nursing Home,2019,INJ006,"FRACTURE OF THE NECK OF THE FEMUR (HIP), INITIAL ENCOUNTER",MST007,HIP ARTHROPLASTY,301,HIP JOINT REPLACEMENT,08,DISEASES AND DISORDERS OF THE MUSCULOSKELETAL SYSTEM AND CONNECTIVE TISSUE,2,Moderate,Major,Surgical,Medicare,Medicaid,,,,true,171902.7,37541.09
New York City,Kings,7002053,001304,NYU Langone Hospital-Brooklyn,70 or Older,112,F,White,Not Span/Hispanic,2,Elective,Skilled Nursing Home,2019,MUS006,OSTEOARTHRITIS,MST007,HIP ARTHROPLASTY,301,HIP JOINT REPLACEMENT,08,DISEASES AND DISORDERS OF THE MUSCULOSKELETAL SYSTEM AND CONNECTIVE TISSUE,2,Moderate,Minor,Surgical,Medicare,Blue Cross/Blue Shield,,,,false,138641.2,24358.96
New York City,Kings,7002053,001304,NYU Langone Hospital-Brooklyn,50 to 69,112,F,White,Not Span/Hispanic,2,Elective,Home w/ Home Health Services,2019,MUS006,OSTEOARTHRITIS,MST007,HIP ARTHROPLASTY,301,HIP JOINT REPLACEMENT,08,DISEASES AND DISORDERS OF THE MUSCULOSKELETAL SYSTEM AND CONNECTIVE TISSUE,1,Minor,Minor,Surgical,Private Health Insurance,,,,,false,108799.5,20056.74
New York City,Kings,7002053,001304,NYU Langone Hospital-Brooklyn,70 or Older,112,M,White,Not Span/Hispanic,3,Elective,Home w/ Home Health Services,2019,MUS006,OSTEOARTHRITIS,MST007,HIP ARTHROPLASTY,301,HIP JOINT REPLACEMENT,08,DISEASES AND DISORDERS OF THE MUSCULOSKELETAL SYSTEM AND CONNECTIVE TISSUE,1,Minor,Minor,Surgical,Medicare,Medicare,,,,false,98118,20626.48
New York City,Kings,7002053,001304,NYU Langone Hospital-Brooklyn,50 to 69,112,M,Black/African American,Not Span/Hispanic,3,Elective,Home w/ Home Health Services,2019,MUS006,OSTEOARTHRITIS,MST007,HIP ARTHROPLASTY,301,HIP JOINT REPLACEMENT,08,DISEASES AND DISORDERS OF THE MUSCULOSKELETAL SYSTEM AND CONNECTIVE TISSUE,2,Moderate,Minor,Surgical,Medicare,Medicaid,,,,false,171628.04,31618.59
New York City,Kings,7002053,001304,NYU Langone Hospital-Brooklyn,50 to 69,112,M,White,Not Span/Hispanic,2,Elective,Home w/ Home Health Services,2019,MUS006,OSTEOARTHRITIS,MST007,HIP ARTHROPLASTY,301,HIP JOINT REPLACEMENT,08,DISEASES AND DISORDERS OF THE MUSCULOSKELETAL SYSTEM AND CONNECTIVE TISSUE,1,Minor,Minor,Surgical,Private Health Insurance,,,,,false,126109.26,22613.64
New York City,Kings,7002053,001304,NYU Langone Hospital-Brooklyn,70 or Older,112,F,White,Not Span/Hispanic,2,Elective,Home w/ Home Health Services,2019,MUS006,OSTEOARTHRITIS,MST007,HIP ARTHROPLASTY,301,HIP JOINT REPLACEMENT,08,DISEASES AND DISORDERS OF THE MUSCULOSKELETAL SYSTEM AND CONNECTIVE TISSUE,2,Moderate,Minor,Surgical,Medicaid,,,,,false,127816.34,22521.92
New York City,Kings,7002053,001304,NYU Langone Hospital-Brooklyn,70 or Older,112,F,White,Not Span/Hispanic,6,Emergency,Skilled Nursing Home,2019,INJ043,"FRACTURE OF THE NECK OF THE FEMUR (HIP), SUBSEQUENT ENCOUNTER",MST007,HIP ARTHROPLASTY,301,HIP JOINT REPLACEMENT,08,DISEASES AND DISORDERS OF THE MUSCULOSKELETAL SYSTEM AND CONNECTIVE TISSUE,3,Major,Moderate,Surgical,Medicare,Blue Cross/Blue Shield,,,,true,151650.39,35383.17
New York City,Kings,7002053,001304,NYU Langone Hospital-Brooklyn,70 or Older,112,F,White,Not Span/Hispanic,3,Elective,Home w/ Home Health Services,2019,MUS006,OSTEOARTHRITIS,MST007,HIP ARTHROPLASTY,301,HIP JOINT REPLACEMENT,08,DISEASES AND DISORDERS OF THE MUSCULOSKELETAL SYSTEM AND CONNECTIVE TISSUE,3,Major,Major,Surgical,Medicare,,,,,false,106478.23,21916.61
New York City,Kings,7002053,001304,NYU Langone Hospital-Brooklyn,70 or Older,112,M,White,Not Span/Hispanic,2,Elective,Home w/ Home Health Services,2019,MUS030,ASEPTIC NECROSIS AND OSTEONECROSIS,MST007,HIP ARTHROPLASTY,301,HIP JOINT REPLACEMENT,08,DISEASES AND DISORDERS OF THE MUSCULOSKELETAL SYSTEM AND CONNECTIVE TISSUE,1,Minor,Moderate,Surgical,Medicare,Medicaid,,,,false,159911.93,33143.5
New York City,Kings,7002053,001304,NYU Langone Hospital-Brooklyn,50 to 69,112,F,Black/African American,Not Span/Hispanic,2,Elective,Skilled Nursing Home,2019,MUS006,OSTEOARTHRITIS,MST007,HIP ARTHROPLASTY,301,HIP JOINT REPLACEMENT,08,DISEASES AND DISORDERS OF THE MUSCULOSKELETAL SYSTEM AND CONNECTIVE TISSUE,2,Moderate,Moderate,Surgical,Medicare,Blue Cross/Blue Shield,,,,false,102415.21,19234.9
New York City,Kings,7002053,001304,NYU Langone Hospital-Brooklyn,50 to 69,112,M,White,Not Span/Hispanic,2,Elective,Home w/ Home Health Services,2019,MUS006,OSTEOARTHRITIS,MST007,HIP ARTHROPLASTY,301,HIP JOINT REPLACEMENT,08,DISEASES AND DISORDERS OF THE MUSCULOSKELETAL SYSTEM AND CONNECTIVE TISSUE,2,Moderate,Minor,Surgical,Medicare,Medicaid,,,,false,124286.03,22285.66
New York City,Kings,7002053,001304,NYU Langone Hospital-Brooklyn,50 to 69,112,M,White,Not Span/Hispanic,1,Elective,Home w/ Home Health Services,2019,MUS006,OSTEOARTHRITIS,MST007,HIP ARTHROPLASTY,301,HIP JOINT REPLACEMENT,08,DISEASES AND DISORDERS OF THE MUSCULOSKELETAL SYSTEM AND CONNECTIVE TISSUE,1,Minor,Minor,Surgical,Private Health Insurance,,,,,false,194122.64,30936.08
New York City,Kings,7002053,001304,NYU Langone Hospital-Brooklyn,50 to 69,112,M,White,Not Span/Hispanic,1,Elective,Home w/ Home Health Services,2019,MUS006,OSTEOARTHRITIS,MST007,HIP ARTHROPLASTY,301,HIP JOINT REPLACEMENT,08,DISEASES AND DISORDERS OF THE MUSCULOSKELETAL SYSTEM AND CONNECTIVE TISSUE,1,Minor,Minor,Surgical,Medicaid,,,,,false,126640.73,20365.79
New York City,Kings,7002053,001304,NYU Langone Hospital-Brooklyn,70 or Older,112,M,White,Not Span/Hispanic,2,Elective,Home w/ Home Health Services,2019,MUS006,OSTEOARTHRITIS,MST007,HIP ARTHROPLASTY,301,HIP JOINT REPLACEMENT,08,DISEASES AND DISORDERS OF THE MUSCULOSKELETAL SYSTEM AND CONNECTIVE TISSUE,2,Moderate,Moderate,Surgical,Medicare,Medicaid,,,,false,144412.08,24923.73
New York City,Kings,7002053,001304,NYU Langone Hospital-Brooklyn,50 to 69,103,M,White,Not Span/Hispanic,1,Elective,Home w/ Home Health Services,2019,MUS006,OSTEOARTHRITIS,MST007,HIP ARTHROPLASTY,301,HIP JOINT REPLACEMENT,08,DISEASES AND DISORDERS OF THE MUSCULOSKELETAL SYSTEM AND CONNECTIVE TISSUE,2,Moderate,Minor,Surgical,Private Health Insurance,,,,,false,127670.32,20546.88
New York City,Kings,7002053,001304,NYU Langone Hospital-Brooklyn,70 or Older,112,F,White,Not Span/Hispanic,4,Emergency,Skilled Nursing Home,2019,MUS013,OSTEOPOROSIS,MST007,HIP ARTHROPLASTY,301,HIP JOINT REPLACEMENT,08,DISEASES AND DISORDERS OF THE MUSCULOSKELETAL SYSTEM AND CONNECTIVE TISSUE,2,Moderate,Moderate,Surgical,Medicare,Medicare,,,,true,177826.32,34178.22
New York City,Kings,7002053,001304,NYU Langone Hospital-Brooklyn,50 to 69,113,M,White,Not Span/Hispanic,3,Elective,Skilled Nursing Home,2019,MUS006,OSTEOARTHRITIS,MST007,HIP ARTHROPLASTY,301,HIP JOINT REPLACEMENT,08,DISEASES AND DISORDERS OF THE MUSCULOSKELETAL SYSTEM AND CONNECTIVE TISSUE,2,Moderate,Minor,Surgical,Medicare,,,,,false,139349.98,26909.06
New York City,Kings,7002053,001304,NYU Langone Hospital-Brooklyn,50 to 69,103,F,White,Not Span/Hispanic,2,Elective,Home w/ Home Health Services,2019,MUS006,OSTEOARTHRITIS,MST007,HIP ARTHROPLASTY,301,HIP JOINT REPLACEMENT,08,DISEASES AND DISORDERS OF THE MUSCULOSKELETAL SYSTEM AND CONNECTIVE TISSUE,2,Moderate,Minor,Surgical,Medicare,Blue Cross/Blue Shield,,,,false,144507.84,24764.07
New York City,Kings,7002053,001304,NYU Langone Hospital-Brooklyn,70 or Older,112,F,White,Not Span/Hispanic,3,Elective,Skilled Nursing Home,2019,MUS006,OSTEOARTHRITIS,MST007,HIP ARTHROPLASTY,301,HIP JOINT REPLACEMENT,08,DISEASES AND DISORDERS OF THE MUSCULOSKELETAL SYSTEM AND CONNECTIVE TISSUE,2,Moderate,Minor,Surgical,Medicare,Medicaid,,,,false,124216.95,24427.35
New York City,Kings,7002053,001304,NYU Langone Hospital-Brooklyn,70 or Older,100,F,Other Race,Not Span/Hispanic,2,Elective,Home w/ Home Health Services,2019,MUS006,OSTEOARTHRITIS,MST007,HIP ARTHROPLASTY,301,HIP JOINT REPLACEMENT,08,DISEASES AND DISORDERS OF THE MUSCULOSKELETAL SYSTEM AND CONNECTIVE TISSUE,2,Moderate,Minor,Surgical,Medicare,,,,,false,91020.8,17379.74