Hospital Service Area,Hospital County,Operating Certificate Number,Permanent Facility Id,Facility Name,Age Group,Zip Code - 3 digits,Gender,Race,Ethnicity,Length of Stay,Type of Admission,Patient Disposition,Discharge Year,CCS Diagnosis Code,CCS Diagnosis Description,CCS Procedure Code,CCS Procedure Description,APR DRG Code,APR DRG Description,APR MDC Code,APR MDC Description,APR Severity of Illness Code,APR Severity of Illness Description,APR Risk of Mortality,APR Medical Surgical Description,Payment Typology 1,Payment Typology 2,Payment Typology 3,Birth Weight,Abortion Edit Indicator,Emergency Department Indicator,Total Charges,Total Costs
New York City,Manhattan,7002001,001438,Bellevue Hospital Center,70 or Older,,F,White,Not Span/Hispanic,18,Emergency,Home or Self Care,2019,MUS006,OSTEOARTHRITIS,MST007,HIP ARTHROPLASTY,301,HIP JOINT REPLACEMENT,08,DISEASES AND DISORDERS OF THE MUSCULOSKELETAL SYSTEM AND CONNECTIVE TISSUE,3,Major,Major,Surgical,Medicaid,,,,,false,112542.62,74795.83
New York City,Manhattan,7002001,001438,Bellevue Hospital Center,50 to 69,112,M,Black/African American,Not Span/Hispanic,3,Elective,Home or Self Care,2019,MUS006,OSTEOARTHRITIS,MST007,HIP ARTHROPLASTY,301,HIP JOINT REPLACEMENT,08,DISEASES AND DISORDERS OF THE MUSCULOSKELETAL SYSTEM AND CONNECTIVE TISSUE,1,Minor,Minor,Surgical,Medicare,Medicare,Medicaid,,,false,18351.64,12196.5
New York City,Manhattan,7002001,001438,Bellevue Hospital Center,50 to 69,112,F,Other Race,Spanish/Hispanic,3,Emergency,Home w/ Home Health Services,2019,MUS006,OSTEOARTHRITIS,MST007,HIP ARTHROPLASTY,301,HIP JOINT REPLACEMENT,08,DISEASES AND DISORDERS OF THE MUSCULOSKELETAL SYSTEM AND CONNECTIVE TISSUE,3,Major,Moderate,Surgical,Medicaid,,,,,false,23857.11,15855.44
New York City,Manhattan,7002001,001438,Bellevue Hospital Center,70 or Older,100,F,White,Not Span/Hispanic,7,Emergency,Home or Self Care,2019,INJ006,"FRACTURE OF THE NECK OF THE FEMUR (HIP), INITIAL ENCOUNTER",MST007,HIP ARTHROPLASTY,301,HIP JOINT REPLACEMENT,08,DISEASES AND DISORDERS OF THE MUSCULOSKELETAL SYSTEM AND CONNECTIVE TISSUE,1,Minor,Minor,Surgical,Medicare,Private Health Insurance,,,,true,51997.79,34557.73
New York City,Manhattan,7002001,001438,Bellevue Hospital Center,18 to 29,104,F,Other Race,Spanish/Hispanic,2,Elective,Home w/ Home Health Services,2019,MUS006,OSTEOARTHRITIS,MST007,HIP ARTHROPLASTY,301,HIP JOINT REPLACEMENT,08,DISEASES AND DISORDERS OF THE MUSCULOSKELETAL SYSTEM AND CONNECTIVE TISSUE,2,Moderate,Moderate,Surgical,Medicaid,,,,,false,14861.75,9877.12
New York City,Manhattan,7002001,001438,Bellevue Hospital Center,30 to 49,112,M,White,Not Span/Hispanic,3,Elective,Home w/ Home Health Services,2019,MUS030,ASEPTIC NECROSIS AND OSTEONECROSIS,MST007,HIP ARTHROPLASTY,301,HIP JOINT REPLACEMENT,08,DISEASES AND DISORDERS OF THE MUSCULOSKELETAL SYSTEM AND CONNECTIVE TISSUE,1,Minor,Minor,Surgical,Medicaid,Medicaid,,,,false,18302.09,12163.57
New York City,Manhattan,7002001,001438,Bellevue Hospital Center,30 to 49,113,F,Other Race,Spanish/Hispanic,1,Elective,Home or Self Care,2019,MUS006,OSTEOARTHRITIS,MST007,HIP ARTHROPLASTY,301,HIP JOINT REPLACEMENT,08,DISEASES AND DISORDERS OF THE MUSCULOSKELETAL SYSTEM AND CONNECTIVE TISSUE,1,Minor,Minor,Surgical,Private Health Insurance,,,,,false,7381.76,4905.92
New York City,Manhattan,7002001,001438,Bellevue Hospital Center,30 to 49,112,F,White,Not Span/Hispanic,2,Elective,Home or Self Care,2019,MUS006,OSTEOARTHRITIS,MST007,HIP ARTHROPLASTY,301,HIP JOINT REPLACEMENT,08,DISEASES AND DISORDERS OF THE MUSCULOSKELETAL SYSTEM AND CONNECTIVE TISSUE,1,Minor,Minor,Surgical,Medicaid,,,,,false,9943.35,6608.35
New York City,Manhattan,7002001,001438,Bellevue Hospital Center,70 or Older,100,M,White,Not Span/Hispanic,5,Elective,Home w/ Home Health Services,2019,MUS013,OSTEOPOROSIS,MST007,HIP ARTHROPLASTY,301,HIP JOINT REPLACEMENT,08,DISEASES AND DISORDERS OF THE MUSCULOSKELETAL SYSTEM AND CONNECTIVE TISSUE,3,Major,Moderate,Surgical,Medicare,,,,,true,31888.73,21193.25
New York City,Manhattan,7002001,001438,Bellevue Hospital Center,50 to 69,104,M,Black/African American,Not Span/Hispanic,4,Elective,Home w/ Home Health Services,2019,MUS006,OSTEOARTHRITIS,MST007,HIP ARTHROPLASTY,301,HIP JOINT REPLACEMENT,08,DISEASES AND DISORDERS OF THE MUSCULOSKELETAL SYSTEM AND CONNECTIVE TISSUE,1,Minor,Minor,Surgical,Medicare,Medicare,,,,false,23405.58,15555.35
New York City,Manhattan,7002001,001438,Bellevue Hospital Center,50 to 69,113,M,Other Race,Not Span/Hispanic,2,Emergency,Home or Self Care,2019,MUS006,OSTEOARTHRITIS,MST007,HIP ARTHROPLASTY,301,HIP JOINT REPLACEMENT,08,DISEASES AND DISORDERS OF THE MUSCULOSKELETAL SYSTEM AND CONNECTIVE TISSUE,1,Minor,Minor,Surgical,Medicaid,Medicaid,,,,false,11103.79,7379.58
New York City,Manhattan,7002001,001438,Bellevue Hospital Center,50 to 69,100,M,White,Not Span/Hispanic,1,Emergency,Home or Self Care,2019,MUS006,OSTEOARTHRITIS,MST007,HIP ARTHROPLASTY,301,HIP JOINT REPLACEMENT,08,DISEASES AND DISORDERS OF THE MUSCULOSKELETAL SYSTEM AND CONNECTIVE TISSUE,2,Moderate,Minor,Surgical,Medicaid,Medicaid,,,,false,8104.09,5385.98
New York City,Manhattan,7002001,001438,Bellevue Hospital Center,30 to 49,112,F,White,Not Span/Hispanic,5,Emergency,Home or Self Care,2019,MUS006,OSTEOARTHRITIS,MST007,HIP ARTHROPLASTY,301,HIP JOINT REPLACEMENT,08,DISEASES AND DISORDERS OF THE MUSCULOSKELETAL SYSTEM AND CONNECTIVE TISSUE,3,Major,Moderate,Surgical,Medicaid,,,,,false,30705.37,20406.79
New York City,Manhattan,7002001,001438,Bellevue Hospital Center,30 to 49,104,M,Other Race,Spanish/Hispanic,6,Elective,Skilled Nursing Home,2019,MUS030,ASEPTIC NECROSIS AND OSTEONECROSIS,MST007,HIP ARTHROPLASTY,301,HIP JOINT REPLACEMENT,08,DISEASES AND DISORDERS OF THE MUSCULOSKELETAL SYSTEM AND CONNECTIVE TISSUE,1,Minor,Minor,Surgical,Medicaid,Medicaid,,,,false,32751.08,21766.37
New York City,Manhattan,7002001,001438,Bellevue Hospital Center,70 or Older,100,M,Other Race,Not Span/Hispanic,5,Elective,Home w/ Home Health Services,2019,MUS006,OSTEOARTHRITIS,MST007,HIP ARTHROPLASTY,301,HIP JOINT REPLACEMENT,08,DISEASES AND DISORDERS OF THE MUSCULOSKELETAL SYSTEM AND CONNECTIVE TISSUE,3,Major,Moderate,Surgical,Medicare,,,,,false,76933.69,51130.13
New York City,Manhattan,7002001,001438,Bellevue Hospital Center,50 to 69,100,F,Black/African American,Unknown,3,Elective,Home or Self Care,2019,MUS006,OSTEOARTHRITIS,MST007,HIP ARTHROPLASTY,301,HIP JOINT REPLACEMENT,08,DISEASES AND DISORDERS OF THE MUSCULOSKELETAL SYSTEM AND CONNECTIVE TISSUE,2,Moderate,Minor,Surgical,Medicaid,,,,,false,59526.21,39561.12
New York City,Manhattan,7002001,001438,Bellevue Hospital Center,50 to 69,112,M,Black/African American,Not Span/Hispanic,2,Elective,Home or Self Care,2019,MUS006,OSTEOARTHRITIS,MST007,HIP ARTHROPLASTY,301,HIP JOINT REPLACEMENT,08,DISEASES AND DISORDERS OF THE MUSCULOSKELETAL SYSTEM AND CONNECTIVE TISSUE,2,Moderate,Minor,Surgical,Medicaid,,,,,false,45769.31,30418.28
New York City,Manhattan,7002001,001438,Bellevue Hospital Center,50 to 69,113,M,Other Race,Spanish/Hispanic,1,Elective,Home or Self Care,2019,MUS006,OSTEOARTHRITIS,MST007,HIP ARTHROPLASTY,301,HIP JOINT REPLACEMENT,08,DISEASES AND DISORDERS OF THE MUSCULOSKELETAL SYSTEM AND CONNECTIVE TISSUE,2,Moderate,Minor,Surgical,Medicaid,,,,,false,36938.63,24549.41
New York City,Manhattan,7002001,001438,Bellevue Hospital Center,30 to 49,114,M,Other Race,Unknown,1,Elective,Home w/ Home Health Services,2019,MUS006,OSTEOARTHRITIS,MST007,HIP ARTHROPLASTY,301,HIP JOINT REPLACEMENT,08,DISEASES AND DISORDERS OF THE MUSCULOSKELETAL SYSTEM AND CONNECTIVE TISSUE,1,Minor,Minor,Surgical,Medicaid,,,,,false,34585.88,22985.78
New York City,Manhattan,7002001,001438,Bellevue Hospital Center,70 or Older,100,F,White,Not Span/Hispanic,7,Emergency,Inpatient Rehabilitation Facility,2019,INJ006,"FRACTURE OF THE NECK OF THE FEMUR (HIP), INITIAL ENCOUNTER",MST007,HIP ARTHROPLASTY,301,HIP JOINT REPLACEMENT,08,DISEASES AND DISORDERS OF THE MUSCULOSKELETAL SYSTEM AND CONNECTIVE TISSUE,1,Minor,Minor,Surgical,Medicare,,,,,true,67274.27,44710.48
New York City,Manhattan,7002001,001438,Bellevue Hospital Center,70 or Older,104,F,Other Race,Not Span/Hispanic,7,Elective,Home or Self Care,2019,MUS006,OSTEOARTHRITIS,MST007,HIP ARTHROPLASTY,301,HIP JOINT REPLACEMENT,08,DISEASES AND DISORDERS OF THE MUSCULOSKELETAL SYSTEM AND CONNECTIVE TISSUE,2,Moderate,Minor,Surgical,Self-Pay,,,,,false,95020.36,63150.53
New York City,Manhattan,7002001,001438,Bellevue Hospital Center,70 or Older,104,F,Other Race,Spanish/Hispanic,15,Emergency,Home w/ Home Health Services,2019,INJ006,"FRACTURE OF THE NECK OF THE FEMUR (HIP), INITIAL ENCOUNTER",MST007,HIP ARTHROPLASTY,301,HIP JOINT REPLACEMENT,08,DISEASES AND DISORDERS OF THE MUSCULOSKELETAL SYSTEM AND CONNECTIVE TISSUE,1,Minor,Moderate,Surgical,Medicaid,,,,,true,134852.56,89623.01
New York City,Manhattan,7002001,001438,Bellevue Hospital Center,70 or Older,112,M,Other Race,Spanish/Hispanic,9,Urgent,Skilled Nursing Home,2019,INJ006,"FRACTURE OF THE NECK OF THE FEMUR (HIP), INITIAL ENCOUNTER",MST007,HIP ARTHROPLASTY,301,HIP JOINT REPLACEMENT,08,DISEASES AND DISORDERS OF THE MUSCULOSKELETAL SYSTEM AND CONNECTIVE TISSUE,1,Minor,Moderate,Surgical,Medicare,Medicaid,,,,false,95904.08,63737.85
New York City,Manhattan,7002001,001438,Bellevue Hospital Center,30 to 49,104,F,Black/African American,Not Span/Hispanic,1,Elective,Home w/ Home Health Services,2019,MUS006,OSTEOARTHRITIS,MST007,HIP ARTHROPLASTY,301,HIP JOINT REPLACEMENT,08,DISEASES AND DISORDERS OF THE MUSCULOSKELETAL SYSTEM AND CONNECTIVE TISSUE,1,Minor,Minor,Surgical,Self-Pay,,,,,false,44993.22,29902.49
New York City,Manhattan,7002001,001438,Bellevue Hospital Center,70 or Older,112,M,Other Race,Spanish/Hispanic,4,Emergency,Expired,2019,INJ006,"FRACTURE OF THE NECK OF THE FEMUR (HIP), INITIAL ENCOUNTER",MST007,HIP ARTHROPLASTY,301,HIP JOINT REPLACEMENT,08,DISEASES AND DISORDERS OF THE MUSCULOSKELETAL SYSTEM AND CONNECTIVE TISSUE,4,Extreme,Extreme,Surgical,Medicare,Private Health Insurance,,,,true,107919.15,71723.07
New York City,Manhattan,7002001,001438,Bellevue Hospital Center,30 to 49,113,F,Other Race,Spanish/Hispanic,5,Elective,Home w/ Home Health Services,2019,MUS006,OSTEOARTHRITIS,MST007,HIP ARTHROPLASTY,301,HIP JOINT REPLACEMENT,08,DISEASES AND DISORDERS OF THE MUSCULOSKELETAL SYSTEM AND CONNECTIVE TISSUE,3,Major,Major,Surgical,Medicaid,,,,,false,71502.72,47520.71
New York City,Manhattan,7002001,001438,Bellevue Hospital Center,70 or Older,114,M,Other Race,Spanish/Hispanic,6,Elective,Home or Self Care,2019,MUS006,OSTEOARTHRITIS,MST007,HIP ARTHROPLASTY,301,HIP JOINT REPLACEMENT,08,DISEASES AND DISORDERS OF THE MUSCULOSKELETAL SYSTEM AND CONNECTIVE TISSUE,2,Moderate,Minor,Surgical,Medicare,Medicaid,,,,false,81834.45,54387.18
New York City,Manhattan,7002001,001438,Bellevue Hospital Center,50 to 69,114,M,Other Race,Unknown,3,Elective,Home w/ Home Health Services,2019,MUS006,OSTEOARTHRITIS,MST007,HIP ARTHROPLASTY,301,HIP JOINT REPLACEMENT,08,DISEASES AND DISORDERS OF THE MUSCULOSKELETAL SYSTEM AND CONNECTIVE TISSUE,1,Minor,Minor,Surgical,Medicaid,,,,,false,52784.41,35080.52
New York City,Manhattan,7002001,001438,Bellevue Hospital Center,50 to 69,114,F,Other Race,Not Span/Hispanic,3,Elective,Home w/ Home Health Services,2019,MUS031,TRAUMATIC ARTHROPATHY,MST007,HIP ARTHROPLASTY,301,HIP JOINT REPLACEMENT,08,DISEASES AND DISORDERS OF THE MUSCULOSKELETAL SYSTEM AND CONNECTIVE TISSUE,1,Minor,Minor,Surgical,Private Health Insurance,,,,,false,58784.74,39068.34
New York City,Manhattan,7002001,001438,Bellevue Hospital Center,50 to 69,112,M,Black/African American,Not Span/Hispanic,2,Elective,Home w/ Home Health Services,2019,MUS030,ASEPTIC NECROSIS AND OSTEONECROSIS,MST007,HIP ARTHROPLASTY,301,HIP JOINT REPLACEMENT,08,DISEASES AND DISORDERS OF THE MUSCULOSKELETAL SYSTEM AND CONNECTIVE TISSUE,2,Moderate,Minor,Surgical,Medicare,Medicaid,,,,false,74406.14,49450.32
New York City,Manhattan,7002001,001438,Bellevue Hospital Center,70 or Older,100,M,White,Not Span/Hispanic,1,Elective,Home or Self Care,2019,MUS030,ASEPTIC NECROSIS AND OSTEONECROSIS,MST007,HIP ARTHROPLASTY,301,HIP JOINT REPLACEMENT,08,DISEASES AND DISORDERS OF THE MUSCULOSKELETAL SYSTEM AND CONNECTIVE TISSUE,1,Minor,Minor,Surgical,Medicaid,,,,,false,58831.22,39099.23
New York City,Manhattan,7002001,001438,Bellevue Hospital Center,50 to 69,112,F,Other Race,Spanish/Hispanic,2,Elective,Home or Self Care,2019,MUS003,RHEUMATOID ARTHRITIS AND RELATED DISEASE,MST007,HIP ARTHROPLASTY,301,HIP JOINT REPLACEMENT,08,DISEASES AND DISORDERS OF THE MUSCULOSKELETAL SYSTEM AND CONNECTIVE TISSUE,2,Moderate,Minor,Surgical,Self-Pay,,,,,false,59250.5,39377.88
New York City,Manhattan,7002001,001438,Bellevue Hospital Center,70 or Older,OOS,F,White,Not Span/Hispanic,7,Emergency,Inpatient Rehabilitation Facility,2019,MUS013,OSTEOPOROSIS,MST007,HIP ARTHROPLASTY,301,HIP JOINT REPLACEMENT,08,DISEASES AND DISORDERS OF THE MUSCULOSKELETAL SYSTEM AND CONNECTIVE TISSUE,4,Extreme,Major,Surgical,Medicare,Private Health Insurance,,,,true,88923.37,59098.47
New York City,Manhattan,7002001,001438,Bellevue Hospital Center,30 to 49,113,M,Other Race,Not Span/Hispanic,2,Elective,Home or Self Care,2019,MUS006,OSTEOARTHRITIS,MST007,HIP ARTHROPLASTY,301,HIP JOINT REPLACEMENT,08,DISEASES AND DISORDERS OF THE MUSCULOSKELETAL SYSTEM AND CONNECTIVE TISSUE,1,Minor,Minor,Surgical,Medicaid,,,,,false,52392.58,34820.11
New York City,Manhattan,7002001,001438,Bellevue Hospital Center,50 to 69,114,M,Other Race,Spanish/Hispanic,2,Elective,Home or Self Care,2019,MUS006,OSTEOARTHRITIS,MST007,HIP ARTHROPLASTY,301,HIP JOINT REPLACEMENT,08,DISEASES AND DISORDERS OF THE MUSCULOSKELETAL SYSTEM AND CONNECTIVE TISSUE,2,Moderate,Minor,Surgical,Medicaid,,,,,false,57197.08,38013.18
New York City,Manhattan,7002001,001438,Bellevue Hospital Center,50 to 69,111,F,White,Not Span/Hispanic,2,Emergency,Home or Self Care,2019,INJ035,"COMPLICATION OF INTERNAL ORTHOPEDIC DEVICE OR IMPLANT, INITIAL ENCOUNTER",MST007,HIP ARTHROPLASTY,301,HIP JOINT REPLACEMENT,08,DISEASES AND DISORDERS OF THE MUSCULOSKELETAL SYSTEM AND CONNECTIVE TISSUE,2,Moderate,Minor,Surgical,Miscellaneous/Other,Private Health Insurance,,,,true,60106.32,39946.66
New York City,Manhattan,7002001,001438,Bellevue Hospital Center,30 to 49,113,F,Other Race,Spanish/Hispanic,2,Elective,Home or Self Care,2019,MUS006,OSTEOARTHRITIS,MST007,HIP ARTHROPLASTY,301,HIP JOINT REPLACEMENT,08,DISEASES AND DISORDERS OF THE MUSCULOSKELETAL SYSTEM AND CONNECTIVE TISSUE,1,Minor,Minor,Surgical,Medicaid,,,,,false,53740.39,35715.86
New York City,Manhattan,7002001,001438,Bellevue Hospital Center,50 to 69,100,F,Other Race,Not Span/Hispanic,12,Emergency,Skilled Nursing Home,2019,INJ006,"FRACTURE OF THE NECK OF THE FEMUR (HIP), INITIAL ENCOUNTER",MST007,HIP ARTHROPLASTY,301,HIP JOINT REPLACEMENT,08,DISEASES AND DISORDERS OF THE MUSCULOSKELETAL SYSTEM AND CONNECTIVE TISSUE,2,Moderate,Minor,Surgical,Medicare,Medicaid,,,,true,120422.19,80032.59
New York City,Manhattan,7002001,001438,Bellevue Hospital Center,50 to 69,112,M,Black/African American,Not Span/Hispanic,12,Elective,Inpatient Rehabilitation Facility,2019,INJ035,"COMPLICATION OF INTERNAL ORTHOPEDIC DEVICE OR IMPLANT, INITIAL ENCOUNTER",MST007,HIP ARTHROPLASTY,301,HIP JOINT REPLACEMENT,08,DISEASES AND DISORDERS OF THE MUSCULOSKELETAL SYSTEM AND CONNECTIVE TISSUE,1,Minor,Minor,Surgical,Medicare,,,,,false,115080.45,76482.47
New York City,Manhattan,7002001,001438,Bellevue Hospital Center,50 to 69,112,M,Black/African American,Not Span/Hispanic,1,Elective,Home or Self Care,2019,MUS006,OSTEOARTHRITIS,MST007,HIP ARTHROPLASTY,301,HIP JOINT REPLACEMENT,08,DISEASES AND DISORDERS OF THE MUSCULOSKELETAL SYSTEM AND CONNECTIVE TISSUE,1,Minor,Minor,Surgical,Self-Pay,,,,,false,57829.97,38433.8
New York City,Manhattan,7002001,001438,Bellevue Hospital Center,70 or Older,112,F,Other Race,Not Span/Hispanic,9,Emergency,Home w/ Home Health Services,2019,INJ006,"FRACTURE OF THE NECK OF THE FEMUR (HIP), INITIAL ENCOUNTER",MST007,HIP ARTHROPLASTY,301,HIP JOINT REPLACEMENT,08,DISEASES AND DISORDERS OF THE MUSCULOSKELETAL SYSTEM AND CONNECTIVE TISSUE,2,Moderate,Moderate,Surgical,Medicaid,,,,,true,94057.73,62510.77
New York City,Manhattan,7002001,001438,Bellevue Hospital Center,30 to 49,112,M,Other Race,Spanish/Hispanic,1,Elective,Home or Self Care,2019,MUS006,OSTEOARTHRITIS,MST007,HIP ARTHROPLASTY,301,HIP JOINT REPLACEMENT,08,DISEASES AND DISORDERS OF THE MUSCULOSKELETAL SYSTEM AND CONNECTIVE TISSUE,2,Moderate,Minor,Surgical,Medicaid,,,,,false,38387.08,25512.05
New York City,Manhattan,7002001,001438,Bellevue Hospital Center,50 to 69,,F,Black/African American,Not Span/Hispanic,5,Elective,Home w/ Home Health Services,2019,INJ043,"FRACTURE OF THE NECK OF THE FEMUR (HIP), SUBSEQUENT ENCOUNTER",MST007,HIP ARTHROPLASTY,301,HIP JOINT REPLACEMENT,08,DISEASES AND DISORDERS OF THE MUSCULOSKELETAL SYSTEM AND CONNECTIVE TISSUE,2,Moderate,Minor,Surgical,Medicaid,,,,,false,95165.53,63247.01
New York City,Manhattan,7002001,001438,Bellevue Hospital Center,50 to 69,100,F,Black/African American,Not Span/Hispanic,2,Elective,Inpatient Rehabilitation Facility,2019,MUS006,OSTEOARTHRITIS,MST007,HIP ARTHROPLASTY,301,HIP JOINT REPLACEMENT,08,DISEASES AND DISORDERS OF THE MUSCULOSKELETAL SYSTEM AND CONNECTIVE TISSUE,2,Moderate,Minor,Surgical,Medicaid,,,,,false,47040.24,31262.94
New York City,Manhattan,7002001,001438,Bellevue Hospital Center,30 to 49,113,F,Other Race,Spanish/Hispanic,4,Elective,Home or Self Care,2019,MUS006,OSTEOARTHRITIS,MST007,HIP ARTHROPLASTY,301,HIP JOINT REPLACEMENT,08,DISEASES AND DISORDERS OF THE MUSCULOSKELETAL SYSTEM AND CONNECTIVE TISSUE,1,Minor,Minor,Surgical,Medicaid,,,,,false,75146.75,49942.53
New York City,Manhattan,7002001,001438,Bellevue Hospital Center,30 to 49,111,F,Other Race,Not Span/Hispanic,1,Elective,Home or Self Care,2019,MUS006,OSTEOARTHRITIS,MST007,HIP ARTHROPLASTY,301,HIP JOINT REPLACEMENT,08,DISEASES AND DISORDERS OF THE MUSCULOSKELETAL SYSTEM AND CONNECTIVE TISSUE,2,Moderate,Minor,Surgical,Medicaid,,,,,false,45951.67,30539.48
New York City,Manhattan,7002001,001438,Bellevue Hospital Center,30 to 49,112,M,Other Race,Spanish/Hispanic,2,Elective,Home w/ Home Health Services,2019,MUS006,OSTEOARTHRITIS,MST007,HIP ARTHROPLASTY,301,HIP JOINT REPLACEMENT,08,DISEASES AND DISORDERS OF THE MUSCULOSKELETAL SYSTEM AND CONNECTIVE TISSUE,2,Moderate,Minor,Surgical,Medicaid,,,,,false,55736.04,37042.17
New York City,Manhattan,7002001,001438,Bellevue Hospital Center,50 to 69,100,M,White,Not Span/Hispanic,5,Emergency,Home or Self Care,2019,INJ006,"FRACTURE OF THE NECK OF THE FEMUR (HIP), INITIAL ENCOUNTER",MST007,HIP ARTHROPLASTY,301,HIP JOINT REPLACEMENT,08,DISEASES AND DISORDERS OF THE MUSCULOSKELETAL SYSTEM AND CONNECTIVE TISSUE,1,Minor,Moderate,Surgical,Medicaid,,,,,true,38755.45,25756.87
New York City,Manhattan,7002001,001438,Bellevue Hospital Center,50 to 69,114,F,Black/African American,Not Span/Hispanic,2,Elective,Home w/ Home Health Services,2019,MUS030,ASEPTIC NECROSIS AND OSTEONECROSIS,MST007,HIP ARTHROPLASTY,301,HIP JOINT REPLACEMENT,08,DISEASES AND DISORDERS OF THE MUSCULOSKELETAL SYSTEM AND CONNECTIVE TISSUE,2,Moderate,Minor,Surgical,Medicaid,,,,,false,58073.52,38595.66
New York City,Manhattan,7002001,001438,Bellevue Hospital Center,70 or Older,104,F,Black/African American,Not Span/Hispanic,8,Elective,Home or Self Care,2019,MUS030,ASEPTIC NECROSIS AND OSTEONECROSIS,MST029,"MUSCULOSKELETAL DEVICE PROCEDURES, NEC",301,HIP JOINT REPLACEMENT,08,DISEASES AND DISORDERS OF THE MUSCULOSKELETAL SYSTEM AND CONNECTIVE TISSUE,2,Moderate,Moderate,Surgical,Self-Pay,,,,,false,117100.37,77824.91
New York City,Manhattan,7002001,001438,Bellevue Hospital Center,70 or Older,OOS,M,White,Not Span/Hispanic,11,Emergency,Inpatient Rehabilitation Facility,2019,INJ006,"FRACTURE OF THE NECK OF THE FEMUR (HIP), INITIAL ENCOUNTER",MST007,HIP ARTHROPLASTY,301,HIP JOINT REPLACEMENT,08,DISEASES AND DISORDERS OF THE MUSCULOSKELETAL SYSTEM AND CONNECTIVE TISSUE,1,Minor,Moderate,Surgical,Medicare,,,,,true,112445.66,74731.39
